Opened 9 years ago

Closed 9 years ago

#30191 closed defect (fixed)

kmymoney4 @4.5.96 (kde, finance) Build failed due to namespace and other problems

Reported by: gleirsch@… Owned by: mkae (Marko Käning)
Priority: Normal Milestone:
Component: ports Version: 1.9.2
Keywords: Cc: pixilla (Bradley Giesbrecht), kurtjaeke@…, nerdling (Jeremy Lavergne)
Port: kmymoney

Description

I'm new to macports. As kmymoney is experimental, I assume that the defect I've come across is a real defect. I tried building kmymoney4 twice using port install kmymoney4, all dependencies have been built successfully before.

My system: OS darwin/10.8.0 (Mac OS X 10.6) arch i386

Last section of my build log:

:info:build [ 64%] Building CXX object kmymoney/dialogs/CMakeFiles/dialogs.dir/kpayeereassigndlg.cpp.o:info:build cd /opt/local/var/macports/build/_opt_local_var_macports_sources_rsync.macports.org_release_ports_kde_kmymoney4/work/build/kmymoney/dialogs && /usr/bin/g++-4.2   -DQT_NO_STL -DQT_NO_CAST_TO_ASCII -D_REENTRANT -DKD
E_DEPRECATED_WARNINGS -DKDE4_CMAKE_TOPLEVEL_DIR_LENGTH=113 -DQT_USE_FAST_CONCATENATION -DQT_USE_FAST_OPERATOR_PLUS -DQT_NO_STL -DQT_NO_CAST_TO_ASCII -D_REENTRANT -DKDE_DEPRECATED_WARNINGS -DKDE4_CMAKE_TOPLEVEL_DIR_LENGTH=113 -DHAVE_CONFIG_H -pipe -O2 -arch x86_64  -fno-common -Woverloaded-virtual -fvisibility=hidden -fvisibility-inlines-hidden -fexceptions -UQT_NO_EXCEPTIONS -fexceptions -UQT_NO_EXCEPTIONS -fPIC -fno-common -O2 -DNDEBUG -DQT_NO_D
EBUG -arch x86_64 -isysroot / -mmacosx-version-min=10.6 -I/opt/local/var/macports/build/_opt_local_var_macports_sources_rsync.macports.org_release_ports_kde_kmymoney4/work/build/kmymoney/dialogs -I/opt/local/var/macports/buil
d/_opt_local_var_macports_sources_rsync.macports.org_release_ports_kde_kmymoney4/work/kmymoney-4.5.96/kmymoney/dialogs -I/opt/local/var/macports/build/_opt_local_var_macports_sources_rsync.macports.org_release_ports_kde_kmymo
ney4/work/kmymoney-4.5.96 -I/opt/local/var/macports/build/_opt_local_var_macports_sources_rsync.macports.org_release_ports_kde_kmymoney4/work/build -I/opt/local/var/macports/build/_opt_local_var_macports_sources_rsync.macport
s.org_release_ports_kde_kmymoney4/work/kmymoney-4.5.96/kmymoney -I/opt/local/var/macports/build/_opt_local_var_macports_sources_rsync.macports.org_release_ports_kde_kmymoney4/work/build/kmymoney -I/opt/local/var/macports/buil
d/_opt_local_var_macports_sources_rsync.macports.org_release_ports_kde_kmymoney4/work/kmymoney-4.5.96/kmymoney/widgets -I/opt/local/var/macports/build/_opt_local_var_macports_sources_rsync.macports.org_release_ports_kde_kmymo
ney4/work/build/kmymoney/widgets -I/opt/local/var/macports/build/_opt_local_var_macports_sources_rsync.macports.org_release_ports_kde_kmymoney4/work/kmymoney-4.5.96/kmymoney/mymoney -I/opt/local/var/macports/build/_opt_local_
var_macports_sources_rsync.macports.org_release_ports_kde_kmymoney4/work/kmymoney-4.5.96/kmymoney/mymoney/storage -I/opt/local/var/macports/build/_opt_local_var_macports_sources_rsync.macports.org_release_ports_kde_kmymoney4/work/kmymoney-4.5.96/kmymoney/plugins -I/opt/local/var/macports/build/_opt_local_var_macports_sources_rsync.macports.org_release_ports_kde_kmymoney4/work/kmymoney-4.5.96/kmymoney/views -I/opt/local/var/macports/build/_opt_loc
al_var_macports_sources_rsync.macports.org_release_ports_kde_kmymoney4/work/kmymoney-4.5.96/kmymoney/converter -I/opt/local/var/macports/build/_opt_local_var_macports_sources_rsync.macports.org_release_ports_kde_kmymoney4/wor
k/build/kmymoney/dialogs/settings -I/opt/local/var/macports/build/_opt_local_var_macports_sources_rsync.macports.org_release_ports_kde_kmymoney4/work/build/kmymoney/mymoney/storage -I/opt/local/var/macports/build/_opt_local_v
ar_macports_sources_rsync.macports.org_release_ports_kde_kmymoney4/work/kmymoney-4.5.96/kmymoney/reports -I/opt/local/var/macports/build/_opt_local_var_macports_sources_rsync.macports.org_release_ports_kde_kmymoney4/work/kmymoney-4.5.96/kmymoney/wizards/endingbalancedlg -I/opt/local/var/macports/build/_opt_local_var_macports_sources_rsync.macports.org_release_ports_kde_kmymoney4/work/build/kmymoney/wizards/endingbalancedlg -I/opt/local/var/macpor
ts/build/_opt_local_var_macports_sources_rsync.macports.org_release_ports_kde_kmymoney4/work/kmymoney-4.5.96/kmymoney/wizards/newinvestmentwizard -I/opt/local/var/macports/build/_opt_local_var_macports_sources_rsync.macports.
org_release_ports_kde_kmymoney4/work/build/kmymoney/wizards/newinvestmentwizard -I/opt/local/var/macports/build/_opt_local_var_macports_sources_rsync.macports.org_release_ports_kde_kmymoney4/work/kmymoney-4.5.96/kmymoney/wiza
rds/newloanwizard -I/opt/local/var/macports/build/_opt_local_var_macports_sources_rsync.macports.org_release_ports_kde_kmymoney4/work/build/kmymoney/wizards/newloanwizard -I/opt/local/var/macports/build/_opt_local_var_macport
s_sources_rsync.macports.org_release_ports_kde_kmymoney4/work/kmymoney-4.5.96/kmymoney/wizards/wizardpages -I/opt/local/var/macports/build/_opt_local_var_macports_sources_rsync.macports.org_release_ports_kde_kmymoney4/work/km
ymoney-4.5.96/kmymoney/models -I/opt/local/var/macports/build/_opt_local_var_macports_sources_rsync.macports.org_release_ports_kde_kmymoney4/work/build/kmymoney/models -I/opt/local/var/macports/build/_opt_local_var_macports_s
ources_rsync.macports.org_release_ports_kde_kmymoney4/work/kmymoney-4.5.96/libkgpgfile -I/opt/local/var/macports/build/_opt_local_var_macports_sources_rsync.macports.org_release_ports_kde_kmymoney4/work/kmymoney-4.5.96/libkdc
hart/include -I/opt/local/include/KDE -I/opt/local/include/phonon -I/opt/local/include/QtXmlPatterns -I/opt/local/include/QtXml -I/opt/local/include/QtWebKit -I/opt/local/include/QtUiTools -I/opt/local/include/QtTest -I/opt/local/include/QtSvg -I/opt/local/include/QtSql -I/opt/local/include/QtScriptTools -I/opt/local/include/QtScript -I/opt/local/include/QtOpenGL -I/opt/local/include/QtNetwork -I/opt/local/include/QtMultimedia -I/opt/local/includ
e/QtHelp -I/opt/local/include/QtDesigner -I/opt/local/include/QtDeclarative -I/opt/local/include/QtDBus -I/opt/local/include/Qt3Support -I/opt/local/include/QtGui -I/opt/local/include/QtCore -I/opt/local/share/qt4/mkspecs/def
ault   -D__APPLE_KDE__  -D__APPLE_KDE__  -o CMakeFiles/dialogs.dir/kpayeereassigndlg.cpp.o -c /opt/local/var/macports/build/_opt_local_var_macports_sources_rsync.macports.org_release_ports_kde_kmymoney4/work/kmymoney-4.5.96/k
mymoney/dialogs/kpayeereassigndlg.cpp
:info:build /opt/local/var/macports/build/_opt_local_var_macports_sources_rsync.macports.org_release_ports_kde_kmymoney4/work/kmymoney-4.5.96/kmymoney/dialogs/knewfiledlg.cpp: In member function 'void KNewFileDlg::init(const 
QString&)':
:info:build /opt/local/var/macports/build/_opt_local_var_macports_sources_rsync.macports.org_release_ports_kde_kmymoney4/work/kmymoney-4.5.96/kmymoney/dialogs/knewfiledlg.cpp:82: error: 'KABC' has not been declared
:info:build /opt/local/var/macports/build/_opt_local_var_macports_sources_rsync.macports.org_release_ports_kde_kmymoney4/work/kmymoney-4.5.96/kmymoney/dialogs/knewfiledlg.cpp:82: error: 'ab' was not declared in this scope
:info:build /opt/local/var/macports/build/_opt_local_var_macports_sources_rsync.macports.org_release_ports_kde_kmymoney4/work/kmymoney-4.5.96/kmymoney/dialogs/knewfiledlg.cpp:82: error: expected type-specifier before 'KABC'
:info:build /opt/local/var/macports/build/_opt_local_var_macports_sources_rsync.macports.org_release_ports_kde_kmymoney4/work/kmymoney-4.5.96/kmymoney/dialogs/knewfiledlg.cpp:82: error: expected `>' before 'KABC'
:info:build /opt/local/var/macports/build/_opt_local_var_macports_sources_rsync.macports.org_release_ports_kde_kmymoney4/work/kmymoney-4.5.96/kmymoney/dialogs/knewfiledlg.cpp:82: error: expected `(' before 'KABC'
:info:build /opt/local/var/macports/build/_opt_local_var_macports_sources_rsync.macports.org_release_ports_kde_kmymoney4/work/kmymoney-4.5.96/kmymoney/dialogs/knewfiledlg.cpp:82: error: 'KABC' has not been declared
:info:build /opt/local/var/macports/build/_opt_local_var_macports_sources_rsync.macports.org_release_ports_kde_kmymoney4/work/kmymoney-4.5.96/kmymoney/dialogs/knewfiledlg.cpp:82: error: expected primary-expression before '>' 
token
:info:build /opt/local/var/macports/build/_opt_local_var_macports_sources_rsync.macports.org_release_ports_kde_kmymoney4/work/kmymoney-4.5.96/kmymoney/dialogs/knewfiledlg.cpp:83: error: 'KABC' has not been declared
:info:build /opt/local/var/macports/build/_opt_local_var_macports_sources_rsync.macports.org_release_ports_kde_kmymoney4/work/kmymoney-4.5.96/kmymoney/dialogs/knewfiledlg.cpp:83: error: expected `)' before ';' token
:info:build /opt/local/var/macports/build/_opt_local_var_macports_sources_rsync.macports.org_release_ports_kde_kmymoney4/work/kmymoney-4.5.96/kmymoney/dialogs/knewfiledlg.cpp: In member function 'void KNewFileDlg::loadFromKAB
C()':
:info:build /opt/local/var/macports/build/_opt_local_var_macports_sources_rsync.macports.org_release_ports_kde_kmymoney4/work/kmymoney-4.5.96/kmymoney/dialogs/knewfiledlg.cpp:117: error: 'KABC' has not been declared
:info:build /opt/local/var/macports/build/_opt_local_var_macports_sources_rsync.macports.org_release_ports_kde_kmymoney4/work/kmymoney-4.5.96/kmymoney/dialogs/knewfiledlg.cpp:117: error: 'ab' was not declared in this scope
:info:build /opt/local/var/macports/build/_opt_local_var_macports_sources_rsync.macports.org_release_ports_kde_kmymoney4/work/kmymoney-4.5.96/kmymoney/dialogs/knewfiledlg.cpp:117: error: expected type-specifier before 'KABC':info:build /opt/local/var/macports/build/_opt_local_var_macports_sources_rsync.macports.org_release_ports_kde_kmymoney4/work/kmymoney-4.5.96/kmymoney/dialogs/knewfiledlg.cpp:117: error: expected `>' before 'KABC'
:info:build /opt/local/var/macports/build/_opt_local_var_macports_sources_rsync.macports.org_release_ports_kde_kmymoney4/work/kmymoney-4.5.96/kmymoney/dialogs/knewfiledlg.cpp:117: error: expected `(' before 'KABC'
:info:build /opt/local/var/macports/build/_opt_local_var_macports_sources_rsync.macports.org_release_ports_kde_kmymoney4/work/kmymoney-4.5.96/kmymoney/dialogs/knewfiledlg.cpp:117: error: 'KABC' has not been declared
:info:build /opt/local/var/macports/build/_opt_local_var_macports_sources_rsync.macports.org_release_ports_kde_kmymoney4/work/kmymoney-4.5.96/kmymoney/dialogs/knewfiledlg.cpp:117: error: expected primary-expression before '>'
 token
:info:build /opt/local/var/macports/build/_opt_local_var_macports_sources_rsync.macports.org_release_ports_kde_kmymoney4/work/kmymoney-4.5.96/kmymoney/dialogs/knewfiledlg.cpp:118: error: 'KABC' has not been declared
:info:build /opt/local/var/macports/build/_opt_local_var_macports_sources_rsync.macports.org_release_ports_kde_kmymoney4/work/kmymoney-4.5.96/kmymoney/dialogs/knewfiledlg.cpp:118: error: expected `)' before ';' token
:info:build /opt/local/var/macports/build/_opt_local_var_macports_sources_rsync.macports.org_release_ports_kde_kmymoney4/work/kmymoney-4.5.96/kmymoney/dialogs/knewfiledlg.cpp:122: error: 'KABC' has not been declared
:info:build /opt/local/var/macports/build/_opt_local_var_macports_sources_rsync.macports.org_release_ports_kde_kmymoney4/work/kmymoney-4.5.96/kmymoney/dialogs/knewfiledlg.cpp:122: error: expected `;' before 'addr'
:info:build /opt/local/var/macports/build/_opt_local_var_macports_sources_rsync.macports.org_release_ports_kde_kmymoney4/work/kmymoney-4.5.96/kmymoney/dialogs/knewfiledlg.cpp:123: error: 'addr' was not declared in this scope
:info:build /opt/local/var/macports/build/_opt_local_var_macports_sources_rsync.macports.org_release_ports_kde_kmymoney4/work/kmymoney-4.5.96/kmymoney/dialogs/knewfiledlg.cpp:128: error: 'addr' was not declared in this scope
:info:build /opt/local/var/macports/build/_opt_local_var_macports_sources_rsync.macports.org_release_ports_kde_kmymoney4/work/kmymoney-4.5.96/kmymoney/dialogs/knewfiledlg.cpp:131: error: 'KABC' has not been declared
:info:build /opt/local/var/macports/build/_opt_local_var_macports_sources_rsync.macports.org_release_ports_kde_kmymoney4/work/kmymoney-4.5.96/kmymoney/dialogs/knewfiledlg.cpp:131: error: expected `;' before 'phone'
:info:build /opt/local/var/macports/build/_opt_local_var_macports_sources_rsync.macports.org_release_ports_kde_kmymoney4/work/kmymoney-4.5.96/kmymoney/dialogs/knewfiledlg.cpp:135: error: 'a' was not declared in this scope
:info:build make[2]: *** [kmymoney/dialogs/CMakeFiles/dialogs.dir/knewfiledlg.cpp.o] Error 1
:info:build make[2]: *** Waiting for unfinished jobs....
:info:build In file included from /opt/local/var/macports/build/_opt_local_var_macports_sources_rsync.macports.org_release_ports_kde_kmymoney4/work/kmymoney-4.5.96/kmymoney/widgets/kmymoneymvccombo.h:40,
:info:build                  from /opt/local/var/macports/build/_opt_local_var_macports_sources_rsync.macports.org_release_ports_kde_kmymoney4/work/build/kmymoney/dialogs/ui_kpayeereassigndlgdecl.h:29,
:info:build                  from /opt/local/var/macports/build/_opt_local_var_macports_sources_rsync.macports.org_release_ports_kde_kmymoney4/work/kmymoney-4.5.96/kmymoney/dialogs/kpayeereassigndlg.h:33,
:info:build                  from /opt/local/var/macports/build/_opt_local_var_macports_sources_rsync.macports.org_release_ports_kde_kmymoney4/work/kmymoney-4.5.96/kmymoney/dialogs/kpayeereassigndlg.cpp:18:
:info:build /opt/local/include/QtGui/qtableview.h:173: warning: 'virtual void QTableView::selectionChanged(const QItemSelection&, const QItemSelection&)' was hidden
:info:build /opt/local/var/macports/build/_opt_local_var_macports_sources_rsync.macports.org_release_ports_kde_kmymoney4/work/kmymoney-4.5.96/kmymoney/widgets/register.h:568: warning:   by 'KMyMoneyRegister::Register::selectionChanged'
:info:build make[1]: *** [kmymoney/dialogs/CMakeFiles/dialogs.dir/all] Error 2
:info:build make: *** [all] Error 2
:info:build shell command " cd "/opt/local/var/macports/build/_opt_local_var_macports_sources_rsync.macports.org_release_ports_kde_kmymoney4/work/build" && /usr/bin/make -j4 all " returned error 2
:error:build Target org.macports.build returned: shell command failed (see log for details)
:debug:build Backtrace: shell command failed (see log for details)
    while executing
"command_exec build"
    (procedure "portbuild::build_main" line 8)
    invoked from within
"$procedure $targetname"
:info:build Warning: the following items did not execute (for kmymoney4): org.macports.activate org.macports.build org.macports.destroot org.macports.install
:notice:build Log for kmymoney4 is at: /opt/local/var/macports/logs/_opt_local_var_macports_sources_rsync.macports.org_release_ports_kde_kmymoney4/main.log

Change History (30)

comment:1 Changed 9 years ago by jmroot (Joshua Root)

Cc: pixilla@… added
Owner: changed from macports-tickets@… to mk@…

Please remember to cc the maintainers.

comment:2 Changed 9 years ago by mkae (Marko Käning)

I haven't seen this on my system yet.

Please try to build kmymoney4-devel instead and let us know whether that shows the same symptoms!

comment:3 Changed 9 years ago by mkae (Marko Käning)

Cristian Onet wrote on KMyMoney's developer mailing list:

It seems to me that libkabc (KAddresbook library) is missing but I'm
not sure why the compiler did not signaled the missing includes:

#include <kabc/addressee.h>
#include <kabc/stdaddressbook.h>

Regards,
Cristian

So, perhaps you check in your system whether libkabc is correctly installed. (It should be though!)

comment:4 Changed 9 years ago by mkae (Marko Käning)

Cristian pointed out that KAddressbook is part of kdepimlibs4.

Check out

port contents kdepimlibs4 | grep include/kabc

comment:5 Changed 9 years ago by mkae (Marko Käning)

Hey, after updating my kdelibs4 to version 4.6.5 I DO HAVE the same issue over here, also with kmymoney4-devel. Hang on, I'll try to figure out what's wrong here.

comment:6 Changed 9 years ago by mkae (Marko Käning)

OK, KAddressbook has obviously disappeared from this port:

$ port contents kdepimlibs4 | grep include/kabc
$

I hadn't noticed this unfortunately.

comment:7 Changed 9 years ago by mkae (Marko Käning)

OK, I've detected that recent changes made to kdepimlibs4 (see issue #30144) are responsible for this. A solution is still pending. Sorry for that, please stay patient.

comment:8 Changed 9 years ago by gleirsch@…

Hi, thanks for the hints and for treatment of the problem. I'll wait so long.

comment:9 Changed 9 years ago by kurtjaeke@…

Please see report #30068, where a too easy fix was the root cause for this to happen. Applying the fixes I attached to #30068 made kmymoney work again for me.

comment:10 Changed 9 years ago by kurtjaeke@…

Cc: kurtjaeke@… added

Cc Me!

comment:11 Changed 9 years ago by kurtjaeke@…

See #30147

comment:12 Changed 9 years ago by gleirsch@…

Due to build failure of soprano @2.6.51, Revision 1 (devel), kmymoney is still not build-/usable for me. I updated macports as well as my port set before trying this. Cleaning and rebuilding didn't help.

comment:13 in reply to:  12 Changed 9 years ago by gleirsch@…

Replying to gleirsch@…:

Due to build failure of soprano @2.6.51, Revision 1 (devel), kmymoney is still not build-/usable for me. I updated macports as well as my port set before trying this. Cleaning and rebuilding didn't help.

I meant kmymoney4 of course.

comment:14 Changed 9 years ago by mkae (Marko Käning)

I can verify gleirsch's findings: building kmymoney4-devel fails due to a still un-patched kdepimlibs4, see issue #30144! (First half of patch http://trac.macports.org/attachment/ticket/30144/patch-kdelibs4-kdepimlibs4.diff is still missing!)

pixilla, I guess committing the 1st half of your above patch should be fine now, right? Will you do that?

comment:15 in reply to:  14 ; Changed 9 years ago by mkae (Marko Käning)

Replying to mk@…:

pixilla, I guess committing the 1st half of your above patch should be fine now, right? Will you do that?

Revbumping kdepimlibs4 would be required in this case.

comment:16 in reply to:  15 ; Changed 9 years ago by pixilla (Bradley Giesbrecht)

Replying to mk@…:

pixilla, I guess committing the 1st half of your above patch should be fine now, right? Will you do that?

Installing the headers was added to the kdelibs4 port here r80926.

Revbumping kdepimlibs4 would be required in this case.

Not sure. If kdepimlibs4 version 4.6.4 has always failed to build then a revbump would not be required.

comment:17 in reply to:  16 ; Changed 9 years ago by mkae (Marko Käning)

Replying to pixilla@…:

Not sure. If kdepimlibs4 version 4.6.4 has always failed to build then a revbump would not be required.

4.6.4 never failed. only 4.6.5 started failing

comment:18 in reply to:  16 Changed 9 years ago by mkae (Marko Käning)

Replying to pixilla@…:

Installing the headers was added to the kdelibs4 port here r80926.

What is missing up to now is the removal of the

configure.args-append   -DKDEPIM_ONLY_KLEO=ON 

option, if I am not mistaken. That's what I meant with the first half of the patch.

comment:19 in reply to:  17 Changed 9 years ago by pixilla (Bradley Giesbrecht)

Replying to mk@…:

Replying to pixilla@…:

Not sure. If kdepimlibs4 version 4.6.4 has always failed to build then a revbump would not be required.

4.6.4 never failed. only 4.6.5 started failing

Ya, I meant 4.6.5.

comment:20 Changed 9 years ago by pixilla (Bradley Giesbrecht)

Replying to mk@…:

Replying to pixilla@…:

Installing the headers was added to the kdelibs4 port here r80926.

What is missing up to now is the removal of the

configure.args-append   -DKDEPIM_ONLY_KLEO=ON 

option, if I am not mistaken. That's what I meant with the first half of the patch.

Ah right, that part of the patch was not committed and that change WOULD require a kdepimlibs4 revbump.
I am not a maintainer of kdepimlibs4 nor is the port openmaintainer. Jeremy (snc) has been helpful, let's ask him to commit and revbump the kdepimlibs4.

comment:21 Changed 9 years ago by mkae (Marko Käning)

I thought that he already gave his blessings to the patch. But you are right, he should do the commit.

comment:22 Changed 9 years ago by nerdling (Jeremy Lavergne)

Removing that -DKDEPIM_ONLY_KLEO won't matter until we can fix the problem with soprano/raptor/redland. It will result in a build failure, which is why I put it in there to begin with.

-- Could NOT find Nepomuk  (missing:  NEPOMUK_LIBRARIES SOPRANO_PLUGIN_RAPTORPARSER_FOUND SOPRANO_PLUGIN_REDLANDBACKEND_FOUND) 

Still going through to figure out which one specifically is wrong (should be in the Cache).

comment:23 Changed 9 years ago by mkae (Marko Käning)

Oops, snc, it still can't find Nepomuk for you? I thought that this was fixed by now... Let's see what Brad says. (I've to stop now. Was busy enough getting qt3 back to work again tonight.)

comment:24 Changed 9 years ago by nerdling (Jeremy Lavergne)

So nepomuk headers are installed/found, but the libraries aren't in sight.

comment:25 Changed 9 years ago by nerdling (Jeremy Lavergne)

Yea, using the trunk of soprano likely fixes this:

-- Could NOT find Soprano  (missing:  SOPRANO_PLUGIN_RAPTORPARSER_FOUND SOPRANO_PLUGIN_REDLANDBACKEND_FOUND)  (Required is at least version "2.5.60")

which fixes Nepomuk. Chain reaction after we get soprano fixed.

comment:26 Changed 9 years ago by nerdling (Jeremy Lavergne)

Cc: snc@… added

Cc Me!

comment:27 Changed 9 years ago by gleirsch@…

Kmymoney4 port now installable for me. Thanks for fixing this intricate issue.

comment:28 Changed 9 years ago by mkae (Marko Käning)

Hey, that's great news, gleirsch!

I started building a MacPorts installation from scratch... If I also succeed building KMM successfully I think we can close this issue.

comment:29 Changed 9 years ago by pixilla (Bradley Giesbrecht)

gleirsch: great to hear!

comment:30 Changed 9 years ago by mkae (Marko Käning)

Resolution: fixed
Status: newclosed

Heya, herewith I verify that kmymoney4(-devel) again do build with Brad's latest updates to soprano/raptor/redland/kdelibs4/kdepimlibs4... Thanks so much for all your efforts and time spent on this subject, Brad!!!

Note: See TracTickets for help on using tickets.