Opened 8 years ago

Closed 8 years ago

#33336 closed defect (fixed)

flickcurl 1.21 (devel) Build error

Reported by: khampton6@… Owned by: aecollins1@…
Priority: Normal Milestone:
Component: ports Version: 2.0.3
Keywords: Cc:
Port: flickcurl

Description (last modified by ryandesign (Ryan Schmidt))

Log for flickcurl is at: /opt/local/var/macports/logs/_opt_local_var_macports_sources_rsync.macports.org_release_tarballs_ports_devel_flickcurl/flickcurl/main.log

Contents of log:

:debug:build Environment: CPATH='/opt/local/include' CC_PRINT_OPTIONS_FILE='/opt/local/var/macports/build/_opt_local_var_macports_sources_rsync.macports.org_release_tarballs_ports_devel_flickcurl/flickcurl/work/.CC_PRINT_OPTIONS' LIBRARY_PATH='/opt/local/lib' CC_PRINT_OPTIONS='YES' MACOSX_DEPLOYMENT_TARGET='10.7'
:debug:build Assembled command: 'cd "/opt/local/var/macports/build/_opt_local_var_macports_sources_rsync.macports.org_release_tarballs_ports_devel_flickcurl/flickcurl/work/flickcurl-1.21" && /usr/bin/make -j5 -w all'
:debug:build Executing command line:  cd "/opt/local/var/macports/build/_opt_local_var_macports_sources_rsync.macports.org_release_tarballs_ports_devel_flickcurl/flickcurl/work/flickcurl-1.21" && /usr/bin/make -j5 -w all 
:info:build make: Entering directory `/opt/local/var/macports/build/_opt_local_var_macports_sources_rsync.macports.org_release_tarballs_ports_devel_flickcurl/flickcurl/work/flickcurl-1.21'
:info:build Making all in src
:info:build make[1]: Entering directory `/opt/local/var/macports/build/_opt_local_var_macports_sources_rsync.macports.org_release_tarballs_ports_devel_flickcurl/flickcurl/work/flickcurl-1.21/src'
:info:build /usr/bin/make  all-am
:info:build make[2]: Entering directory `/opt/local/var/macports/build/_opt_local_var_macports_sources_rsync.macports.org_release_tarballs_ports_devel_flickcurl/flickcurl/work/flickcurl-1.21/src'
:info:build make[2]: Nothing to be done for `all-am'.
:info:build make[2]: Leaving directory `/opt/local/var/macports/build/_opt_local_var_macports_sources_rsync.macports.org_release_tarballs_ports_devel_flickcurl/flickcurl/work/flickcurl-1.21/src'
:info:build make[1]: Leaving directory `/opt/local/var/macports/build/_opt_local_var_macports_sources_rsync.macports.org_release_tarballs_ports_devel_flickcurl/flickcurl/work/flickcurl-1.21/src'
:info:build Making all in utils
:info:build make[1]: Entering directory `/opt/local/var/macports/build/_opt_local_var_macports_sources_rsync.macports.org_release_tarballs_ports_devel_flickcurl/flickcurl/work/flickcurl-1.21/utils'
:info:build /bin/sh ../libtool  --tag=CC   --mode=link /Developer/usr/bin/clang -I/opt/local/include/raptor2   -I/opt/local/include   -I/opt/local/include/libxml2   -pipe -O2 -arch x86_64  -L/opt/local/lib -arch x86_64 -o flickrdf flickrdf-flickrdf.o   ../src/libflickcurl.la -L/opt/local/lib -lraptor2   -L/opt/local/lib -lxml2   -L/opt/local/lib -lcurl   -L/opt/local/lib -lraptor2  
:info:build libtool: link: /Developer/usr/bin/clang -I/opt/local/include/raptor2 -I/opt/local/include -I/opt/local/include/libxml2 -pipe -O2 -arch x86_64 -arch x86_64 -o .libs/flickrdf flickrdf-flickrdf.o  -L/opt/local/lib ../src/.libs/libflickcurl.dylib /opt/local/lib/libraptor2.dylib /opt/local/lib/libcurl.dylib /opt/local/lib/libidn.dylib /opt/local/lib/libintl.dylib -lc -lssl -lcrypto /opt/local/lib/libxslt.dylib /opt/local/lib/libxml2.dylib -lz -lpthread /opt/local/lib/libiconv.dylib -lm
:info:build Undefined symbols for architecture x86_64:
:info:build   "_raptor_init", referenced from:
:info:build       _main in flickrdf-flickrdf.o
:info:build   "_raptor_serializer_syntax_name_check", referenced from:
:info:build       _main in flickrdf-flickrdf.o
:info:build   "_raptor_serializers_enumerate", referenced from:
:info:build       _main in flickrdf-flickrdf.o
:info:build   "_raptor_serialize_start_to_file_handle", referenced from:
:info:build       _main in flickrdf-flickrdf.o
:info:build   "_raptor_finish", referenced from:
:info:build       _main in flickrdf-flickrdf.o
:info:build   "_raptor_serialize_set_namespace", referenced from:
:info:build       _ser_emit_namespace in flickrdf-flickrdf.o
:info:build   "_raptor_serialize_statement", referenced from:
:info:build       _ser_emit_triple in flickrdf-flickrdf.o
:info:build   "_raptor_serialize_end", referenced from:
:info:build       _ser_emit_finish in flickrdf-flickrdf.o
:info:build ld: symbol(s) not found for architecture x86_64
:info:build clang: error: linker command failed with exit code 1 (use -v to see invocation)
:info:build make[1]: *** [flickrdf] Error 1
:info:build make[1]: Leaving directory `/opt/local/var/macports/build/_opt_local_var_macports_sources_rsync.macports.org_release_tarballs_ports_devel_flickcurl/flickcurl/work/flickcurl-1.21/utils'
:info:build make: *** [all-recursive] Error 1
:info:build make: Leaving directory `/opt/local/var/macports/build/_opt_local_var_macports_sources_rsync.macports.org_release_tarballs_ports_devel_flickcurl/flickcurl/work/flickcurl-1.21'
:info:build shell command " cd "/opt/local/var/macports/build/_opt_local_var_macports_sources_rsync.macports.org_release_tarballs_ports_devel_flickcurl/flickcurl/work/flickcurl-1.21" && /usr/bin/make -j5 -w all " returned error 2
:error:build Target org.macports.build returned: shell command failed (see log for details)
:debug:build Backtrace: shell command failed (see log for details)
    while executing
"command_exec build"
    (procedure "portbuild::build_main" line 8)
    invoked from within
"$procedure $targetname"
:info:build Warning: the following items did not execute (for flickcurl): org.macports.activate org.macports.build org.macports.destroot org.macports.install
:notice:build Log for flickcurl is at: /opt/local/var/macports/logs/_opt_local_var_macports_sources_rsync.macports.org_release_tarballs_ports_devel_flickcurl/flickcurl/main.log

I have raptor and raptor 2 installed, but I get build errors when trying to install flickcurl. How could I fix this issue.

Thanks

Change History (3)

comment:1 Changed 8 years ago by ryandesign (Ryan Schmidt)

Description: modified (diff)
Keywords: flickcurl build removed
Owner: changed from macports-tickets@… to aecollins1@…

Remember to use WikiFormatting please and to Cc the maintainer of the affected port.

comment:2 Changed 8 years ago by aecollins1@…

Status: newassigned

For now, please uninstall raptor, and reinstall flickcurl with only raptor2 installed. This will fix it. In the meantime, I will investigate the conflict further.

comment:3 Changed 8 years ago by aecollins1@…

Resolution: fixed
Status: assignedclosed

This should now be fixed with the version bump (now 1.22) in r90146.

Note: See TracTickets for help on using tickets.