Opened 7 years ago

Closed 7 years ago

#38129 closed defect (fixed)

sylpheed @2.2.3: build failure due to glib headers

Reported by: ogexbsd@… Owned by: ryandesign (Ryan Schmidt)
Priority: Normal Milestone:
Component: ports Version: 2.1.3
Keywords: Cc:
Port: sylpheed

Description (last modified by larryv (Lawrence Velázquez))

debug:main Skipping completed org.macports.archivefetch (sylpheed)
:debug:main Privilege de-escalation not attempted as not running as root.
:debug:main Skipping completed org.macports.fetch (sylpheed)
:debug:main Privilege de-escalation not attempted as not running as root.
:debug:main Skipping completed org.macports.checksum (sylpheed)
:debug:main Privilege de-escalation not attempted as not running as root.
:debug:main Skipping completed org.macports.extract (sylpheed)
:debug:main Privilege de-escalation not attempted as not running as root.
:debug:main Skipping completed org.macports.patch (sylpheed)
:debug:main Privilege de-escalation not attempted as not running as root.
:debug:main Skipping completed org.macports.configure (sylpheed)
:debug:main Privilege de-escalation not attempted as not running as root.
:debug:build build phase started at Wed Feb 20 11:33:47 WIT 2013
:notice:build --->  Building sylpheed
:debug:build Executing org.macports.build (sylpheed)
:debug:build Environment: CPATH='/opt/local/include' CC_PRINT_OPTIONS_FILE='/opt/local/var/macports/build/_opt_local_var_macports_sources_rsync.macports.org_release_tarballs_ports_mail_sylpheed/sylpheed/work/.CC_PRINT_OPTIONS' LIBRARY_PATH='/opt/local/lib' CC_PRINT_OPTIONS='YES' MACOSX_DEPLOYMENT_TARGET='10.8'
:debug:build Assembled command: 'cd "/opt/local/var/macports/build/_opt_local_var_macports_sources_rsync.macports.org_release_tarballs_ports_mail_sylpheed/sylpheed/work/sylpheed-2.2.3" && /usr/bin/make -j2 -w all'
:debug:build Executing command line:  cd "/opt/local/var/macports/build/_opt_local_var_macports_sources_rsync.macports.org_release_tarballs_ports_mail_sylpheed/sylpheed/work/sylpheed-2.2.3" && /usr/bin/make -j2 -w all 
:info:build make: Entering directory `/opt/local/var/macports/build/_opt_local_var_macports_sources_rsync.macports.org_release_tarballs_ports_mail_sylpheed/sylpheed/work/sylpheed-2.2.3'
:info:build /usr/bin/make  all-recursive
:info:build make[1]: Entering directory `/opt/local/var/macports/build/_opt_local_var_macports_sources_rsync.macports.org_release_tarballs_ports_mail_sylpheed/sylpheed/work/sylpheed-2.2.3'
:info:build Making all in ac
:info:build make[2]: Entering directory `/opt/local/var/macports/build/_opt_local_var_macports_sources_rsync.macports.org_release_tarballs_ports_mail_sylpheed/sylpheed/work/sylpheed-2.2.3/ac'
:info:build make[2]: Nothing to be done for `all'.
:info:build make[2]: Leaving directory `/opt/local/var/macports/build/_opt_local_var_macports_sources_rsync.macports.org_release_tarballs_ports_mail_sylpheed/sylpheed/work/sylpheed-2.2.3/ac'
:info:build Making all in libsylph
:info:build make[2]: Entering directory `/opt/local/var/macports/build/_opt_local_var_macports_sources_rsync.macports.org_release_tarballs_ports_mail_sylpheed/sylpheed/work/sylpheed-2.2.3/libsylph'
:info:build /bin/sh ../libtool --mode=compile /usr/bin/clang -DHAVE_CONFIG_H -I. -I. -I.. -I/opt/local/include/glib-2.0 -I/opt/local/lib/glib-2.0/include -I/opt/local/include   -I.. -I/opt/local/include -DG_LOG_DOMAIN=\"LibSylph\" 	-DSYSCONFDIR=\""/opt/local/etc"\" -I/opt/local/include  -pipe -O3  -fstrict-aliasing  -funroll-loops  -pipe  -bind_at_load  -multiply_defined suppress -arch x86_64 -no-cpp-precomp -fno-common -c account.c
:info:build /bin/sh ../libtool --mode=compile /usr/bin/clang -DHAVE_CONFIG_H -I. -I. -I.. -I/opt/local/include/glib-2.0 -I/opt/local/lib/glib-2.0/include -I/opt/local/include   -I.. -I/opt/local/include -DG_LOG_DOMAIN=\"LibSylph\" 	-DSYSCONFDIR=\""/opt/local/etc"\" -I/opt/local/include  -pipe -O3  -fstrict-aliasing  -funroll-loops  -pipe  -bind_at_load  -multiply_defined suppress -arch x86_64 -no-cpp-precomp -fno-common -c codeconv.c
:info:build  /usr/bin/clang -DHAVE_CONFIG_H -I. -I. -I.. -I/opt/local/include/glib-2.0 -I/opt/local/lib/glib-2.0/include -I/opt/local/include -I.. -I/opt/local/include -DG_LOG_DOMAIN=\"LibSylph\" -DSYSCONFDIR=\"/opt/local/etc\" -I/opt/local/include -pipe -O3 -fstrict-aliasing -funroll-loops -pipe -bind_at_load -multiply_defined suppress -arch x86_64 -no-cpp-precomp -fno-common -c codeconv.c  -fno-common -DPIC -o .libs/codeconv.o
:info:build clang: warning: argument unused during compilation: '-bind_at_load'
:info:build clang: warning: argument unused during compilation: '-multiply_defined suppress'
:info:build In file included from codeconv.c:24:
:info:build In file included from ./defs.h:27:
:info:build In file included from /opt/local/lib/glib-2.0/include/glibconfig.h:9:
:info:build /opt/local/include/glib-2.0/glib/gmacros.h:32:2: error: "Only <glib.h> can be included directly."
:info:build #error "Only <glib.h> can be included directly."
:info:build  ^
:info:build  /usr/bin/clang -DHAVE_CONFIG_H -I. -I. -I.. -I/opt/local/include/glib-2.0 -I/opt/local/lib/glib-2.0/include -I/opt/local/include -I.. -I/opt/local/include -DG_LOG_DOMAIN=\"LibSylph\" -DSYSCONFDIR=\"/opt/local/etc\" -I/opt/local/include -pipe -O3 -fstrict-aliasing -funroll-loops -pipe -bind_at_load -multiply_defined suppress -arch x86_64 -no-cpp-precomp -fno-common -c account.c  -fno-common -DPIC -o .libs/account.o
:info:build clang: warning: argument unused during compilation: '-bind_at_load'
:info:build clang: warning: argument unused during compilation: '-multiply_defined suppress'
:info:build In file included from account.c:24:
:info:build In file included from ./defs.h:27:
:info:build In file included from /opt/local/lib/glib-2.0/include/glibconfig.h:9:
:info:build /opt/local/include/glib-2.0/glib/gmacros.h:32:2: error: "Only <glib.h> can be included directly."
:info:build #error "Only <glib.h> can be included directly."
:info:build  ^
:info:build 1 error generated.
:info:build make[2]: *** [account.lo] Error 1
:info:build make[2]: *** Waiting for unfinished jobs....
:info:build 1 error generated.
:info:build make[2]: *** [codeconv.lo] Error 1
:info:build make[2]: Leaving directory `/opt/local/var/macports/build/_opt_local_var_macports_sources_rsync.macports.org_release_tarballs_ports_mail_sylpheed/sylpheed/work/sylpheed-2.2.3/libsylph'
:info:build make[1]: *** [all-recursive] Error 1
:info:build make[1]: Leaving directory `/opt/local/var/macports/build/_opt_local_var_macports_sources_rsync.macports.org_release_tarballs_ports_mail_sylpheed/sylpheed/work/sylpheed-2.2.3'
:info:build make: *** [all-recursive-am] Error 2
:info:build make: Leaving directory `/opt/local/var/macports/build/_opt_local_var_macports_sources_rsync.macports.org_release_tarballs_ports_mail_sylpheed/sylpheed/work/sylpheed-2.2.3'
:info:build Command failed:  cd "/opt/local/var/macports/build/_opt_local_var_macports_sources_rsync.macports.org_release_tarballs_ports_mail_sylpheed/sylpheed/work/sylpheed-2.2.3" && /usr/bin/make -j2 -w all 
:info:build Exit code: 2
:error:build org.macports.build for port sylpheed returned: command execution failed
:debug:build Error code: CHILDSTATUS 80440 2
:debug:build Backtrace: command execution failed
    while executing
"system -nice 0 $fullcmdstring"
    ("eval" body line 1)
    invoked from within
"eval system $notty $nice \$fullcmdstring"
    invoked from within
"command_exec build"
    (procedure "portbuild::build_main" line 8)
    invoked from within
"$procedure $targetname"
:info:build Warning: targets not executed for sylpheed: org.macports.activate org.macports.build org.macports.destroot org.macports.install
:notice:build Please see the log file for port sylpheed for details:
    /opt/local/var/macports/logs/_opt_local_var_macports_sources_rsync.macports.org_release_tarballs_ports_mail_sylpheed/sylpheed/main.log

Change History (4)

comment:1 Changed 7 years ago by larryv (Lawrence Velázquez)

Description: modified (diff)
Port: sylpheed added
Summary: sylpheed 2.2.3sylpheed @2.2.3: build error

Thanks for the ticket. In the future, please use WikiFormatting in your ticket descriptions.

comment:2 Changed 7 years ago by larryv (Lawrence Velázquez)

Summary: sylpheed @2.2.3: build errorsylpheed @2.2.3: build failure due to glib headers

comment:3 Changed 7 years ago by ryandesign (Ryan Schmidt)

Owner: changed from macports-tickets@… to ryandesign@…
Status: newassigned

comment:4 Changed 7 years ago by ryandesign (Ryan Schmidt)

Resolution: fixed
Status: assignedclosed

Fixed by updating to 3.3.0 in r103289.

Note: See TracTickets for help on using tickets.