Changes between Initial Version and Version 1 of Ticket #42841


Ignore:
Timestamp:
Mar 14, 2014, 12:46:31 PM (7 years ago)
Author:
mojca (Mojca Miklavec)
Comment:

Legend:

Unmodified
Added
Removed
Modified
  • Ticket #42841

    • Property Keywords clhep geant4 removed
    • Property Cc mojca@… removed
    • Property Version changed from 2.2.1 to
    • Property Owner changed from macports-tickets@… to mojca@…
  • Ticket #42841 – Description

    initial v1  
    11Today:
    22
    3 
    43{{{
    5 $ sudo port selfupdate
    6 Password:
    7 --->  Updating MacPorts base sources using rsync
    8 MacPorts base version 2.2.1 installed,
    9 MacPorts base version 2.2.1 downloaded.
    10 --->  Updating the ports tree
    11 --->  MacPorts base is already the latest version
    12 
    13 The ports tree has been updated. To upgrade your installed ports, you should run
    14   port upgrade outdated
    15 
    16 $ sudo port outdated
    17 The following installed ports are outdated:
    18 automake                       1.14.1_0 < 1.14.1_1
    19 boost                          1.55.0_1 < 1.55.0_2
    20 clhep                          2.1.3.1_0 < 2.1.4.1_0
    21 desktop-file-utils             0.15_1 < 0.22_0
    22 freetype                       2.5.3_0 < 2.5.3_1
    23 py27-setuptools                2.2_0 < 3.1_0
    24 
    254$ sudo port upgrade outdated
    26 --->  Computing dependencies for automake
    27 --->  Fetching archive for automake
    28 --->  Attempting to fetch automake-1.14.1_1.darwin_13.noarch.tbz2 from http://nue.de.packages.macports.org/macports/packages/automake
    29 --->  Attempting to fetch automake-1.14.1_1.darwin_13.noarch.tbz2 from http://lil.fr.packages.macports.org/automake
    30 --->  Attempting to fetch automake-1.14.1_1.darwin_13.noarch.tbz2 from http://mse.uk.packages.macports.org/sites/packages.macports.org/automake
    31 --->  Fetching distfiles for automake
    32 --->  Attempting to fetch automake-1.14.1.tar.gz from http://fco.it.distfiles.macports.org/mirrors/macports-distfiles/automake
    33 --->  Verifying checksums for automake
    34 --->  Extracting automake
    35 --->  Applying patches to automake
    36 --->  Configuring automake
    37 --->  Building automake
    38 --->  Staging automake into destroot
    39 --->  Installing automake @1.14.1_1
    40 --->  Cleaning automake
    41 --->  Computing dependencies for automake
    42 --->  Deactivating automake @1.14.1_0
    43 --->  Cleaning automake
    44 --->  Activating automake @1.14.1_1
    45 --->  Cleaning automake
    46 --->  Computing dependencies for boost
    47 --->  Fetching archive for boost
    48 --->  Attempting to fetch boost-1.55.0_2+no_single+no_static+python27.darwin_13.x86_64.tbz2 from http://nue.de.packages.macports.org/macports/packages/boost
    49 --->  Attempting to fetch boost-1.55.0_2+no_single+no_static+python27.darwin_13.x86_64.tbz2 from http://lil.fr.packages.macports.org/boost
    50 --->  Attempting to fetch boost-1.55.0_2+no_single+no_static+python27.darwin_13.x86_64.tbz2 from http://mse.uk.packages.macports.org/sites/packages.macports.org/boost
    51 --->  Fetching distfiles for boost
    52 --->  Verifying checksums for boost
    53 --->  Extracting boost
    54 --->  Applying patches to boost
    55 --->  Configuring boost
    56 --->  Building boost
    57 --->  Staging boost into destroot
    58 --->  Installing boost @1.55.0_2+no_single+no_static+python27
    59 --->  Cleaning boost
    60 --->  Computing dependencies for boost
    61 --->  Deactivating boost @1.55.0_1+no_single+no_static+python27
    62 --->  Cleaning boost
    63 --->  Activating boost @1.55.0_2+no_single+no_static+python27
    64 --->  Cleaning boost
     5...
    656--->  Computing dependencies for clhep
    667--->  Fetching archive for clhep
     
    8223    http://guide.macports.org/#project.tickets
    8324}}}
     25
     26{{{
     27:info:build Linking CXX executable testMatrix
     28:info:build cd /opt/local/var/macports/build/_opt_local_var_macports_sources_rsync.macports.org_release_tarballs_ports_science_clhep/clhep/work/build/Matrix/test && /opt/local/bin/cmake -E cmake_link_script CMakeFiles/testMatrix.dir/link.txt --verbose=1
     29:info:build /usr/bin/clang++   -O -pedantic -Wall -pipe -Os -arch x86_64  -DDISABLE_ALLOC -DINSTALLATION_CHECK -DNDEBUG -arch x86_64 -Wl,-search_paths_first -Wl,-headerpad_max_install_names  -L/opt/local/lib -Wl,-headerpad_max_install_names -arch x86_64 CMakeFiles/testMatrix.dir/testMatrix.cc.o  -o testMatrix  ../../lib/libCLHEP-Matrix-2.1.4.1.a ../../lib/libCLHEP-Matrix-2.1.4.1.a ../../lib/libCLHEP-Matrix-2.1.4.1.a ../../lib/libCLHEP-Random-2.1.4.1.dylib ../../lib/libCLHEP-Vector-2.1.4.1.dylib -Wl,-rpath,/opt/local/lib
     30:info:build Undefined symbols for architecture x86_64:
     31:info:build   "CLHEP::HepVector::num_row() const", referenced from:
     32:info:build       CLHEP::HepRandomVector::operator()() in RandomVector.cc.o
     33:info:build make[2]: Leaving directory `/opt/local/var/macports/build/_opt_local_var_macports_sources_rsync.macports.org_release_tarballs_ports_science_clhep/clhep/work/build'
     34:info:build /opt/local/bin/cmake -E cmake_progress_report /opt/local/var/macports/build/_opt_local_var_macports_sources_rsync.macports.org_release_tarballs_ports_science_clhep/clhep/work/build/CMakeFiles
     35:info:build ld: symbol(s) not found for architecture x86_64
     36:info:build clang: error: linker command failed with exit code 1 (use -v to see invocation)
     37:info:build make[2]: *** [lib/libCLHEP-RandomObjects-2.1.4.1.dylib] Error 1
     38:info:build make[2]: Leaving directory `/opt/local/var/macports/build/_opt_local_var_macports_sources_rsync.macports.org_release_tarballs_ports_science_clhep/clhep/work/build'
     39:info:build make[1]: *** [RandomObjects/src/CMakeFiles/RandomObjects.dir/all] Error 2
     40:info:build make[1]: *** Waiting for unfinished jobs....
     41:info:build [100%] Built target testMatrix
     42}}}