Opened 15 years ago

Closed 15 years ago

Last modified 15 years ago

#4290 closed defect (fixed)

BUG: Jaxen fails

Reported by: lrivers@… Owned by: mww@…
Priority: Normal Milestone:
Component: ports Version: 1.0
Keywords: Cc:
Port:

Description

When I attempt to install jaxen, it fails. Here's the -dv output: AlBook:~ lrivers$ sudo port -dv clean jaxen DEBUG: Found port in file:///opt/local/var/db/dports/sources/ rsync.rsync.opendarwin.org_dpupdate_dports/java/jaxen DEBUG: Changing to port directory: /opt/local/var/db/dports/sources/ rsync.rsync.opendarwin.org_dpupdate_dports/java/jaxen DEBUG: Requested variant powerpc is not provided by port jaxen. DEBUG: Requested variant darwin is not provided by port jaxen. DEBUG: Requested variant macosx is not provided by port jaxen. DEBUG: Skipping completed com.apple.main (jaxen) ---> Cleaning jaxen DEBUG: Executing com.apple.clean (jaxen) ---> Removing workpath for jaxen DEBUG: Removing directory: /opt/local/var/db/dports/build/ file._opt_local_var_db_dports_sources_rsync.rsync.opendarwin.org_dpupdate_dports_java_jaxen/work DEBUG: Removing symlink: /opt/local/var/db/dports/sources/ rsync.rsync.opendarwin.org_dpupdate_dports/java/jaxen/work AlBook:~ lrivers$ sudo port -dv install jaxen DEBUG: Found port in file:///opt/local/var/db/dports/sources/ rsync.rsync.opendarwin.org_dpupdate_dports/java/jaxen DEBUG: Changing to port directory: /opt/local/var/db/dports/sources/ rsync.rsync.opendarwin.org_dpupdate_dports/java/jaxen DEBUG: Requested variant powerpc is not provided by port jaxen. DEBUG: Requested variant darwin is not provided by port jaxen. DEBUG: Requested variant macosx is not provided by port jaxen. DEBUG: Found port in file:///opt/local/var/db/dports/sources/ rsync.rsync.opendarwin.org_dpupdate_dports/java/dom4j DEBUG: Changing to port directory: /opt/local/var/db/dports/sources/ rsync.rsync.opendarwin.org_dpupdate_dports/java/dom4j DEBUG: Searching for dependency: dom4j DEBUG: Didn't find receipt, going to depspec regex for: dom4j DEBUG: Found Dependency: path: /usr/bin filename: java regex: java$ DEBUG: Found port in file:///opt/local/var/db/dports/sources/ rsync.rsync.opendarwin.org_dpupdate_dports/devel/apache-ant DEBUG: Changing to port directory: /opt/local/var/db/dports/sources/ rsync.rsync.opendarwin.org_dpupdate_dports/devel/apache-ant DEBUG: Searching for dependency: apache-ant DEBUG: Didn't find receipt, going to depspec regex for: apache-ant DEBUG: Found Dependency: path: /usr/bin filename: ant regex: ant$ DEBUG: Executing com.apple.main (jaxen) DEBUG: No TGZ archive: /opt/local/var/db/dports/packages/darwin/powerpc/jaxen-1.0- FCS_2.powerpc.tgz DEBUG: Skipping unarchive (jaxen) since no archive found DEBUG: Skipping completed com.apple.unarchive (jaxen) ---> Fetching jaxen DEBUG: Executing com.apple.fetch (jaxen) ---> Verifying checksum(s) for jaxen DEBUG: Executing com.apple.checksum (jaxen) ---> Checksumming jaxen-1.0-FCS.tar.gz DEBUG: Correct (md5) checksum for jaxen-1.0-FCS.tar.gz ---> Extracting jaxen DEBUG: Executing com.apple.extract (jaxen) ---> Extracting jaxen-1.0-FCS.tar.gz DEBUG: setting option extract.args to /opt/local/var/db/dports/distfiles/jaxen/jaxen-1.0-FCS.tar.gz DEBUG: Assembled command: 'cd "/opt/local/var/db/dports/build/ file._opt_local_var_db_dports_sources_rsync.rsync.opendarwin.org_dpupdate_dports_java_jaxen/work" && gzip -dc /opt/local/var/db/dports/distfiles/jaxen/jaxen-1.0-FCS.tar.gz | /sw/bin/gnutar --no- same-owner -xf -' /sw/bin/gnutar: A lone zero block at 17919 DEBUG: Executing proc-post-com.apple.extract-extract-0 DEBUG: Executing com.apple.patch (jaxen) ---> Configuring jaxen DEBUG: Executing com.apple.configure (jaxen) ---> Building jaxen with target dist DEBUG: Executing com.apple.build (jaxen) DEBUG: Assembled command: 'cd "/opt/local/var/db/dports/build/ file._opt_local_var_db_dports_sources_rsync.rsync.opendarwin.org_dpupdate_dports_java_jaxen/work/ jaxen-1.0-FCS" && CLASSPATH=/opt/local/share/java/saxpath.jar:/opt/local/share/java/apache-ant/ ant.jar:/opt/local/share/java/junit.jar:/opt/local/share/java/xalan.jar:/opt/local/share/java/xml- apis.jar:/opt/local/share/java/dom4j.jar ant dist -Djunit.jar=/opt/local/share/java/junit.jar' Buildfile: build.xml

init:

[echo] ----------- Jaxen 1.0-FCS [2002] ------------

prepare:

[mkdir] Created dir: /opt/local/var/db/dports/build/

file._opt_local_var_db_dports_sources_rsync.rsync.opendarwin.org_dpupdate_dports_java_jaxen/work/ jaxen-1.0-FCS/build

[mkdir] Created dir: /opt/local/var/db/dports/build/

file._opt_local_var_db_dports_sources_rsync.rsync.opendarwin.org_dpupdate_dports_java_jaxen/work/ jaxen-1.0-FCS/build/classes

[mkdir] Created dir: /opt/local/var/db/dports/build/

file._opt_local_var_db_dports_sources_rsync.rsync.opendarwin.org_dpupdate_dports_java_jaxen/work/ jaxen-1.0-FCS/build/classes/main

[mkdir] Created dir: /opt/local/var/db/dports/build/

file._opt_local_var_db_dports_sources_rsync.rsync.opendarwin.org_dpupdate_dports_java_jaxen/work/ jaxen-1.0-FCS/build/classes/test

[mkdir] Created dir: /opt/local/var/db/dports/build/

file._opt_local_var_db_dports_sources_rsync.rsync.opendarwin.org_dpupdate_dports_java_jaxen/work/ jaxen-1.0-FCS/build/classes/samples

[mkdir] Created dir: /opt/local/var/db/dports/build/

file._opt_local_var_db_dports_sources_rsync.rsync.opendarwin.org_dpupdate_dports_java_jaxen/work/ jaxen-1.0-FCS/build/src

[mkdir] Created dir: /opt/local/var/db/dports/build/

file._opt_local_var_db_dports_sources_rsync.rsync.opendarwin.org_dpupdate_dports_java_jaxen/work/ jaxen-1.0-FCS/build/src/main

[mkdir] Created dir: /opt/local/var/db/dports/build/

file._opt_local_var_db_dports_sources_rsync.rsync.opendarwin.org_dpupdate_dports_java_jaxen/work/ jaxen-1.0-FCS/build/src/test

[mkdir] Created dir: /opt/local/var/db/dports/build/

file._opt_local_var_db_dports_sources_rsync.rsync.opendarwin.org_dpupdate_dports_java_jaxen/work/ jaxen-1.0-FCS/build/src/samples

prepare.core:

[copy] Copying 154 files to /opt/local/var/db/dports/build/

file._opt_local_var_db_dports_sources_rsync.rsync.opendarwin.org_dpupdate_dports_java_jaxen/work/ jaxen-1.0-FCS/build/src/main

[copy] Copied 12 empty directories to 4 empty directories under /opt/local/var/db/dports/build/

file._opt_local_var_db_dports_sources_rsync.rsync.opendarwin.org_dpupdate_dports_java_jaxen/work/ jaxen-1.0-FCS/build/src/main

compile.core:

internal.compile:

[javac] Compiling 154 source files to /opt/local/var/db/dports/build/

file._opt_local_var_db_dports_sources_rsync.rsync.opendarwin.org_dpupdate_dports_java_jaxen/work/ jaxen-1.0-FCS/build/classes/main

[javac] This version of java does not support the classic compiler; upgrading to modern [javac] /opt/local/var/db/dports/build/

file._opt_local_var_db_dports_sources_rsync.rsync.opendarwin.org_dpupdate_dports_java_jaxen/work/ jaxen-1.0-FCS/build/src/main/org/jaxen/BaseXPath.java:71: package org.saxpath does not exist

[javac] import org.saxpath.XPathReader; [javac] [javac] /opt/local/var/db/dports/build/

file._opt_local_var_db_dports_sources_rsync.rsync.opendarwin.org_dpupdate_dports_java_jaxen/work/ jaxen-1.0-FCS/build/src/main/org/jaxen/BaseXPath.java:72: package org.saxpath does not exist

[javac] import org.saxpath.SAXPathException; [javac] [javac] /opt/local/var/db/dports/build/

file._opt_local_var_db_dports_sources_rsync.rsync.opendarwin.org_dpupdate_dports_java_jaxen/work/ jaxen-1.0-FCS/build/src/main/org/jaxen/BaseXPath.java:73: package org.saxpath.helpers does not exist

[javac] import org.saxpath.helpers.XPathReaderFactory; [javac] [javac] /opt/local/var/db/dports/build/

file._opt_local_var_db_dports_sources_rsync.rsync.opendarwin.org_dpupdate_dports_java_jaxen/work/ jaxen-1.0-FCS/build/src/main/org/jaxen/Navigator.java:69: package org.saxpath does not exist

[javac] import org.saxpath.SAXPathException; [javac] [javac] /opt/local/var/db/dports/build/

file._opt_local_var_db_dports_sources_rsync.rsync.opendarwin.org_dpupdate_dports_java_jaxen/work/ jaxen-1.0-FCS/build/src/main/org/jaxen/JaxenException.java:65: package org.saxpath does not exist

[javac] import org.saxpath.SAXPathException; [javac] [javac] /opt/local/var/db/dports/build/

file._opt_local_var_db_dports_sources_rsync.rsync.opendarwin.org_dpupdate_dports_java_jaxen/work/ jaxen-1.0-FCS/build/src/main/org/jaxen/JaxenException.java:75: cannot resolve symbol

[javac] symbol : class SAXPathException [javac] location: class org.jaxen.JaxenException [javac] public class JaxenException extends SAXPathException [javac] [javac] /opt/local/var/db/dports/build/

file._opt_local_var_db_dports_sources_rsync.rsync.opendarwin.org_dpupdate_dports_java_jaxen/work/ jaxen-1.0-FCS/build/src/main/org/jaxen/Navigator.java:509: cannot resolve symbol

[javac] symbol : class SAXPathException [javac] location: interface org.jaxen.Navigator [javac] XPath parseXPath(String xpath) throws SAXPathException; [javac] [javac] /opt/local/var/db/dports/build/

file._opt_local_var_db_dports_sources_rsync.rsync.opendarwin.org_dpupdate_dports_java_jaxen/work/ jaxen-1.0-FCS/build/src/main/org/jaxen/JaxenHandler.java:77: package org.saxpath does not exist

[javac] import org.saxpath.XPathHandler; [javac] [javac] /opt/local/var/db/dports/build/

file._opt_local_var_db_dports_sources_rsync.rsync.opendarwin.org_dpupdate_dports_java_jaxen/work/ jaxen-1.0-FCS/build/src/main/org/jaxen/JaxenHandler.java:78: package org.saxpath does not exist

[javac] import org.saxpath.Axis; [javac] [javac] /opt/local/var/db/dports/build/

file._opt_local_var_db_dports_sources_rsync.rsync.opendarwin.org_dpupdate_dports_java_jaxen/work/ jaxen-1.0-FCS/build/src/main/org/jaxen/JaxenHandler.java:79: package org.saxpath does not exist

[javac] import org.saxpath.Operator; [javac] [javac] /opt/local/var/db/dports/build/

file._opt_local_var_db_dports_sources_rsync.rsync.opendarwin.org_dpupdate_dports_java_jaxen/work/ jaxen-1.0-FCS/build/src/main/org/jaxen/JaxenHandler.java:90: cannot resolve symbol

[javac] symbol : class XPathHandler [javac] location: class org.jaxen.JaxenHandler [javac] public class JaxenHandler implements XPathHandler [javac] [javac] /opt/local/var/db/dports/build/

file._opt_local_var_db_dports_sources_rsync.rsync.opendarwin.org_dpupdate_dports_java_jaxen/work/ jaxen-1.0-FCS/build/src/main/org/jaxen/expr/XPathFactory.java:68: package org.saxpath does not exist

[javac] import org.saxpath.Operator; [javac] [javac] /opt/local/var/db/dports/build/

file._opt_local_var_db_dports_sources_rsync.rsync.opendarwin.org_dpupdate_dports_java_jaxen/work/ jaxen-1.0-FCS/build/src/main/org/jaxen/expr/XPathFactory.java:70: cannot resolve symbol

[javac] symbol : class Operator [javac] location: interface org.jaxen.expr.XPathFactory [javac] public interface XPathFactory extends Operator [javac] [javac] /opt/local/var/db/dports/build/

file._opt_local_var_db_dports_sources_rsync.rsync.opendarwin.org_dpupdate_dports_java_jaxen/work/ jaxen-1.0-FCS/build/src/main/org/jaxen/expr/DefaultStep.java:73: package org.saxpath does not exist

[javac] import org.saxpath.Axis; [javac] [javac] /opt/local/var/db/dports/build/

file._opt_local_var_db_dports_sources_rsync.rsync.opendarwin.org_dpupdate_dports_java_jaxen/work/ jaxen-1.0-FCS/build/src/main/org/jaxen/expr/DefaultXPathFactory.java:70: package org.saxpath does not exist

[javac] import org.saxpath.Axis; [javac] [javac] /opt/local/var/db/dports/build/

file._opt_local_var_db_dports_sources_rsync.rsync.opendarwin.org_dpupdate_dports_java_jaxen/work/ jaxen-1.0-FCS/build/src/main/org/jaxen/function/ext/EvaluateFunction.java:76: package org.saxpath does not exist

[javac] import org.saxpath.SAXPathException; [javac] [javac] /opt/local/var/db/dports/build/

file._opt_local_var_db_dports_sources_rsync.rsync.opendarwin.org_dpupdate_dports_java_jaxen/work/ jaxen-1.0-FCS/build/src/main/org/jaxen/pattern/PatternHandler.java:75: package org.saxpath does not exist

[javac] import org.saxpath.XPathHandler; [javac] [javac] /opt/local/var/db/dports/build/

file._opt_local_var_db_dports_sources_rsync.rsync.opendarwin.org_dpupdate_dports_java_jaxen/work/ jaxen-1.0-FCS/build/src/main/org/jaxen/pattern/PatternHandler.java:76: package org.saxpath does not exist

[javac] import org.saxpath.Axis; [javac] [javac] /opt/local/var/db/dports/build/

file._opt_local_var_db_dports_sources_rsync.rsync.opendarwin.org_dpupdate_dports_java_jaxen/work/ jaxen-1.0-FCS/build/src/main/org/jaxen/pattern/PatternHandler.java:77: package org.saxpath does not exist

[javac] import org.saxpath.Operator; [javac] [javac] /opt/local/var/db/dports/build/

file._opt_local_var_db_dports_sources_rsync.rsync.opendarwin.org_dpupdate_dports_java_jaxen/work/ jaxen-1.0-FCS/build/src/main/org/jaxen/pattern/PatternParser.java:73: package org.saxpath does not exist

[javac] import org.saxpath.Axis; [javac] [javac] /opt/local/var/db/dports/build/

file._opt_local_var_db_dports_sources_rsync.rsync.opendarwin.org_dpupdate_dports_java_jaxen/work/ jaxen-1.0-FCS/build/src/main/org/jaxen/pattern/PatternParser.java:74: package org.saxpath does not exist

[javac] import org.saxpath.SAXPathException; [javac] [javac] /opt/local/var/db/dports/build/

file._opt_local_var_db_dports_sources_rsync.rsync.opendarwin.org_dpupdate_dports_java_jaxen/work/ jaxen-1.0-FCS/build/src/main/org/jaxen/pattern/PatternParser.java:75: package org.saxpath does not exist

[javac] import org.saxpath.XPathReader; [javac] [javac] /opt/local/var/db/dports/build/

file._opt_local_var_db_dports_sources_rsync.rsync.opendarwin.org_dpupdate_dports_java_jaxen/work/ jaxen-1.0-FCS/build/src/main/org/jaxen/pattern/PatternParser.java:76: package org.saxpath does not exist

[javac] import org.saxpath.XPathSyntaxException; [javac] [javac] /opt/local/var/db/dports/build/

file._opt_local_var_db_dports_sources_rsync.rsync.opendarwin.org_dpupdate_dports_java_jaxen/work/ jaxen-1.0-FCS/build/src/main/org/jaxen/pattern/PatternParser.java:77: package org.saxpath.helpers does not exist

[javac] import org.saxpath.helpers.XPathReaderFactory; [javac] [javac] /opt/local/var/db/dports/build/

file._opt_local_var_db_dports_sources_rsync.rsync.opendarwin.org_dpupdate_dports_java_jaxen/work/ jaxen-1.0-FCS/build/src/main/org/jaxen/pattern/PatternParser.java:89: cannot resolve symbol

[javac] symbol : class SAXPathException [javac] location: class org.jaxen.pattern.PatternParser [javac] public static Pattern parse(String text) throws JaxenException, SAXPathException [javac] [javac] /opt/local/var/db/dports/build/

file._opt_local_var_db_dports_sources_rsync.rsync.opendarwin.org_dpupdate_dports_java_jaxen/work/ jaxen-1.0-FCS/build/src/main/org/jaxen/BaseXPath.java:124: cannot resolve symbol

[javac] symbol : class XPathReader [javac] location: class org.jaxen.BaseXPath [javac] XPathReader reader = XPathReaderFactory.createReader(); [javac] [javac] /opt/local/var/db/dports/build/

file._opt_local_var_db_dports_sources_rsync.rsync.opendarwin.org_dpupdate_dports_java_jaxen/work/ jaxen-1.0-FCS/build/src/main/org/jaxen/BaseXPath.java:124: cannot resolve symbol

[javac] symbol : variable XPathReaderFactory [javac] location: class org.jaxen.BaseXPath [javac] XPathReader reader = XPathReaderFactory.createReader(); [javac] [javac] /opt/local/var/db/dports/build/

file._opt_local_var_db_dports_sources_rsync.rsync.opendarwin.org_dpupdate_dports_java_jaxen/work/ jaxen-1.0-FCS/build/src/main/org/jaxen/BaseXPath.java:134: package org.saxpath does not exist

[javac] catch (org.saxpath.XPathSyntaxException e) [javac] [javac] /opt/local/var/db/dports/build/

file._opt_local_var_db_dports_sources_rsync.rsync.opendarwin.org_dpupdate_dports_java_jaxen/work/ jaxen-1.0-FCS/build/src/main/org/jaxen/BaseXPath.java:140: cannot resolve symbol

[javac] symbol : class SAXPathException [javac] location: class org.jaxen.BaseXPath [javac] catch (SAXPathException e) [javac] [javac] /opt/local/var/db/dports/build/

file._opt_local_var_db_dports_sources_rsync.rsync.opendarwin.org_dpupdate_dports_java_jaxen/work/ jaxen-1.0-FCS/build/src/main/org/jaxen/FunctionCallException.java:96: cannot resolve symbol

[javac] symbol : method printStackTrace () [javac] location: class org.jaxen.JaxenException [javac] super.printStackTrace(); [javac] [javac] /opt/local/var/db/dports/build/

file._opt_local_var_db_dports_sources_rsync.rsync.opendarwin.org_dpupdate_dports_java_jaxen/work/ jaxen-1.0-FCS/build/src/main/org/jaxen/FunctionCallException.java:105: cannot resolve symbol

[javac] symbol : method printStackTrace () [javac] location: class org.jaxen.JaxenException [javac] super.printStackTrace(); [javac] [javac] /opt/local/var/db/dports/build/

file._opt_local_var_db_dports_sources_rsync.rsync.opendarwin.org_dpupdate_dports_java_jaxen/work/ jaxen-1.0-FCS/build/src/main/org/jaxen/FunctionCallException.java:114: cannot resolve symbol

[javac] symbol : method printStackTrace () [javac] location: class org.jaxen.JaxenException [javac] super.printStackTrace(); [javac] [javac] /opt/local/var/db/dports/build/

file._opt_local_var_db_dports_sources_rsync.rsync.opendarwin.org_dpupdate_dports_java_jaxen/work/ jaxen-1.0-FCS/build/src/main/org/jaxen/FunctionCallException.java:124: cannot resolve symbol

[javac] symbol : method fillInStackTrace () [javac] location: class org.jaxen.JaxenException [javac] return super.fillInStackTrace(); [javac] [javac] /opt/local/var/db/dports/build/

file._opt_local_var_db_dports_sources_rsync.rsync.opendarwin.org_dpupdate_dports_java_jaxen/work/ jaxen-1.0-FCS/build/src/main/org/jaxen/JaxenHandler.java:469: cannot resolve symbol

[javac] symbol : variable Operator [javac] location: class org.jaxen.JaxenHandler [javac] if ( operator != Operator.NO_OP ) [javac] [javac] /opt/local/var/db/dports/build/

file._opt_local_var_db_dports_sources_rsync.rsync.opendarwin.org_dpupdate_dports_java_jaxen/work/ jaxen-1.0-FCS/build/src/main/org/jaxen/JaxenHandler.java:491: cannot resolve symbol

[javac] symbol : variable Operator [javac] location: class org.jaxen.JaxenHandler [javac] if ( operator != Operator.NO_OP ) [javac] [javac] /opt/local/var/db/dports/build/

file._opt_local_var_db_dports_sources_rsync.rsync.opendarwin.org_dpupdate_dports_java_jaxen/work/ jaxen-1.0-FCS/build/src/main/org/jaxen/JaxenHandler.java:513: cannot resolve symbol

[javac] symbol : variable Operator [javac] location: class org.jaxen.JaxenHandler [javac] if ( operator != Operator.NO_OP ) [javac] [javac] /opt/local/var/db/dports/build/

file._opt_local_var_db_dports_sources_rsync.rsync.opendarwin.org_dpupdate_dports_java_jaxen/work/ jaxen-1.0-FCS/build/src/main/org/jaxen/JaxenHandler.java:535: cannot resolve symbol

[javac] symbol : variable Operator [javac] location: class org.jaxen.JaxenHandler [javac] if ( operator != Operator.NO_OP ) [javac] [javac] /opt/local/var/db/dports/build/

file._opt_local_var_db_dports_sources_rsync.rsync.opendarwin.org_dpupdate_dports_java_jaxen/work/ jaxen-1.0-FCS/build/src/main/org/jaxen/JaxenHandler.java:557: cannot resolve symbol

[javac] symbol : variable Operator [javac] location: class org.jaxen.JaxenHandler [javac] if ( operator != Operator.NO_OP ) [javac] [javac] /opt/local/var/db/dports/build/

file._opt_local_var_db_dports_sources_rsync.rsync.opendarwin.org_dpupdate_dports_java_jaxen/work/ jaxen-1.0-FCS/build/src/main/org/jaxen/XPathSyntaxException.java:159: cannot resolve symbol

[javac] symbol : method getMessage () [javac] location: class org.jaxen.XPathSyntaxException [javac] buf.append( getMessage() ); [javac] [javac] /opt/local/var/db/dports/build/

file._opt_local_var_db_dports_sources_rsync.rsync.opendarwin.org_dpupdate_dports_java_jaxen/work/ jaxen-1.0-FCS/build/src/main/org/jaxen/expr/DefaultStep.java:118: cannot resolve symbol

[javac] symbol : variable Axis [javac] location: class org.jaxen.expr.DefaultStep [javac] return Axis.lookup( getAxis() ); [javac] [javac] /opt/local/var/db/dports/build/

file._opt_local_var_db_dports_sources_rsync.rsync.opendarwin.org_dpupdate_dports_java_jaxen/work/ jaxen-1.0-FCS/build/src/main/org/jaxen/expr/DefaultXPathFactory.java:116: cannot resolve symbol

[javac] symbol : variable EQUALS [javac] location: class org.jaxen.expr.DefaultXPathFactory [javac] case EQUALS: [javac] [javac] /opt/local/var/db/dports/build/

file._opt_local_var_db_dports_sources_rsync.rsync.opendarwin.org_dpupdate_dports_java_jaxen/work/ jaxen-1.0-FCS/build/src/main/org/jaxen/expr/DefaultXPathFactory.java:121: cannot resolve symbol

[javac] symbol : variable NOT_EQUALS [javac] location: class org.jaxen.expr.DefaultXPathFactory [javac] case NOT_EQUALS: [javac] [javac] /opt/local/var/db/dports/build/

file._opt_local_var_db_dports_sources_rsync.rsync.opendarwin.org_dpupdate_dports_java_jaxen/work/ jaxen-1.0-FCS/build/src/main/org/jaxen/expr/DefaultXPathFactory.java:137: cannot resolve symbol

[javac] symbol : variable LESS_THAN [javac] location: class org.jaxen.expr.DefaultXPathFactory [javac] case LESS_THAN: [javac] [javac] /opt/local/var/db/dports/build/

file._opt_local_var_db_dports_sources_rsync.rsync.opendarwin.org_dpupdate_dports_java_jaxen/work/ jaxen-1.0-FCS/build/src/main/org/jaxen/expr/DefaultXPathFactory.java:142: cannot resolve symbol

[javac] symbol : variable GREATER_THAN [javac] location: class org.jaxen.expr.DefaultXPathFactory [javac] case GREATER_THAN: [javac] [javac] /opt/local/var/db/dports/build/

file._opt_local_var_db_dports_sources_rsync.rsync.opendarwin.org_dpupdate_dports_java_jaxen/work/ jaxen-1.0-FCS/build/src/main/org/jaxen/expr/DefaultXPathFactory.java:147: cannot resolve symbol

[javac] symbol : variable LESS_THAN_EQUALS [javac] location: class org.jaxen.expr.DefaultXPathFactory [javac] case LESS_THAN_EQUALS: [javac] [javac] /opt/local/var/db/dports/build/

file._opt_local_var_db_dports_sources_rsync.rsync.opendarwin.org_dpupdate_dports_java_jaxen/work/ jaxen-1.0-FCS/build/src/main/org/jaxen/expr/DefaultXPathFactory.java:152: cannot resolve symbol

[javac] symbol : variable GREATER_THAN_EQUALS [javac] location: class org.jaxen.expr.DefaultXPathFactory [javac] case GREATER_THAN_EQUALS: [javac] [javac] /opt/local/var/db/dports/build/

file._opt_local_var_db_dports_sources_rsync.rsync.opendarwin.org_dpupdate_dports_java_jaxen/work/ jaxen-1.0-FCS/build/src/main/org/jaxen/expr/DefaultXPathFactory.java:168: cannot resolve symbol

[javac] symbol : variable ADD [javac] location: class org.jaxen.expr.DefaultXPathFactory [javac] case ADD: [javac] [javac] /opt/local/var/db/dports/build/

file._opt_local_var_db_dports_sources_rsync.rsync.opendarwin.org_dpupdate_dports_java_jaxen/work/ jaxen-1.0-FCS/build/src/main/org/jaxen/expr/DefaultXPathFactory.java:173: cannot resolve symbol

[javac] symbol : variable SUBTRACT [javac] location: class org.jaxen.expr.DefaultXPathFactory [javac] case SUBTRACT: [javac] [javac] /opt/local/var/db/dports/build/

file._opt_local_var_db_dports_sources_rsync.rsync.opendarwin.org_dpupdate_dports_java_jaxen/work/ jaxen-1.0-FCS/build/src/main/org/jaxen/expr/DefaultXPathFactory.java:189: cannot resolve symbol

[javac] symbol : variable MULTIPLY [javac] location: class org.jaxen.expr.DefaultXPathFactory [javac] case MULTIPLY: [javac] [javac] /opt/local/var/db/dports/build/

file._opt_local_var_db_dports_sources_rsync.rsync.opendarwin.org_dpupdate_dports_java_jaxen/work/ jaxen-1.0-FCS/build/src/main/org/jaxen/expr/DefaultXPathFactory.java:194: cannot resolve symbol

[javac] symbol : variable DIV [javac] location: class org.jaxen.expr.DefaultXPathFactory [javac] case DIV: [javac] [javac] /opt/local/var/db/dports/build/

file._opt_local_var_db_dports_sources_rsync.rsync.opendarwin.org_dpupdate_dports_java_jaxen/work/ jaxen-1.0-FCS/build/src/main/org/jaxen/expr/DefaultXPathFactory.java:199: cannot resolve symbol

[javac] symbol : variable MOD [javac] location: class org.jaxen.expr.DefaultXPathFactory [javac] case MOD: [javac] [javac] /opt/local/var/db/dports/build/

file._opt_local_var_db_dports_sources_rsync.rsync.opendarwin.org_dpupdate_dports_java_jaxen/work/ jaxen-1.0-FCS/build/src/main/org/jaxen/expr/DefaultXPathFactory.java:214: cannot resolve symbol

[javac] symbol : variable NEGATIVE [javac] location: class org.jaxen.expr.DefaultXPathFactory [javac] case NEGATIVE: [javac] [javac] /opt/local/var/db/dports/build/

file._opt_local_var_db_dports_sources_rsync.rsync.opendarwin.org_dpupdate_dports_java_jaxen/work/ jaxen-1.0-FCS/build/src/main/org/jaxen/expr/DefaultXPathFactory.java:317: cannot resolve symbol

[javac] symbol : variable Axis [javac] location: class org.jaxen.expr.DefaultXPathFactory [javac] case Axis.CHILD: [javac] [javac] /opt/local/var/db/dports/build/

file._opt_local_var_db_dports_sources_rsync.rsync.opendarwin.org_dpupdate_dports_java_jaxen/work/ jaxen-1.0-FCS/build/src/main/org/jaxen/expr/DefaultXPathFactory.java:322: cannot resolve symbol

[javac] symbol : variable Axis [javac] location: class org.jaxen.expr.DefaultXPathFactory [javac] case Axis.DESCENDANT: [javac] [javac] /opt/local/var/db/dports/build/

file._opt_local_var_db_dports_sources_rsync.rsync.opendarwin.org_dpupdate_dports_java_jaxen/work/ jaxen-1.0-FCS/build/src/main/org/jaxen/expr/DefaultXPathFactory.java:327: cannot resolve symbol

[javac] symbol : variable Axis [javac] location: class org.jaxen.expr.DefaultXPathFactory [javac] case Axis.PARENT: [javac] [javac] /opt/local/var/db/dports/build/

file._opt_local_var_db_dports_sources_rsync.rsync.opendarwin.org_dpupdate_dports_java_jaxen/work/ jaxen-1.0-FCS/build/src/main/org/jaxen/expr/DefaultXPathFactory.java:332: cannot resolve symbol

[javac] symbol : variable Axis [javac] location: class org.jaxen.expr.DefaultXPathFactory [javac] case Axis.FOLLOWING_SIBLING: [javac] [javac] /opt/local/var/db/dports/build/

file._opt_local_var_db_dports_sources_rsync.rsync.opendarwin.org_dpupdate_dports_java_jaxen/work/ jaxen-1.0-FCS/build/src/main/org/jaxen/expr/DefaultXPathFactory.java:337: cannot resolve symbol

[javac] symbol : variable Axis [javac] location: class org.jaxen.expr.DefaultXPathFactory [javac] case Axis.PRECEDING_SIBLING: [javac] [javac] /opt/local/var/db/dports/build/

file._opt_local_var_db_dports_sources_rsync.rsync.opendarwin.org_dpupdate_dports_java_jaxen/work/ jaxen-1.0-FCS/build/src/main/org/jaxen/expr/DefaultXPathFactory.java:342: cannot resolve symbol

[javac] symbol : variable Axis [javac] location: class org.jaxen.expr.DefaultXPathFactory [javac] case Axis.FOLLOWING: [javac] [javac] /opt/local/var/db/dports/build/

file._opt_local_var_db_dports_sources_rsync.rsync.opendarwin.org_dpupdate_dports_java_jaxen/work/ jaxen-1.0-FCS/build/src/main/org/jaxen/expr/DefaultXPathFactory.java:347: cannot resolve symbol

[javac] symbol : variable Axis [javac] location: class org.jaxen.expr.DefaultXPathFactory [javac] case Axis.PRECEDING: [javac] [javac] /opt/local/var/db/dports/build/

file._opt_local_var_db_dports_sources_rsync.rsync.opendarwin.org_dpupdate_dports_java_jaxen/work/ jaxen-1.0-FCS/build/src/main/org/jaxen/expr/DefaultXPathFactory.java:352: cannot resolve symbol

[javac] symbol : variable Axis [javac] location: class org.jaxen.expr.DefaultXPathFactory [javac] case Axis.ATTRIBUTE: [javac] [javac] /opt/local/var/db/dports/build/

file._opt_local_var_db_dports_sources_rsync.rsync.opendarwin.org_dpupdate_dports_java_jaxen/work/ jaxen-1.0-FCS/build/src/main/org/jaxen/expr/DefaultXPathFactory.java:357: cannot resolve symbol

[javac] symbol : variable Axis [javac] location: class org.jaxen.expr.DefaultXPathFactory [javac] case Axis.NAMESPACE: [javac] [javac] /opt/local/var/db/dports/build/

file._opt_local_var_db_dports_sources_rsync.rsync.opendarwin.org_dpupdate_dports_java_jaxen/work/ jaxen-1.0-FCS/build/src/main/org/jaxen/expr/DefaultXPathFactory.java:362: cannot resolve symbol

[javac] symbol : variable Axis [javac] location: class org.jaxen.expr.DefaultXPathFactory [javac] case Axis.SELF: [javac] [javac] /opt/local/var/db/dports/build/

file._opt_local_var_db_dports_sources_rsync.rsync.opendarwin.org_dpupdate_dports_java_jaxen/work/ jaxen-1.0-FCS/build/src/main/org/jaxen/expr/DefaultXPathFactory.java:367: cannot resolve symbol

[javac] symbol : variable Axis [javac] location: class org.jaxen.expr.DefaultXPathFactory [javac] case Axis.DESCENDANT_OR_SELF: [javac] [javac] /opt/local/var/db/dports/build/

file._opt_local_var_db_dports_sources_rsync.rsync.opendarwin.org_dpupdate_dports_java_jaxen/work/ jaxen-1.0-FCS/build/src/main/org/jaxen/expr/DefaultXPathFactory.java:372: cannot resolve symbol

[javac] symbol : variable Axis [javac] location: class org.jaxen.expr.DefaultXPathFactory [javac] case Axis.ANCESTOR_OR_SELF: [javac] [javac] /opt/local/var/db/dports/build/

file._opt_local_var_db_dports_sources_rsync.rsync.opendarwin.org_dpupdate_dports_java_jaxen/work/ jaxen-1.0-FCS/build/src/main/org/jaxen/expr/DefaultXPathFactory.java:377: cannot resolve symbol

[javac] symbol : variable Axis [javac] location: class org.jaxen.expr.DefaultXPathFactory [javac] case Axis.ANCESTOR: [javac] [javac] /opt/local/var/db/dports/build/

file._opt_local_var_db_dports_sources_rsync.rsync.opendarwin.org_dpupdate_dports_java_jaxen/work/ jaxen-1.0-FCS/build/src/main/org/jaxen/function/ext/EvaluateFunction.java:120: cannot resolve symbol

[javac] symbol : class SAXPathException [javac] location: class org.jaxen.function.ext.EvaluateFunction [javac] catch ( SAXPathException e ) { [javac] [javac] /opt/local/var/db/dports/build/

file._opt_local_var_db_dports_sources_rsync.rsync.opendarwin.org_dpupdate_dports_java_jaxen/work/ jaxen-1.0-FCS/build/src/main/org/jaxen/pattern/PatternHandler.java:274: cannot resolve symbol

[javac] symbol : variable Axis [javac] location: class org.jaxen.pattern.PatternHandler [javac] case Axis.ATTRIBUTE: [javac] [javac] /opt/local/var/db/dports/build/

file._opt_local_var_db_dports_sources_rsync.rsync.opendarwin.org_dpupdate_dports_java_jaxen/work/ jaxen-1.0-FCS/build/src/main/org/jaxen/pattern/PatternHandler.java:277: cannot resolve symbol

[javac] symbol : variable Axis [javac] location: class org.jaxen.pattern.PatternHandler [javac] case Axis.NAMESPACE: [javac] [javac] /opt/local/var/db/dports/build/

file._opt_local_var_db_dports_sources_rsync.rsync.opendarwin.org_dpupdate_dports_java_jaxen/work/ jaxen-1.0-FCS/build/src/main/org/jaxen/pattern/PatternParser.java:93: cannot resolve symbol

[javac] symbol : class XPathReader [javac] location: class org.jaxen.pattern.PatternParser [javac] XPathReader reader = XPathReaderFactory.createReader(); [javac] [javac] /opt/local/var/db/dports/build/

file._opt_local_var_db_dports_sources_rsync.rsync.opendarwin.org_dpupdate_dports_java_jaxen/work/ jaxen-1.0-FCS/build/src/main/org/jaxen/pattern/PatternParser.java:93: cannot resolve symbol

[javac] symbol : variable XPathReaderFactory [javac] location: class org.jaxen.pattern.PatternParser [javac] XPathReader reader = XPathReaderFactory.createReader(); [javac] [javac] /opt/local/var/db/dports/build/

file._opt_local_var_db_dports_sources_rsync.rsync.opendarwin.org_dpupdate_dports_java_jaxen/work/ jaxen-1.0-FCS/build/src/main/org/jaxen/pattern/PatternParser.java:104: cannot resolve symbol

[javac] symbol : class XPathReader [javac] location: class org.jaxen.pattern.PatternParser [javac] XPathReader reader = XPathReaderFactory.createReader(); [javac] [javac] /opt/local/var/db/dports/build/

file._opt_local_var_db_dports_sources_rsync.rsync.opendarwin.org_dpupdate_dports_java_jaxen/work/ jaxen-1.0-FCS/build/src/main/org/jaxen/pattern/PatternParser.java:104: cannot resolve symbol

[javac] symbol : variable XPathReaderFactory [javac] location: class org.jaxen.pattern.PatternParser [javac] XPathReader reader = XPathReaderFactory.createReader(); [javac] [javac] /opt/local/var/db/dports/build/

file._opt_local_var_db_dports_sources_rsync.rsync.opendarwin.org_dpupdate_dports_java_jaxen/work/ jaxen-1.0-FCS/build/src/main/org/jaxen/pattern/PatternParser.java:171: cannot resolve symbol

[javac] symbol : variable Axis [javac] location: class org.jaxen.pattern.PatternParser

[javac] if ( axis == Axis.DESCENDANT
axis == Axis.DESCENDANT_OR_SELF )

[javac] [javac] /opt/local/var/db/dports/build/

file._opt_local_var_db_dports_sources_rsync.rsync.opendarwin.org_dpupdate_dports_java_jaxen/work/ jaxen-1.0-FCS/build/src/main/org/jaxen/pattern/PatternParser.java:171: cannot resolve symbol

[javac] symbol : variable Axis [javac] location: class org.jaxen.pattern.PatternParser

[javac] if ( axis == Axis.DESCENDANT
axis == Axis.DESCENDANT_OR_SELF )

[javac] [javac] /opt/local/var/db/dports/build/

file._opt_local_var_db_dports_sources_rsync.rsync.opendarwin.org_dpupdate_dports_java_jaxen/work/ jaxen-1.0-FCS/build/src/main/org/jaxen/pattern/PatternParser.java:197: cannot resolve symbol

[javac] symbol : variable Axis [javac] location: class org.jaxen.pattern.PatternParser [javac] if ( axis == Axis.ATTRIBUTE ) [javac] [javac] /opt/local/var/db/dports/build/

file._opt_local_var_db_dports_sources_rsync.rsync.opendarwin.org_dpupdate_dports_java_jaxen/work/ jaxen-1.0-FCS/build/src/main/org/jaxen/pattern/PatternParser.java:229: cannot resolve symbol

[javac] symbol : variable Axis [javac] location: class org.jaxen.pattern.PatternParser [javac] if ( axis == Axis.ATTRIBUTE ) [javac] [javac] /opt/local/var/db/dports/build/

file._opt_local_var_db_dports_sources_rsync.rsync.opendarwin.org_dpupdate_dports_java_jaxen/work/ jaxen-1.0-FCS/build/src/main/org/jaxen/pattern/PatternParser.java:237: cannot resolve symbol

[javac] symbol : variable Axis [javac] location: class org.jaxen.pattern.PatternParser [javac] if ( axis == Axis.ATTRIBUTE ) [javac] [javac] 77 errors

BUILD FAILED /opt/local/var/db/dports/build/ file._opt_local_var_db_dports_sources_rsync.rsync.opendarwin.org_dpupdate_dports_java_jaxen/work/ jaxen-1.0-FCS/build.xml:339: The following error occurred while executing this line: /opt/local/var/db/dports/build/ file._opt_local_var_db_dports_sources_rsync.rsync.opendarwin.org_dpupdate_dports_java_jaxen/work/ jaxen-1.0-FCS/build.xml:237: Compile failed; see the compiler error output for details.

Total time: 10 seconds Error: Target com.apple.build returned: shell command "cd "/opt/local/var/db/dports/build/ file._opt_local_var_db_dports_sources_rsync.rsync.opendarwin.org_dpupdate_dports_java_jaxen/work/ jaxen-1.0-FCS" && CLASSPATH=/opt/local/share/java/saxpath.jar:/opt/local/share/java/apache-ant/ ant.jar:/opt/local/share/java/junit.jar:/opt/local/share/java/xalan.jar:/opt/local/share/java/xml- apis.jar:/opt/local/share/java/dom4j.jar ant dist -Djunit.jar=/opt/local/share/java/junit.jar" returned error 1 Command output: [javac] location: class org.jaxen.pattern.PatternParser

[javac] if ( axis == Axis.DESCENDANT
axis == Axis.DESCENDANT_OR_SELF )

[javac] [javac] /opt/local/var/db/dports/build/

file._opt_local_var_db_dports_sources_rsync.rsync.opendarwin.org_dpupdate_dports_java_jaxen/work/ jaxen-1.0-FCS/build/src/main/org/jaxen/pattern/PatternParser.java:171: cannot resolve symbol

[javac] symbol : variable Axis [javac] location: class org.jaxen.pattern.PatternParser

[javac] if ( axis == Axis.DESCENDANT
axis == Axis.DESCENDANT_OR_SELF )

[javac] [javac] /opt/local/var/db/dports/build/

file._opt_local_var_db_dports_sources_rsync.rsync.opendarwin.org_dpupdate_dports_java_jaxen/work/ jaxen-1.0-FCS/build/src/main/org/jaxen/pattern/PatternParser.java:197: cannot resolve symbol

[javac] symbol : variable Axis [javac] location: class org.jaxen.pattern.PatternParser [javac] if ( axis == Axis.ATTRIBUTE ) [javac] [javac] /opt/local/var/db/dports/build/

file._opt_local_var_db_dports_sources_rsync.rsync.opendarwin.org_dpupdate_dports_java_jaxen/work/ jaxen-1.0-FCS/build/src/main/org/jaxen/pattern/PatternParser.java:229: cannot resolve symbol

[javac] symbol : variable Axis [javac] location: class org.jaxen.pattern.PatternParser [javac] if ( axis == Axis.ATTRIBUTE ) [javac] [javac] /opt/local/var/db/dports/build/

file._opt_local_var_db_dports_sources_rsync.rsync.opendarwin.org_dpupdate_dports_java_jaxen/work/ jaxen-1.0-FCS/build/src/main/org/jaxen/pattern/PatternParser.java:237: cannot resolve symbol

[javac] symbol : variable Axis [javac] location: class org.jaxen.pattern.PatternParser [javac] if ( axis == Axis.ATTRIBUTE ) [javac] [javac] 77 errors

BUILD FAILED /opt/local/var/db/dports/build/ file._opt_local_var_db_dports_sources_rsync.rsync.opendarwin.org_dpupdate_dports_java_jaxen/work/ jaxen-1.0-FCS/build.xml:339: The following error occurred while executing this line: /opt/local/var/db/dports/build/ file._opt_local_var_db_dports_sources_rsync.rsync.opendarwin.org_dpupdate_dports_java_jaxen/work/ jaxen-1.0-FCS/build.xml:237: Compile failed; see the compiler error output for details.

Total time: 10 seconds

Warning: the following items did not execute (for jaxen): com.apple.activate com.apple.build com.apple.destroot com.apple.archive com.apple.install AlBook:~ lrivers$

Change History (8)

comment:1 Changed 15 years ago by blb@…

Owner: changed from darwinports-bugs@… to mww@…

Assigning to maintainer.

comment:2 Changed 15 years ago by lrivers@…

I'm experiencing this as well.

$ sudo port -dvv install jaxen DEBUG: Found port in file:///opt/local/var/db/dports/sources/ rsync.rsync.opendarwin.org_dpupdate_dports/java/jaxen DEBUG: Changing to port directory: /opt/local/var/db/dports/sources/ rsync.rsync.opendarwin.org_dpupdate_dports/java/jaxen DEBUG: Requested variant powerpc is not provided by port jaxen. DEBUG: Requested variant darwin is not provided by port jaxen. DEBUG: Requested variant macosx is not provided by port jaxen. DEBUG: Found port in file:///opt/local/var/db/dports/sources/ rsync.rsync.opendarwin.org_dpupdate_dports/java/dom4j DEBUG: Changing to port directory: /opt/local/var/db/dports/sources/ rsync.rsync.opendarwin.org_dpupdate_dports/java/dom4j DEBUG: Searching for dependency: dom4j DEBUG: Didn't find receipt, going to depspec regex for: dom4j DEBUG: Found Dependency: path: /usr/bin filename: java regex: java$ DEBUG: Found port in file:///opt/local/var/db/dports/sources/ rsync.rsync.opendarwin.org_dpupdate_dports/devel/apache-ant DEBUG: Changing to port directory: /opt/local/var/db/dports/sources/ rsync.rsync.opendarwin.org_dpupdate_dports/devel/apache-ant DEBUG: Searching for dependency: apache-ant DEBUG: Didn't find receipt, going to depspec regex for: apache-ant DEBUG: Found Dependency: path: /usr/bin filename: ant regex: ant$ DEBUG: Skipping completed com.apple.main (jaxen) DEBUG: Skipping completed com.apple.unarchive (jaxen) DEBUG: Skipping completed com.apple.fetch (jaxen) DEBUG: Skipping completed com.apple.checksum (jaxen) DEBUG: Skipping completed com.apple.extract (jaxen) DEBUG: Skipping completed com.apple.patch (jaxen) DEBUG: Skipping completed com.apple.configure (jaxen) ---> Building jaxen with target dist DEBUG: Executing com.apple.build (jaxen) DEBUG: Assembled command: 'cd "/opt/local/var/db/dports/build/ file._opt_local_var_db_dports_sources_rsync.rsync.opendarwin.org_dpupdate_dports_java_jaxen/work/ jaxen-1.0-FCS" && CLASSPATH=/opt/local/share/java/saxpath.jar:/opt/local/share/java/apache-ant/ ant.jar:/opt/local/share/java/junit.jar:/opt/local/share/java/xalan.jar:/opt/local/share/java/xml- apis.jar:/opt/local/share/java/dom4j.jar ant dist -Djunit.jar=/opt/local/share/java/junit.jar' Buildfile: build.xml

init:

[echo] ----------- Jaxen 1.0-FCS [2002] ------------

prepare:

prepare.core:

compile.core:

internal.compile:

[javac] Compiling 154 source files to /opt/local/var/db/dports/build/

file._opt_local_var_db_dports_sources_rsync.rsync.opendarwin.org_dpupdate_dports_java_jaxen/work/ jaxen-1.0-FCS/build/classes/main

[javac] This version of java does not support the classic compiler; upgrading to modern [javac] /opt/local/var/db/dports/build/

file._opt_local_var_db_dports_sources_rsync.rsync.opendarwin.org_dpupdate_dports_java_jaxen/work/ jaxen-1.0-FCS/build/src/main/org/jaxen/BaseXPath.java:71: package org.saxpath does not exist

[javac] import org.saxpath.XPathReader; [javac] [javac] /opt/local/var/db/dports/build/

file._opt_local_var_db_dports_sources_rsync.rsync.opendarwin.org_dpupdate_dports_java_jaxen/work/ jaxen-1.0-FCS/build/src/main/org/jaxen/BaseXPath.java:72: package org.saxpath does not exist

[javac] import org.saxpath.SAXPathException; [javac] [javac] /opt/local/var/db/dports/build/

file._opt_local_var_db_dports_sources_rsync.rsync.opendarwin.org_dpupdate_dports_java_jaxen/work/ jaxen-1.0-FCS/build/src/main/org/jaxen/BaseXPath.java:73: package org.saxpath.helpers does not exist

[javac] import org.saxpath.helpers.XPathReaderFactory; [javac] [javac] /opt/local/var/db/dports/build/

file._opt_local_var_db_dports_sources_rsync.rsync.opendarwin.org_dpupdate_dports_java_jaxen/work/ jaxen-1.0-FCS/build/src/main/org/jaxen/Navigator.java:69: package org.saxpath does not exist

[javac] import org.saxpath.SAXPathException; [javac] [javac] /opt/local/var/db/dports/build/

file._opt_local_var_db_dports_sources_rsync.rsync.opendarwin.org_dpupdate_dports_java_jaxen/work/ jaxen-1.0-FCS/build/src/main/org/jaxen/JaxenException.java:65: package org.saxpath does not exist

[javac] import org.saxpath.SAXPathException; [javac] [javac] /opt/local/var/db/dports/build/

file._opt_local_var_db_dports_sources_rsync.rsync.opendarwin.org_dpupdate_dports_java_jaxen/work/ jaxen-1.0-FCS/build/src/main/org/jaxen/JaxenException.java:75: cannot resolve symbol

[javac] symbol : class SAXPathException [javac] location: class org.jaxen.JaxenException [javac] public class JaxenException extends SAXPathException [javac] [javac] /opt/local/var/db/dports/build/

file._opt_local_var_db_dports_sources_rsync.rsync.opendarwin.org_dpupdate_dports_java_jaxen/work/ jaxen-1.0-FCS/build/src/main/org/jaxen/Navigator.java:509: cannot resolve symbol

[javac] symbol : class SAXPathException [javac] location: interface org.jaxen.Navigator [javac] XPath parseXPath(String xpath) throws SAXPathException; [javac] [javac] /opt/local/var/db/dports/build/

file._opt_local_var_db_dports_sources_rsync.rsync.opendarwin.org_dpupdate_dports_java_jaxen/work/ jaxen-1.0-FCS/build/src/main/org/jaxen/JaxenHandler.java:77: package org.saxpath does not exist

[javac] import org.saxpath.XPathHandler; [javac] [javac] /opt/local/var/db/dports/build/

file._opt_local_var_db_dports_sources_rsync.rsync.opendarwin.org_dpupdate_dports_java_jaxen/work/ jaxen-1.0-FCS/build/src/main/org/jaxen/JaxenHandler.java:78: package org.saxpath does not exist

[javac] import org.saxpath.Axis; [javac] [javac] /opt/local/var/db/dports/build/

file._opt_local_var_db_dports_sources_rsync.rsync.opendarwin.org_dpupdate_dports_java_jaxen/work/ jaxen-1.0-FCS/build/src/main/org/jaxen/JaxenHandler.java:79: package org.saxpath does not exist

[javac] import org.saxpath.Operator; [javac] [javac] /opt/local/var/db/dports/build/

file._opt_local_var_db_dports_sources_rsync.rsync.opendarwin.org_dpupdate_dports_java_jaxen/work/ jaxen-1.0-FCS/build/src/main/org/jaxen/JaxenHandler.java:90: cannot resolve symbol

[javac] symbol : class XPathHandler [javac] location: class org.jaxen.JaxenHandler [javac] public class JaxenHandler implements XPathHandler [javac] [javac] /opt/local/var/db/dports/build/

file._opt_local_var_db_dports_sources_rsync.rsync.opendarwin.org_dpupdate_dports_java_jaxen/work/ jaxen-1.0-FCS/build/src/main/org/jaxen/expr/XPathFactory.java:68: package org.saxpath does not exist

[javac] import org.saxpath.Operator; [javac] [javac] /opt/local/var/db/dports/build/

file._opt_local_var_db_dports_sources_rsync.rsync.opendarwin.org_dpupdate_dports_java_jaxen/work/ jaxen-1.0-FCS/build/src/main/org/jaxen/expr/XPathFactory.java:70: cannot resolve symbol

[javac] symbol : class Operator [javac] location: interface org.jaxen.expr.XPathFactory [javac] public interface XPathFactory extends Operator [javac] [javac] /opt/local/var/db/dports/build/

file._opt_local_var_db_dports_sources_rsync.rsync.opendarwin.org_dpupdate_dports_java_jaxen/work/ jaxen-1.0-FCS/build/src/main/org/jaxen/expr/DefaultStep.java:73: package org.saxpath does not exist

[javac] import org.saxpath.Axis; [javac] [javac] /opt/local/var/db/dports/build/

file._opt_local_var_db_dports_sources_rsync.rsync.opendarwin.org_dpupdate_dports_java_jaxen/work/ jaxen-1.0-FCS/build/src/main/org/jaxen/expr/DefaultXPathFactory.java:70: package org.saxpath does not exist

[javac] import org.saxpath.Axis; [javac] [javac] /opt/local/var/db/dports/build/

file._opt_local_var_db_dports_sources_rsync.rsync.opendarwin.org_dpupdate_dports_java_jaxen/work/ jaxen-1.0-FCS/build/src/main/org/jaxen/function/ext/EvaluateFunction.java:76: package org.saxpath does not exist

[javac] import org.saxpath.SAXPathException; [javac] [javac] /opt/local/var/db/dports/build/

file._opt_local_var_db_dports_sources_rsync.rsync.opendarwin.org_dpupdate_dports_java_jaxen/work/ jaxen-1.0-FCS/build/src/main/org/jaxen/pattern/PatternHandler.java:75: package org.saxpath does not exist

[javac] import org.saxpath.XPathHandler; [javac] [javac] /opt/local/var/db/dports/build/

file._opt_local_var_db_dports_sources_rsync.rsync.opendarwin.org_dpupdate_dports_java_jaxen/work/ jaxen-1.0-FCS/build/src/main/org/jaxen/pattern/PatternHandler.java:76: package org.saxpath does not exist

[javac] import org.saxpath.Axis; [javac] [javac] /opt/local/var/db/dports/build/

file._opt_local_var_db_dports_sources_rsync.rsync.opendarwin.org_dpupdate_dports_java_jaxen/work/ jaxen-1.0-FCS/build/src/main/org/jaxen/pattern/PatternHandler.java:77: package org.saxpath does not exist

[javac] import org.saxpath.Operator; [javac] [javac] /opt/local/var/db/dports/build/

file._opt_local_var_db_dports_sources_rsync.rsync.opendarwin.org_dpupdate_dports_java_jaxen/work/ jaxen-1.0-FCS/build/src/main/org/jaxen/pattern/PatternParser.java:73: package org.saxpath does not exist

[javac] import org.saxpath.Axis; [javac] [javac] /opt/local/var/db/dports/build/

file._opt_local_var_db_dports_sources_rsync.rsync.opendarwin.org_dpupdate_dports_java_jaxen/work/ jaxen-1.0-FCS/build/src/main/org/jaxen/pattern/PatternParser.java:74: package org.saxpath does not exist

[javac] import org.saxpath.SAXPathException; [javac] [javac] /opt/local/var/db/dports/build/

file._opt_local_var_db_dports_sources_rsync.rsync.opendarwin.org_dpupdate_dports_java_jaxen/work/ jaxen-1.0-FCS/build/src/main/org/jaxen/pattern/PatternParser.java:75: package org.saxpath does not exist

[javac] import org.saxpath.XPathReader; [javac] [javac] /opt/local/var/db/dports/build/

file._opt_local_var_db_dports_sources_rsync.rsync.opendarwin.org_dpupdate_dports_java_jaxen/work/ jaxen-1.0-FCS/build/src/main/org/jaxen/pattern/PatternParser.java:76: package org.saxpath does not exist

[javac] import org.saxpath.XPathSyntaxException; [javac] [javac] /opt/local/var/db/dports/build/

file._opt_local_var_db_dports_sources_rsync.rsync.opendarwin.org_dpupdate_dports_java_jaxen/work/ jaxen-1.0-FCS/build/src/main/org/jaxen/pattern/PatternParser.java:77: package org.saxpath.helpers does not exist

[javac] import org.saxpath.helpers.XPathReaderFactory; [javac] [javac] /opt/local/var/db/dports/build/

file._opt_local_var_db_dports_sources_rsync.rsync.opendarwin.org_dpupdate_dports_java_jaxen/work/ jaxen-1.0-FCS/build/src/main/org/jaxen/pattern/PatternParser.java:89: cannot resolve symbol

[javac] symbol : class SAXPathException [javac] location: class org.jaxen.pattern.PatternParser [javac] public static Pattern parse(String text) throws JaxenException, SAXPathException [javac] [javac] /opt/local/var/db/dports/build/

file._opt_local_var_db_dports_sources_rsync.rsync.opendarwin.org_dpupdate_dports_java_jaxen/work/ jaxen-1.0-FCS/build/src/main/org/jaxen/BaseXPath.java:124: cannot resolve symbol

[javac] symbol : class XPathReader [javac] location: class org.jaxen.BaseXPath [javac] XPathReader reader = XPathReaderFactory.createReader(); [javac] [javac] /opt/local/var/db/dports/build/

file._opt_local_var_db_dports_sources_rsync.rsync.opendarwin.org_dpupdate_dports_java_jaxen/work/ jaxen-1.0-FCS/build/src/main/org/jaxen/BaseXPath.java:124: cannot resolve symbol

[javac] symbol : variable XPathReaderFactory [javac] location: class org.jaxen.BaseXPath [javac] XPathReader reader = XPathReaderFactory.createReader(); [javac] [javac] /opt/local/var/db/dports/build/

file._opt_local_var_db_dports_sources_rsync.rsync.opendarwin.org_dpupdate_dports_java_jaxen/work/ jaxen-1.0-FCS/build/src/main/org/jaxen/BaseXPath.java:134: package org.saxpath does not exist

[javac] catch (org.saxpath.XPathSyntaxException e) [javac] [javac] /opt/local/var/db/dports/build/

file._opt_local_var_db_dports_sources_rsync.rsync.opendarwin.org_dpupdate_dports_java_jaxen/work/ jaxen-1.0-FCS/build/src/main/org/jaxen/BaseXPath.java:140: cannot resolve symbol

[javac] symbol : class SAXPathException [javac] location: class org.jaxen.BaseXPath [javac] catch (SAXPathException e) [javac] [javac] /opt/local/var/db/dports/build/

file._opt_local_var_db_dports_sources_rsync.rsync.opendarwin.org_dpupdate_dports_java_jaxen/work/ jaxen-1.0-FCS/build/src/main/org/jaxen/FunctionCallException.java:96: cannot resolve symbol

[javac] symbol : method printStackTrace () [javac] location: class org.jaxen.JaxenException [javac] super.printStackTrace(); [javac] [javac] /opt/local/var/db/dports/build/

file._opt_local_var_db_dports_sources_rsync.rsync.opendarwin.org_dpupdate_dports_java_jaxen/work/ jaxen-1.0-FCS/build/src/main/org/jaxen/FunctionCallException.java:105: cannot resolve symbol

[javac] symbol : method printStackTrace () [javac] location: class org.jaxen.JaxenException [javac] super.printStackTrace(); [javac] [javac] /opt/local/var/db/dports/build/

file._opt_local_var_db_dports_sources_rsync.rsync.opendarwin.org_dpupdate_dports_java_jaxen/work/ jaxen-1.0-FCS/build/src/main/org/jaxen/FunctionCallException.java:114: cannot resolve symbol

[javac] symbol : method printStackTrace () [javac] location: class org.jaxen.JaxenException [javac] super.printStackTrace(); [javac] [javac] /opt/local/var/db/dports/build/

file._opt_local_var_db_dports_sources_rsync.rsync.opendarwin.org_dpupdate_dports_java_jaxen/work/ jaxen-1.0-FCS/build/src/main/org/jaxen/FunctionCallException.java:124: cannot resolve symbol

[javac] symbol : method fillInStackTrace () [javac] location: class org.jaxen.JaxenException [javac] return super.fillInStackTrace(); [javac] [javac] /opt/local/var/db/dports/build/

file._opt_local_var_db_dports_sources_rsync.rsync.opendarwin.org_dpupdate_dports_java_jaxen/work/ jaxen-1.0-FCS/build/src/main/org/jaxen/JaxenHandler.java:469: cannot resolve symbol

[javac] symbol : variable Operator [javac] location: class org.jaxen.JaxenHandler [javac] if ( operator != Operator.NO_OP ) [javac] [javac] /opt/local/var/db/dports/build/

file._opt_local_var_db_dports_sources_rsync.rsync.opendarwin.org_dpupdate_dports_java_jaxen/work/ jaxen-1.0-FCS/build/src/main/org/jaxen/JaxenHandler.java:491: cannot resolve symbol

[javac] symbol : variable Operator [javac] location: class org.jaxen.JaxenHandler [javac] if ( operator != Operator.NO_OP ) [javac] [javac] /opt/local/var/db/dports/build/

file._opt_local_var_db_dports_sources_rsync.rsync.opendarwin.org_dpupdate_dports_java_jaxen/work/ jaxen-1.0-FCS/build/src/main/org/jaxen/JaxenHandler.java:513: cannot resolve symbol

[javac] symbol : variable Operator [javac] location: class org.jaxen.JaxenHandler [javac] if ( operator != Operator.NO_OP ) [javac] [javac] /opt/local/var/db/dports/build/

file._opt_local_var_db_dports_sources_rsync.rsync.opendarwin.org_dpupdate_dports_java_jaxen/work/ jaxen-1.0-FCS/build/src/main/org/jaxen/JaxenHandler.java:535: cannot resolve symbol

[javac] symbol : variable Operator [javac] location: class org.jaxen.JaxenHandler [javac] if ( operator != Operator.NO_OP ) [javac] [javac] /opt/local/var/db/dports/build/

file._opt_local_var_db_dports_sources_rsync.rsync.opendarwin.org_dpupdate_dports_java_jaxen/work/ jaxen-1.0-FCS/build/src/main/org/jaxen/JaxenHandler.java:557: cannot resolve symbol

[javac] symbol : variable Operator [javac] location: class org.jaxen.JaxenHandler [javac] if ( operator != Operator.NO_OP ) [javac] [javac] /opt/local/var/db/dports/build/

file._opt_local_var_db_dports_sources_rsync.rsync.opendarwin.org_dpupdate_dports_java_jaxen/work/ jaxen-1.0-FCS/build/src/main/org/jaxen/XPathSyntaxException.java:159: cannot resolve symbol

[javac] symbol : method getMessage () [javac] location: class org.jaxen.XPathSyntaxException [javac] buf.append( getMessage() ); [javac] [javac] /opt/local/var/db/dports/build/

file._opt_local_var_db_dports_sources_rsync.rsync.opendarwin.org_dpupdate_dports_java_jaxen/work/ jaxen-1.0-FCS/build/src/main/org/jaxen/expr/DefaultStep.java:118: cannot resolve symbol

[javac] symbol : variable Axis [javac] location: class org.jaxen.expr.DefaultStep [javac] return Axis.lookup( getAxis() ); [javac] [javac] /opt/local/var/db/dports/build/

file._opt_local_var_db_dports_sources_rsync.rsync.opendarwin.org_dpupdate_dports_java_jaxen/work/ jaxen-1.0-FCS/build/src/main/org/jaxen/expr/DefaultXPathFactory.java:116: cannot resolve symbol

[javac] symbol : variable EQUALS [javac] location: class org.jaxen.expr.DefaultXPathFactory [javac] case EQUALS: [javac] [javac] /opt/local/var/db/dports/build/

file._opt_local_var_db_dports_sources_rsync.rsync.opendarwin.org_dpupdate_dports_java_jaxen/work/ jaxen-1.0-FCS/build/src/main/org/jaxen/expr/DefaultXPathFactory.java:121: cannot resolve symbol

[javac] symbol : variable NOT_EQUALS [javac] location: class org.jaxen.expr.DefaultXPathFactory [javac] case NOT_EQUALS: [javac] [javac] /opt/local/var/db/dports/build/

file._opt_local_var_db_dports_sources_rsync.rsync.opendarwin.org_dpupdate_dports_java_jaxen/work/ jaxen-1.0-FCS/build/src/main/org/jaxen/expr/DefaultXPathFactory.java:137: cannot resolve symbol

[javac] symbol : variable LESS_THAN [javac] location: class org.jaxen.expr.DefaultXPathFactory [javac] case LESS_THAN: [javac] [javac] /opt/local/var/db/dports/build/

file._opt_local_var_db_dports_sources_rsync.rsync.opendarwin.org_dpupdate_dports_java_jaxen/work/ jaxen-1.0-FCS/build/src/main/org/jaxen/expr/DefaultXPathFactory.java:142: cannot resolve symbol

[javac] symbol : variable GREATER_THAN [javac] location: class org.jaxen.expr.DefaultXPathFactory [javac] case GREATER_THAN: [javac] [javac] /opt/local/var/db/dports/build/

file._opt_local_var_db_dports_sources_rsync.rsync.opendarwin.org_dpupdate_dports_java_jaxen/work/ jaxen-1.0-FCS/build/src/main/org/jaxen/expr/DefaultXPathFactory.java:147: cannot resolve symbol

[javac] symbol : variable LESS_THAN_EQUALS [javac] location: class org.jaxen.expr.DefaultXPathFactory [javac] case LESS_THAN_EQUALS: [javac] [javac] /opt/local/var/db/dports/build/

file._opt_local_var_db_dports_sources_rsync.rsync.opendarwin.org_dpupdate_dports_java_jaxen/work/ jaxen-1.0-FCS/build/src/main/org/jaxen/expr/DefaultXPathFactory.java:152: cannot resolve symbol

[javac] symbol : variable GREATER_THAN_EQUALS [javac] location: class org.jaxen.expr.DefaultXPathFactory [javac] case GREATER_THAN_EQUALS: [javac] [javac] /opt/local/var/db/dports/build/

file._opt_local_var_db_dports_sources_rsync.rsync.opendarwin.org_dpupdate_dports_java_jaxen/work/ jaxen-1.0-FCS/build/src/main/org/jaxen/expr/DefaultXPathFactory.java:168: cannot resolve symbol

[javac] symbol : variable ADD [javac] location: class org.jaxen.expr.DefaultXPathFactory [javac] case ADD: [javac] [javac] /opt/local/var/db/dports/build/

file._opt_local_var_db_dports_sources_rsync.rsync.opendarwin.org_dpupdate_dports_java_jaxen/work/ jaxen-1.0-FCS/build/src/main/org/jaxen/expr/DefaultXPathFactory.java:173: cannot resolve symbol

[javac] symbol : variable SUBTRACT [javac] location: class org.jaxen.expr.DefaultXPathFactory [javac] case SUBTRACT: [javac] [javac] /opt/local/var/db/dports/build/

file._opt_local_var_db_dports_sources_rsync.rsync.opendarwin.org_dpupdate_dports_java_jaxen/work/ jaxen-1.0-FCS/build/src/main/org/jaxen/expr/DefaultXPathFactory.java:189: cannot resolve symbol

[javac] symbol : variable MULTIPLY [javac] location: class org.jaxen.expr.DefaultXPathFactory [javac] case MULTIPLY: [javac] [javac] /opt/local/var/db/dports/build/

file._opt_local_var_db_dports_sources_rsync.rsync.opendarwin.org_dpupdate_dports_java_jaxen/work/ jaxen-1.0-FCS/build/src/main/org/jaxen/expr/DefaultXPathFactory.java:194: cannot resolve symbol

[javac] symbol : variable DIV [javac] location: class org.jaxen.expr.DefaultXPathFactory [javac] case DIV: [javac] [javac] /opt/local/var/db/dports/build/

file._opt_local_var_db_dports_sources_rsync.rsync.opendarwin.org_dpupdate_dports_java_jaxen/work/ jaxen-1.0-FCS/build/src/main/org/jaxen/expr/DefaultXPathFactory.java:199: cannot resolve symbol

[javac] symbol : variable MOD [javac] location: class org.jaxen.expr.DefaultXPathFactory [javac] case MOD: [javac] [javac] /opt/local/var/db/dports/build/

file._opt_local_var_db_dports_sources_rsync.rsync.opendarwin.org_dpupdate_dports_java_jaxen/work/ jaxen-1.0-FCS/build/src/main/org/jaxen/expr/DefaultXPathFactory.java:214: cannot resolve symbol

[javac] symbol : variable NEGATIVE [javac] location: class org.jaxen.expr.DefaultXPathFactory [javac] case NEGATIVE: [javac] [javac] /opt/local/var/db/dports/build/

file._opt_local_var_db_dports_sources_rsync.rsync.opendarwin.org_dpupdate_dports_java_jaxen/work/ jaxen-1.0-FCS/build/src/main/org/jaxen/expr/DefaultXPathFactory.java:317: cannot resolve symbol

[javac] symbol : variable Axis [javac] location: class org.jaxen.expr.DefaultXPathFactory [javac] case Axis.CHILD: [javac] [javac] /opt/local/var/db/dports/build/

file._opt_local_var_db_dports_sources_rsync.rsync.opendarwin.org_dpupdate_dports_java_jaxen/work/ jaxen-1.0-FCS/build/src/main/org/jaxen/expr/DefaultXPathFactory.java:322: cannot resolve symbol

[javac] symbol : variable Axis [javac] location: class org.jaxen.expr.DefaultXPathFactory [javac] case Axis.DESCENDANT: [javac] [javac] /opt/local/var/db/dports/build/

file._opt_local_var_db_dports_sources_rsync.rsync.opendarwin.org_dpupdate_dports_java_jaxen/work/ jaxen-1.0-FCS/build/src/main/org/jaxen/expr/DefaultXPathFactory.java:327: cannot resolve symbol

[javac] symbol : variable Axis [javac] location: class org.jaxen.expr.DefaultXPathFactory [javac] case Axis.PARENT: [javac] [javac] /opt/local/var/db/dports/build/

file._opt_local_var_db_dports_sources_rsync.rsync.opendarwin.org_dpupdate_dports_java_jaxen/work/ jaxen-1.0-FCS/build/src/main/org/jaxen/expr/DefaultXPathFactory.java:332: cannot resolve symbol

[javac] symbol : variable Axis [javac] location: class org.jaxen.expr.DefaultXPathFactory [javac] case Axis.FOLLOWING_SIBLING: [javac] [javac] /opt/local/var/db/dports/build/

file._opt_local_var_db_dports_sources_rsync.rsync.opendarwin.org_dpupdate_dports_java_jaxen/work/ jaxen-1.0-FCS/build/src/main/org/jaxen/expr/DefaultXPathFactory.java:337: cannot resolve symbol

[javac] symbol : variable Axis [javac] location: class org.jaxen.expr.DefaultXPathFactory [javac] case Axis.PRECEDING_SIBLING: [javac] [javac] /opt/local/var/db/dports/build/

file._opt_local_var_db_dports_sources_rsync.rsync.opendarwin.org_dpupdate_dports_java_jaxen/work/ jaxen-1.0-FCS/build/src/main/org/jaxen/expr/DefaultXPathFactory.java:342: cannot resolve symbol

[javac] symbol : variable Axis [javac] location: class org.jaxen.expr.DefaultXPathFactory [javac] case Axis.FOLLOWING: [javac] [javac] /opt/local/var/db/dports/build/

file._opt_local_var_db_dports_sources_rsync.rsync.opendarwin.org_dpupdate_dports_java_jaxen/work/ jaxen-1.0-FCS/build/src/main/org/jaxen/expr/DefaultXPathFactory.java:347: cannot resolve symbol

[javac] symbol : variable Axis [javac] location: class org.jaxen.expr.DefaultXPathFactory [javac] case Axis.PRECEDING: [javac] [javac] /opt/local/var/db/dports/build/

file._opt_local_var_db_dports_sources_rsync.rsync.opendarwin.org_dpupdate_dports_java_jaxen/work/ jaxen-1.0-FCS/build/src/main/org/jaxen/expr/DefaultXPathFactory.java:352: cannot resolve symbol

[javac] symbol : variable Axis [javac] location: class org.jaxen.expr.DefaultXPathFactory [javac] case Axis.ATTRIBUTE: [javac] [javac] /opt/local/var/db/dports/build/

file._opt_local_var_db_dports_sources_rsync.rsync.opendarwin.org_dpupdate_dports_java_jaxen/work/ jaxen-1.0-FCS/build/src/main/org/jaxen/expr/DefaultXPathFactory.java:357: cannot resolve symbol

[javac] symbol : variable Axis [javac] location: class org.jaxen.expr.DefaultXPathFactory [javac] case Axis.NAMESPACE: [javac] [javac] /opt/local/var/db/dports/build/

file._opt_local_var_db_dports_sources_rsync.rsync.opendarwin.org_dpupdate_dports_java_jaxen/work/ jaxen-1.0-FCS/build/src/main/org/jaxen/expr/DefaultXPathFactory.java:362: cannot resolve symbol

[javac] symbol : variable Axis [javac] location: class org.jaxen.expr.DefaultXPathFactory [javac] case Axis.SELF: [javac] [javac] /opt/local/var/db/dports/build/

file._opt_local_var_db_dports_sources_rsync.rsync.opendarwin.org_dpupdate_dports_java_jaxen/work/ jaxen-1.0-FCS/build/src/main/org/jaxen/expr/DefaultXPathFactory.java:367: cannot resolve symbol

[javac] symbol : variable Axis [javac] location: class org.jaxen.expr.DefaultXPathFactory [javac] case Axis.DESCENDANT_OR_SELF: [javac] [javac] /opt/local/var/db/dports/build/

file._opt_local_var_db_dports_sources_rsync.rsync.opendarwin.org_dpupdate_dports_java_jaxen/work/ jaxen-1.0-FCS/build/src/main/org/jaxen/expr/DefaultXPathFactory.java:372: cannot resolve symbol

[javac] symbol : variable Axis [javac] location: class org.jaxen.expr.DefaultXPathFactory [javac] case Axis.ANCESTOR_OR_SELF: [javac] [javac] /opt/local/var/db/dports/build/

file._opt_local_var_db_dports_sources_rsync.rsync.opendarwin.org_dpupdate_dports_java_jaxen/work/ jaxen-1.0-FCS/build/src/main/org/jaxen/expr/DefaultXPathFactory.java:377: cannot resolve symbol

[javac] symbol : variable Axis [javac] location: class org.jaxen.expr.DefaultXPathFactory [javac] case Axis.ANCESTOR: [javac] [javac] /opt/local/var/db/dports/build/

file._opt_local_var_db_dports_sources_rsync.rsync.opendarwin.org_dpupdate_dports_java_jaxen/work/ jaxen-1.0-FCS/build/src/main/org/jaxen/function/ext/EvaluateFunction.java:120: cannot resolve symbol

[javac] symbol : class SAXPathException [javac] location: class org.jaxen.function.ext.EvaluateFunction [javac] catch ( SAXPathException e ) { [javac] [javac] /opt/local/var/db/dports/build/

file._opt_local_var_db_dports_sources_rsync.rsync.opendarwin.org_dpupdate_dports_java_jaxen/work/ jaxen-1.0-FCS/build/src/main/org/jaxen/pattern/PatternHandler.java:274: cannot resolve symbol

[javac] symbol : variable Axis [javac] location: class org.jaxen.pattern.PatternHandler [javac] case Axis.ATTRIBUTE: [javac] [javac] /opt/local/var/db/dports/build/

file._opt_local_var_db_dports_sources_rsync.rsync.opendarwin.org_dpupdate_dports_java_jaxen/work/ jaxen-1.0-FCS/build/src/main/org/jaxen/pattern/PatternHandler.java:277: cannot resolve symbol

[javac] symbol : variable Axis [javac] location: class org.jaxen.pattern.PatternHandler [javac] case Axis.NAMESPACE: [javac] [javac] /opt/local/var/db/dports/build/

file._opt_local_var_db_dports_sources_rsync.rsync.opendarwin.org_dpupdate_dports_java_jaxen/work/ jaxen-1.0-FCS/build/src/main/org/jaxen/pattern/PatternParser.java:93: cannot resolve symbol

[javac] symbol : class XPathReader [javac] location: class org.jaxen.pattern.PatternParser [javac] XPathReader reader = XPathReaderFactory.createReader(); [javac] [javac] /opt/local/var/db/dports/build/

file._opt_local_var_db_dports_sources_rsync.rsync.opendarwin.org_dpupdate_dports_java_jaxen/work/ jaxen-1.0-FCS/build/src/main/org/jaxen/pattern/PatternParser.java:93: cannot resolve symbol

[javac] symbol : variable XPathReaderFactory [javac] location: class org.jaxen.pattern.PatternParser [javac] XPathReader reader = XPathReaderFactory.createReader(); [javac] [javac] /opt/local/var/db/dports/build/

file._opt_local_var_db_dports_sources_rsync.rsync.opendarwin.org_dpupdate_dports_java_jaxen/work/ jaxen-1.0-FCS/build/src/main/org/jaxen/pattern/PatternParser.java:104: cannot resolve symbol

[javac] symbol : class XPathReader [javac] location: class org.jaxen.pattern.PatternParser [javac] XPathReader reader = XPathReaderFactory.createReader(); [javac] [javac] /opt/local/var/db/dports/build/

file._opt_local_var_db_dports_sources_rsync.rsync.opendarwin.org_dpupdate_dports_java_jaxen/work/ jaxen-1.0-FCS/build/src/main/org/jaxen/pattern/PatternParser.java:104: cannot resolve symbol

[javac] symbol : variable XPathReaderFactory [javac] location: class org.jaxen.pattern.PatternParser [javac] XPathReader reader = XPathReaderFactory.createReader(); [javac] [javac] /opt/local/var/db/dports/build/

file._opt_local_var_db_dports_sources_rsync.rsync.opendarwin.org_dpupdate_dports_java_jaxen/work/ jaxen-1.0-FCS/build/src/main/org/jaxen/pattern/PatternParser.java:171: cannot resolve symbol

[javac] symbol : variable Axis [javac] location: class org.jaxen.pattern.PatternParser

[javac] if ( axis == Axis.DESCENDANT
axis == Axis.DESCENDANT_OR_SELF )

[javac] [javac] /opt/local/var/db/dports/build/

file._opt_local_var_db_dports_sources_rsync.rsync.opendarwin.org_dpupdate_dports_java_jaxen/work/ jaxen-1.0-FCS/build/src/main/org/jaxen/pattern/PatternParser.java:171: cannot resolve symbol

[javac] symbol : variable Axis [javac] location: class org.jaxen.pattern.PatternParser

[javac] if ( axis == Axis.DESCENDANT
axis == Axis.DESCENDANT_OR_SELF )

[javac] [javac] /opt/local/var/db/dports/build/

file._opt_local_var_db_dports_sources_rsync.rsync.opendarwin.org_dpupdate_dports_java_jaxen/work/ jaxen-1.0-FCS/build/src/main/org/jaxen/pattern/PatternParser.java:197: cannot resolve symbol

[javac] symbol : variable Axis [javac] location: class org.jaxen.pattern.PatternParser [javac] if ( axis == Axis.ATTRIBUTE ) [javac] [javac] /opt/local/var/db/dports/build/

file._opt_local_var_db_dports_sources_rsync.rsync.opendarwin.org_dpupdate_dports_java_jaxen/work/ jaxen-1.0-FCS/build/src/main/org/jaxen/pattern/PatternParser.java:229: cannot resolve symbol

[javac] symbol : variable Axis [javac] location: class org.jaxen.pattern.PatternParser [javac] if ( axis == Axis.ATTRIBUTE ) [javac] [javac] /opt/local/var/db/dports/build/

file._opt_local_var_db_dports_sources_rsync.rsync.opendarwin.org_dpupdate_dports_java_jaxen/work/ jaxen-1.0-FCS/build/src/main/org/jaxen/pattern/PatternParser.java:237: cannot resolve symbol

[javac] symbol : variable Axis [javac] location: class org.jaxen.pattern.PatternParser [javac] if ( axis == Axis.ATTRIBUTE ) [javac] [javac] 77 errors

BUILD FAILED /opt/local/var/db/dports/build/ file._opt_local_var_db_dports_sources_rsync.rsync.opendarwin.org_dpupdate_dports_java_jaxen/work/ jaxen-1.0-FCS/build.xml:339: The following error occurred while executing this line: /opt/local/var/db/dports/build/ file._opt_local_var_db_dports_sources_rsync.rsync.opendarwin.org_dpupdate_dports_java_jaxen/work/ jaxen-1.0-FCS/build.xml:237: Compile failed; see the compiler error output for details.

Total time: 6 seconds Error: Target com.apple.build returned: shell command "cd "/opt/local/var/db/dports/build/ file._opt_local_var_db_dports_sources_rsync.rsync.opendarwin.org_dpupdate_dports_java_jaxen/work/ jaxen-1.0-FCS" && CLASSPATH=/opt/local/share/java/saxpath.jar:/opt/local/share/java/apache-ant/ ant.jar:/opt/local/share/java/junit.jar:/opt/local/share/java/xalan.jar:/opt/local/share/java/xml- apis.jar:/opt/local/share/java/dom4j.jar ant dist -Djunit.jar=/opt/local/share/java/junit.jar" returned error 1 Command output: [javac] location: class org.jaxen.pattern.PatternParser

[javac] if ( axis == Axis.DESCENDANT
axis == Axis.DESCENDANT_OR_SELF )

[javac] [javac] /opt/local/var/db/dports/build/

file._opt_local_var_db_dports_sources_rsync.rsync.opendarwin.org_dpupdate_dports_java_jaxen/work/ jaxen-1.0-FCS/build/src/main/org/jaxen/pattern/PatternParser.java:171: cannot resolve symbol

[javac] symbol : variable Axis [javac] location: class org.jaxen.pattern.PatternParser

[javac] if ( axis == Axis.DESCENDANT
axis == Axis.DESCENDANT_OR_SELF )

[javac] [javac] /opt/local/var/db/dports/build/

file._opt_local_var_db_dports_sources_rsync.rsync.opendarwin.org_dpupdate_dports_java_jaxen/work/ jaxen-1.0-FCS/build/src/main/org/jaxen/pattern/PatternParser.java:197: cannot resolve symbol

[javac] symbol : variable Axis [javac] location: class org.jaxen.pattern.PatternParser [javac] if ( axis == Axis.ATTRIBUTE ) [javac] [javac] /opt/local/var/db/dports/build/

file._opt_local_var_db_dports_sources_rsync.rsync.opendarwin.org_dpupdate_dports_java_jaxen/work/ jaxen-1.0-FCS/build/src/main/org/jaxen/pattern/PatternParser.java:229: cannot resolve symbol

[javac] symbol : variable Axis [javac] location: class org.jaxen.pattern.PatternParser [javac] if ( axis == Axis.ATTRIBUTE ) [javac] [javac] /opt/local/var/db/dports/build/

file._opt_local_var_db_dports_sources_rsync.rsync.opendarwin.org_dpupdate_dports_java_jaxen/work/ jaxen-1.0-FCS/build/src/main/org/jaxen/pattern/PatternParser.java:237: cannot resolve symbol

[javac] symbol : variable Axis [javac] location: class org.jaxen.pattern.PatternParser [javac] if ( axis == Axis.ATTRIBUTE ) [javac] [javac] 77 errors

BUILD FAILED /opt/local/var/db/dports/build/ file._opt_local_var_db_dports_sources_rsync.rsync.opendarwin.org_dpupdate_dports_java_jaxen/work/ jaxen-1.0-FCS/build.xml:339: The following error occurred while executing this line: /opt/local/var/db/dports/build/ file._opt_local_var_db_dports_sources_rsync.rsync.opendarwin.org_dpupdate_dports_java_jaxen/work/ jaxen-1.0-FCS/build.xml:237: Compile failed; see the compiler error output for details.

Total time: 6 seconds

Warning: the following items did not execute (for jaxen): com.apple.activate com.apple.build com.apple.destroot com.apple.archive com.apple.install

comment:3 Changed 15 years ago by jberry@…

Is this a Java 1.5 issue?

What does "java -version" show on your system?

comment:4 Changed 15 years ago by jberry@…

mww: you might want to consider updating this port to Jaxen 1.1b7, http://jaxen.codehaus.org/ releases.html. I have no idea what would happen ;)

-jdb

comment:5 Changed 15 years ago by lrivers@…

Java version: $ java -version java version "1.4.2_07" Java(TM) 2 Runtime Environment, Standard Edition (build 1.4.2_07-215) Java HotSpot(TM) Client VM (build 1.4.2-50, mixed mode)

comment:6 Changed 15 years ago by mww@…

problem with updating to 1.1b7 is that there is no source-tarball or something. They just provide a build that only sports jaxen-1.1-beta-7.jar;

comment:7 Changed 15 years ago by mww@…

Summary: Jaxen failsBUG: Jaxen fails

comment:8 Changed 15 years ago by mww@…

Resolution: fixed
Status: newclosed

ok, jberry@ just updated the port to version 1.1-beta-8; I assume this problem is gone for now;

Note: See TracTickets for help on using tickets.