Opened 6 years ago

Closed 3 years ago

Last modified 3 years ago

#42982 closed defect (fixed)

gtkglarea2 build fails: undeclared identifiers

Reported by: Polyergic (Shad Sterling) Owned by: macports-tickets@…
Priority: Normal Milestone:
Component: ports Version: 2.2.1
Keywords: Cc: MarcusCalhoun-Lopez (Marcus Calhoun-Lopez)
Port: gtkglarea2

Description

output from grep -i error /opt/local/var/macports/logs/_opt_local_var_macports_sources_rsync.macports.org_release_tarballs_ports_x11_gtkglarea2/gtkglarea2/main.log:

:info:build gdkgl.c:296:3: error: use of undeclared identifier 'context'
:info:build gdkgl.c:297:8: error: use of undeclared identifier 'context'
:info:build gdkgl.c:339:10: error: use of undeclared identifier 'context'
:info:build gdkgl.c:557:3: error: use of undeclared identifier 'Display'
:info:build gdkgl.c:557:12: error: use of undeclared identifier 'dpy'
:info:build gdkgl.c:558:3: error: use of undeclared identifier 'XVisualInfo'
:info:build gdkgl.c:558:16: error: use of undeclared identifier 'vi'
:info:build gdkgl.c:559:3: error: use of undeclared identifier 'Pixmap'; did you mean 'pixmap'?
:info:build gdkgl.c:559:9: error: expected ';' after expression
:info:build gdkgl.c:559:10: error: use of undeclared identifier 'xpixmap'; did you mean 'pixmap'?
:info:build gdkgl.c:560:3: error: unknown type name 'GLXPixmap'; did you mean 'GdkPixmap'?
:info:build gdkgl.c:561:3: error: use of undeclared identifier 'Window'
:info:build gdkgl.c:612:3: error: use of undeclared identifier 'Display'
:info:build gdkgl.c:612:13: error: use of undeclared identifier 'dpy'
:info:build gdkgl.c:613:3: error: unknown type name 'GLXPixmap'; did you mean 'GdkPixmap'?
:info:build gdkgl.c:614:3: error: use of undeclared identifier 'GLXContext'
:info:build 2 warnings and 16 errors generated.
:info:build make[2]: *** [gdkgl.lo] Error 1
:info:build make[1]: *** [all-recursive] Error 1
:info:build make: *** [all] Error 2
:error:build org.macports.build for port gtkglarea2 returned: command execution failed
:debug:build Error code: CHILDSTATUS 36602 2

OS X 10.9.2, MacPorts 2.2.1; selfupdate last run a few hours ago, upgrade outdated is interrupted by this error.

Attachments (1)

main.log (25.2 KB) - added by Polyergic (Shad Sterling) 6 years ago.

Download all attachments as: .zip

Change History (4)

Changed 6 years ago by Polyergic (Shad Sterling)

Attachment: main.log added

comment:1 Changed 6 years ago by ryandesign (Ryan Schmidt)

Suggestions welcome; this port is unmaintained.

comment:2 Changed 3 years ago by MarcusCalhoun-Lopez (Marcus Calhoun-Lopez)

Resolution: fixed
Status: newclosed

It looks as if some work has been done upstream to support quartz, but it is not complete.
Until the work is complete, at least have a more helpful error r148026.

comment:3 Changed 3 years ago by MarcusCalhoun-Lopez (Marcus Calhoun-Lopez)

Cc: mcalhoun@… added

Cc Me!

Note: See TracTickets for help on using tickets.