Opened 8 years ago

Closed 8 years ago

#45540 closed defect (fixed)

gnuradio-devel @3.7.6_20141016: Build failure

Reported by: mf2k (Frank Schima) Owned by: michaelld (Michael Dickens)
Priority: Normal Milestone:
Component: ports Version: 2.3.2
Keywords: Cc: kpreid (Kevin Reid), zendata (Graham Cottew)
Port: gnuradio-devel

Description

I am seeing the following error building gnuradio-devel.

:info:build cd /opt/local/var/macports/build/_opt_mports_trunk_dports_science_gnuradio/gnuradio-devel/work/build/gnuradio-runtime/lib/pmt && /usr/bin/clang++   -DALIGNED_MALLOC=16 -DENABLE_GR_LOG -DHAVE_ARPA_INET_H -DHAVE_COSF -DHAVE_GETPAGESIZE -DHAVE_GETTIMEOFDAY -DHAVE_LOG4CPP -DHAVE_MMAP -DHAVE_NANOSLEEP -DHAVE_NETDB_H -DHAVE_NETINET_IN_H -DHAVE_POSIX_MEMALIGN -DHAVE_PTHREAD_SETSCHEDPARAM -DHAVE_PTHREAD_SIGMASK -DHAVE_SELECT -DHAVE_SIGACTION -DHAVE_SIGNAL_H -DHAVE_SINF -DHAVE_SNPRINTF -DHAVE_SYSCONF -DHAVE_SYS_IPC_H -DHAVE_SYS_MMAN_H -DHAVE_SYS_RESOURCE_H -DHAVE_SYS_SELECT_H -DHAVE_SYS_SHM_H -DHAVE_SYS_SOCKET_H -DHAVE_SYS_TIME_H -DHAVE_SYS_TYPES_H -DHAVE_UNISTD_H -Dgnuradio_pmt_EXPORTS -pipe -Os -stdlib=libc++ -arch x86_64  -DNDEBUG -arch x86_64 -mmacosx-version-min=10.9 -fPIC -I/opt/local/var/macports/build/_opt_mports_trunk_dports_science_gnuradio/gnuradio-devel/work/build/gnuradio-runtime/lib/pmt -I/opt/local/var/macports/build/_opt_mports_trunk_dports_science_gnuradio/gnuradio-devel/work/gnuradio-d957413240ed6dee49686ea34db0f119a854743e/gnuradio-runtime/lib/pmt -I/opt/local/var/macports/build/_opt_mports_trunk_dports_science_gnuradio/gnuradio-devel/work/build -I/opt/local/var/macports/build/_opt_mports_trunk_dports_science_gnuradio/gnuradio-devel/work/gnuradio-d957413240ed6dee49686ea34db0f119a854743e/gnuradio-runtime/include -I/opt/local/var/macports/build/_opt_mports_trunk_dports_science_gnuradio/gnuradio-devel/work/build/gnuradio-runtime/include -I/opt/local/var/macports/build/_opt_mports_trunk_dports_science_gnuradio/gnuradio-devel/work/gnuradio-d957413240ed6dee49686ea34db0f119a854743e/gnuradio-runtime/lib -I/opt/local/var/macports/build/_opt_mports_trunk_dports_science_gnuradio/gnuradio-devel/work/build/gnuradio-runtime/lib/../include -I/opt/local/var/macports/build/_opt_mports_trunk_dports_science_gnuradio/gnuradio-devel/work/gnuradio-d957413240ed6dee49686ea34db0f119a854743e/volk/include -I/opt/local/var/macports/build/_opt_mports_trunk_dports_science_gnuradio/gnuradio-devel/work/build/volk/include -I/opt/local/include    -o CMakeFiles/gnuradio-pmt.dir/pmt_io.cc.o -c /opt/local/var/macports/build/_opt_mports_trunk_dports_science_gnuradio/gnuradio-devel/work/gnuradio-d957413240ed6dee49686ea34db0f119a854743e/gnuradio-runtime/lib/pmt/pmt_io.cc
:info:build In file included from /opt/local/var/macports/build/_opt_mports_trunk_dports_science_gnuradio/gnuradio-devel/work/build/volk/lib/volk_machine_avx_64_mmx_orc.c:106:
:info:build /opt/local/var/macports/build/_opt_mports_trunk_dports_science_gnuradio/gnuradio-devel/work/gnuradio-d957413240ed6dee49686ea34db0f119a854743e/volk/kernels/volk/volk_32fc_deinterleave_32f_x2.h:61:14: error: index for __builtin_shufflevector must be a constant integer
:info:build     iValue = _mm256_shuffle_ps(complex1, complex2, realMask);
:info:build              ^~~~~~~~~~~~~~~~~~~~~~~~~~~~~~~~~~~~~~~~~~~~~~~
:info:build /Applications/Xcode.app/Contents/Developer/Toolchains/XcodeDefault.xctoolchain/usr/bin/../lib/clang/6.0/include/avxintrin.h:342:17: note: expanded from macro '_mm256_shuffle_ps'
:info:build         (__m256)__builtin_shufflevector((__v8sf)__a, (__v8sf)__b, \
:info:build                 ^
:info:build In file included from /opt/local/var/macports/build/_opt_mports_trunk_dports_science_gnuradio/gnuradio-devel/work/build/volk/lib/volk_machine_avx_64_mmx_orc.c:106:
:info:build /opt/local/var/macports/build/_opt_mports_trunk_dports_science_gnuradio/gnuradio-devel/work/gnuradio-d957413240ed6dee49686ea34db0f119a854743e/volk/kernels/volk/volk_32fc_deinterleave_32f_x2.h:61:12: error: assigning to '__m256' from incompatible type 'void'
:info:build     iValue = _mm256_shuffle_ps(complex1, complex2, realMask);
:info:build            ^ ~~~~~~~~~~~~~~~~~~~~~~~~~~~~~~~~~~~~~~~~~~~~~~~
:info:build /opt/local/var/macports/build/_opt_mports_trunk_dports_science_gnuradio/gnuradio-devel/work/gnuradio-d957413240ed6dee49686ea34db0f119a854743e/volk/kernels/volk/volk_32fc_deinterleave_32f_x2.h:63:14: error: index for __builtin_shufflevector must be a constant integer
:info:build     qValue = _mm256_shuffle_ps(complex1, complex2, imagMask);
:info:build              ^~~~~~~~~~~~~~~~~~~~~~~~~~~~~~~~~~~~~~~~~~~~~~~
:info:build /Applications/Xcode.app/Contents/Developer/Toolchains/XcodeDefault.xctoolchain/usr/bin/../lib/clang/6.0/include/avxintrin.h:342:17: note: expanded from macro '_mm256_shuffle_ps'
:info:build         (__m256)__builtin_shufflevector((__v8sf)__a, (__v8sf)__b, \
:info:build                 ^
:info:build In file included from /opt/local/var/macports/build/_opt_mports_trunk_dports_science_gnuradio/gnuradio-devel/work/build/volk/lib/volk_machine_avx_64_mmx_orc.c:106:
:info:build /opt/local/var/macports/build/_opt_mports_trunk_dports_science_gnuradio/gnuradio-devel/work/gnuradio-d957413240ed6dee49686ea34db0f119a854743e/volk/kernels/volk/volk_32fc_deinterleave_32f_x2.h:63:12: error: assigning to '__m256' from incompatible type 'void'
:info:build     qValue = _mm256_shuffle_ps(complex1, complex2, imagMask);
:info:build            ^ ~~~~~~~~~~~~~~~~~~~~~~~~~~~~~~~~~~~~~~~~~~~~~~~
:info:build In file included from /opt/local/var/macports/build/_opt_mports_trunk_dports_science_gnuradio/gnuradio-devel/work/build/volk/lib/volk_machine_avx_64_mmx_orc.c:108:
:info:build /opt/local/var/macports/build/_opt_mports_trunk_dports_science_gnuradio/gnuradio-devel/work/gnuradio-d957413240ed6dee49686ea34db0f119a854743e/volk/kernels/volk/volk_32fc_deinterleave_imag_32f.h:57:14: error: index for __builtin_shufflevector must be a constant integer
:info:build     qValue = _mm256_shuffle_ps(complex1, complex2, imagMask);
:info:build              ^~~~~~~~~~~~~~~~~~~~~~~~~~~~~~~~~~~~~~~~~~~~~~~
:info:build /Applications/Xcode.app/Contents/Developer/Toolchains/XcodeDefault.xctoolchain/usr/bin/../lib/clang/6.0/include/avxintrin.h:342:17: note: expanded from macro '_mm256_shuffle_ps'
:info:build         (__m256)__builtin_shufflevector((__v8sf)__a, (__v8sf)__b, \
:info:build                 ^
:info:build In file included from /opt/local/var/macports/build/_opt_mports_trunk_dports_science_gnuradio/gnuradio-devel/work/build/volk/lib/volk_machine_avx_64_mmx_orc.c:108:
:info:build /opt/local/var/macports/build/_opt_mports_trunk_dports_science_gnuradio/gnuradio-devel/work/gnuradio-d957413240ed6dee49686ea34db0f119a854743e/volk/kernels/volk/volk_32fc_deinterleave_imag_32f.h:57:12: error: assigning to '__m256' from incompatible type 'void'
:info:build     qValue = _mm256_shuffle_ps(complex1, complex2, imagMask);
:info:build            ^ ~~~~~~~~~~~~~~~~~~~~~~~~~~~~~~~~~~~~~~~~~~~~~~~
:info:build 6 errors generated.

Attachments (1)

main.log (819.7 KB) - added by mf2k (Frank Schima) 8 years ago.

Download all attachments as: .zip

Change History (8)

Changed 8 years ago by mf2k (Frank Schima)

Attachment: main.log added

comment:1 Changed 8 years ago by mf2k (Frank Schima)

Summary: gnuradio-devel: Build failuregnuradio-devel @3.7.6_20141016: Build failure

comment:2 Changed 8 years ago by zendata (Graham Cottew)

Cc: register@… added

Cc Me!

comment:3 Changed 8 years ago by zendata (Graham Cottew)

Cc: register@… removed

Cc Me!

comment:4 Changed 8 years ago by michaelld (Michael Dickens)

My AVX Mac is down right now, but I'll work with GR devs who use Macs to see if we can figure out the issue & get it fixed.

comment:5 Changed 8 years ago by kpreid (Kevin Reid)

Cc: kpreid@… added

Cc Me!

comment:6 Changed 8 years ago by zendata (Graham Cottew)

Cc: register@… added

Cc Me!

comment:7 Changed 8 years ago by michaelld (Michael Dickens)

Resolution: fixed
Status: newclosed

Fixed in r127653.

Note: See TracTickets for help on using tickets.