Opened 6 years ago

Closed 6 years ago

#46802 closed defect (fixed)

bladeRF build fails

Reported by: jbwmyoung@… Owned by: michaelld (Michael Dickens)
Priority: Normal Milestone:
Component: ports Version: 2.3.3
Keywords: Cc:
Port: bladeRF

Description (last modified by mf2k (Frank Schima))

When I try to install bladeRF, the build fails.

After attempting to build bladeRF, I get the error

Error: org.macports.build for port bladeRF returned: command execution failed

I am running OSX 10.6.8 with Xcode 3.2.6

I have updated MacPorts and tried to clean bladeRF and reinstall with no luck. I saw a previous ticket with something similar, but the fix seems to have been on the developers side rather than a user fix.

Attached is the log file for the install.

Attachments (2)

BladeRF.log (64.1 KB) - added by jbwmyoung@… 6 years ago.
main_v2.log (63.5 KB) - added by jbwmyoung@… 6 years ago.

Download all attachments as: .zip

Change History (10)

Changed 6 years ago by jbwmyoung@…

Attachment: BladeRF.log added

comment:1 Changed 6 years ago by jon.szymaniak@…

Sorry for the trouble. I didn't hit this warning on 10.10.2 with clang 6.0.

I'll push a fix to the bladeRF repo today that should assuage this warning. However, in the long-term, it might be best if the port file used -DTREAT_WARNINGS_AS_ERRORS=OFF to prevent such warnings from grinding things to a halt. (Should warnings appear, however, I'd like to hear about them in the bladeRF issue tracker: https://github.com/nuand/bladeRF/issues)

Although it causes some headaches, TREAT_WARNINGS_AS_ERRORS defaults to ON just so that it forces contributors to address issues, and so that we hear about problems on platforms/configurations that were not exercised.

comment:2 Changed 6 years ago by jon.szymaniak@…

Upstream commit 49606ac4 should address this warning. Please let me know if build issues persist after switching the port file to this commit.

comment:3 Changed 6 years ago by jbwmyoung@…

How do I switch the port file to this commit?

I've cleaned bladeRF and then did a MacPorts selfupdate. Then when I try to install again, I get the same error (or it appears to be the same to me).

This is the new log file:

version:1
:debug:main epoch: in tree: 0 installed: 0
:debug:main cmake 3.0.2_1 exists in the ports tree
:debug:main cmake 3.0.2_1  is the latest installed
:debug:main cmake 3.0.2_1  is active
:debug:main Merging existing variants '' into variants
:debug:main new fully merged portvariants: 
:debug:main Changing to port directory: /opt/local/var/macports/sources/rsync.macports.org/release/ports/devel/cmake
:debug:main OS darwin/10.8.0 (Mac OS X 10.6) arch i386
:debug:main Reading variant descriptions from /opt/local/var/macports/sources/rsync.macports.org/release/ports/_resources/port1.0/variant_descriptions.conf
:debug:main Sourcing PortGroup muniversal 1.0 from /opt/local/var/macports/sources/rsync.macports.org/release/ports/_resources/port1.0/group/muniversal-1.0.tcl
:debug:main universal variant already exists, so not adding the default one
:debug:main Running callback portconfigure::add_automatic_compiler_dependencies
:debug:main Finished running callback portconfigure::add_automatic_compiler_dependencies
:debug:main Running callback portbuild::add_automatic_buildsystem_dependencies
:debug:main Finished running callback portbuild::add_automatic_buildsystem_dependencies
:debug:main No need to upgrade! cmake 3.0.2_1 >= cmake 3.0.2_1
:debug:main epoch: in tree: 0 installed: 0
:debug:main libidn 1.29_0 exists in the ports tree
:debug:main libidn 1.29_0  is the latest installed
:debug:main libidn 1.29_0  is active
:debug:main Merging existing variants '' into variants
:debug:main new fully merged portvariants: 
:debug:main Changing to port directory: /opt/local/var/macports/sources/rsync.macports.org/release/ports/mail/libidn
:debug:main OS darwin/10.8.0 (Mac OS X 10.6) arch i386
:debug:main Sourcing PortGroup conflicts_build 1.0 from /opt/local/var/macports/sources/rsync.macports.org/release/ports/_resources/port1.0/group/conflicts_build-1.0.tcl
:debug:main adding the default universal variant
:debug:main Reading variant descriptions from /opt/local/var/macports/sources/rsync.macports.org/release/ports/_resources/port1.0/variant_descriptions.conf
:debug:main Running callback portconfigure::add_automatic_compiler_dependencies
:debug:main Finished running callback portconfigure::add_automatic_compiler_dependencies
:debug:main Running callback portbuild::add_automatic_buildsystem_dependencies
:debug:main Finished running callback portbuild::add_automatic_buildsystem_dependencies
:debug:main No need to upgrade! libidn 1.29_0 >= libidn 1.29_0
:debug:main epoch: in tree: 0 installed: 0
:debug:main libiconv 1.14_0 exists in the ports tree
:debug:main libiconv 1.14_0  is the latest installed
:debug:main libiconv 1.14_0  is active
:debug:main Merging existing variants '' into variants
:debug:main new fully merged portvariants: 
:debug:main Changing to port directory: /opt/local/var/macports/sources/rsync.macports.org/release/ports/textproc/libiconv
:debug:main OS darwin/10.8.0 (Mac OS X 10.6) arch i386
:debug:main Reading variant descriptions from /opt/local/var/macports/sources/rsync.macports.org/release/ports/_resources/port1.0/variant_descriptions.conf
:debug:main Sourcing PortGroup muniversal 1.0 from /opt/local/var/macports/sources/rsync.macports.org/release/ports/_resources/port1.0/group/muniversal-1.0.tcl
:debug:main universal variant already exists, so not adding the default one
:debug:main Running callback portconfigure::add_automatic_compiler_dependencies
:debug:main Finished running callback portconfigure::add_automatic_compiler_dependencies
:debug:main Running callback portbuild::add_automatic_buildsystem_dependencies
:debug:main Finished running callback portbuild::add_automatic_buildsystem_dependencies
:debug:main No need to upgrade! libiconv 1.14_0 >= libiconv 1.14_0
:debug:main epoch: in tree: 2 installed: 2
:debug:main gettext 0.19.4_0 exists in the ports tree
:debug:main gettext 0.19.4_0  is the latest installed
:debug:main gettext 0.19.4_0  is active
:debug:main Merging existing variants '' into variants
:debug:main new fully merged portvariants: 
:debug:main Changing to port directory: /opt/local/var/macports/sources/rsync.macports.org/release/ports/devel/gettext
:debug:main OS darwin/10.8.0 (Mac OS X 10.6) arch i386
:debug:main Sourcing PortGroup compiler_blacklist_versions 1.0 from /opt/local/var/macports/sources/rsync.macports.org/release/ports/_resources/port1.0/group/compiler_blacklist_versions-1.0.tcl
:debug:main Reading variant descriptions from /opt/local/var/macports/sources/rsync.macports.org/release/ports/_resources/port1.0/variant_descriptions.conf
:debug:main Sourcing PortGroup muniversal 1.0 from /opt/local/var/macports/sources/rsync.macports.org/release/ports/_resources/port1.0/group/muniversal-1.0.tcl
:debug:main compiler clang 77 blacklisted because it matches {clang < 211.10.1}
:debug:main universal variant already exists, so not adding the default one
:debug:main Running callback portconfigure::add_automatic_compiler_dependencies
:debug:main Finished running callback portconfigure::add_automatic_compiler_dependencies
:debug:main Running callback portbuild::add_automatic_buildsystem_dependencies
:debug:main Finished running callback portbuild::add_automatic_buildsystem_dependencies
:debug:main No need to upgrade! gettext 0.19.4_0 >= gettext 0.19.4_0
:debug:main epoch: in tree: 0 installed: 0
:debug:main expat 2.1.0_0 exists in the ports tree
:debug:main expat 2.1.0_0  is the latest installed
:debug:main expat 2.1.0_0  is active
:debug:main Merging existing variants '' into variants
:debug:main new fully merged portvariants: 
:debug:main Changing to port directory: /opt/local/var/macports/sources/rsync.macports.org/release/ports/textproc/expat
:debug:main OS darwin/10.8.0 (Mac OS X 10.6) arch i386
:debug:main adding the default universal variant
:debug:main Reading variant descriptions from /opt/local/var/macports/sources/rsync.macports.org/release/ports/_resources/port1.0/variant_descriptions.conf
:debug:main Running callback portconfigure::add_automatic_compiler_dependencies
:debug:main Finished running callback portconfigure::add_automatic_compiler_dependencies
:debug:main Running callback portbuild::add_automatic_buildsystem_dependencies
:debug:main Finished running callback portbuild::add_automatic_buildsystem_dependencies
:debug:main No need to upgrade! expat 2.1.0_0 >= expat 2.1.0_0
:debug:main epoch: in tree: 0 installed: 0
:debug:main ncurses 5.9_2 exists in the ports tree
:debug:main ncurses 5.9_2  is the latest installed
:debug:main ncurses 5.9_2  is active
:debug:main Merging existing variants '' into variants
:debug:main new fully merged portvariants: 
:debug:main Changing to port directory: /opt/local/var/macports/sources/rsync.macports.org/release/ports/devel/ncurses
:debug:main OS darwin/10.8.0 (Mac OS X 10.6) arch i386
:debug:main adding the default universal variant
:debug:main Reading variant descriptions from /opt/local/var/macports/sources/rsync.macports.org/release/ports/_resources/port1.0/variant_descriptions.conf
:debug:main Running callback portconfigure::add_automatic_compiler_dependencies
:debug:main Finished running callback portconfigure::add_automatic_compiler_dependencies
:debug:main Running callback portbuild::add_automatic_buildsystem_dependencies
:debug:main Finished running callback portbuild::add_automatic_buildsystem_dependencies
:debug:main No need to upgrade! ncurses 5.9_2 >= ncurses 5.9_2
:debug:main epoch: in tree: 1 installed: 1
:debug:main openssl 1.0.2_0 exists in the ports tree
:debug:main openssl 1.0.2_0  is the latest installed
:debug:main openssl 1.0.2_0  is active
:debug:main Merging existing variants '' into variants
:debug:main new fully merged portvariants: 
:debug:main Changing to port directory: /opt/local/var/macports/sources/rsync.macports.org/release/ports/devel/openssl
:debug:main OS darwin/10.8.0 (Mac OS X 10.6) arch i386
:debug:main Reading variant descriptions from /opt/local/var/macports/sources/rsync.macports.org/release/ports/_resources/port1.0/variant_descriptions.conf
:debug:main Sourcing PortGroup muniversal 1.0 from /opt/local/var/macports/sources/rsync.macports.org/release/ports/_resources/port1.0/group/muniversal-1.0.tcl
:debug:main universal variant already exists, so not adding the default one
:debug:main Running callback portconfigure::add_automatic_compiler_dependencies
:debug:main Finished running callback portconfigure::add_automatic_compiler_dependencies
:debug:main Running callback portbuild::add_automatic_buildsystem_dependencies
:debug:main Finished running callback portbuild::add_automatic_buildsystem_dependencies
:debug:main No need to upgrade! openssl 1.0.2_0 >= openssl 1.0.2_0
:debug:main epoch: in tree: 0 installed: 0
:debug:main zlib 1.2.8_0 exists in the ports tree
:debug:main zlib 1.2.8_0  is the latest installed
:debug:main zlib 1.2.8_0  is active
:debug:main Merging existing variants '' into variants
:debug:main new fully merged portvariants: 
:debug:main Changing to port directory: /opt/local/var/macports/sources/rsync.macports.org/release/ports/archivers/zlib
:debug:main OS darwin/10.8.0 (Mac OS X 10.6) arch i386
:debug:main Sourcing PortGroup xcodeversion 1.0 from /opt/local/var/macports/sources/rsync.macports.org/release/ports/_resources/port1.0/group/xcodeversion-1.0.tcl
:debug:main adding the default universal variant
:debug:main Reading variant descriptions from /opt/local/var/macports/sources/rsync.macports.org/release/ports/_resources/port1.0/variant_descriptions.conf
:debug:main Running callback portconfigure::add_automatic_compiler_dependencies
:debug:main Finished running callback portconfigure::add_automatic_compiler_dependencies
:debug:main Running callback portbuild::add_automatic_buildsystem_dependencies
:debug:main Finished running callback portbuild::add_automatic_buildsystem_dependencies
:debug:main No need to upgrade! zlib 1.2.8_0 >= zlib 1.2.8_0
:debug:main epoch: in tree: 0 installed: 0
:debug:main curl 7.40.0_0 exists in the ports tree
:debug:main curl 7.40.0_0 +ssl is the latest installed
:debug:main curl 7.40.0_0 +ssl is active
:debug:main Merging existing variants '+ssl' into variants
:debug:main new fully merged portvariants: ssl +
:debug:main Changing to port directory: /opt/local/var/macports/sources/rsync.macports.org/release/ports/net/curl
:debug:main OS darwin/10.8.0 (Mac OS X 10.6) arch i386
:debug:main Reading variant descriptions from /opt/local/var/macports/sources/rsync.macports.org/release/ports/_resources/port1.0/variant_descriptions.conf
:debug:main Sourcing PortGroup muniversal 1.0 from /opt/local/var/macports/sources/rsync.macports.org/release/ports/_resources/port1.0/group/muniversal-1.0.tcl
:debug:main universal variant already exists, so not adding the default one
:debug:main Executing variant ssl provides ssl
:debug:main Running callback portconfigure::add_automatic_compiler_dependencies
:debug:main Finished running callback portconfigure::add_automatic_compiler_dependencies
:debug:main Running callback portbuild::add_automatic_buildsystem_dependencies
:debug:main Finished running callback portbuild::add_automatic_buildsystem_dependencies
:debug:main No need to upgrade! curl 7.40.0_0 >= curl 7.40.0_0
:debug:main epoch: in tree: 0 installed: 0
:debug:main curl-ca-bundle 7.40.0_0 exists in the ports tree
:debug:main curl-ca-bundle 7.40.0_0  is the latest installed
:debug:main curl-ca-bundle 7.40.0_0  is active
:debug:main Merging existing variants '' into variants
:debug:main new fully merged portvariants: 
:debug:main Changing to port directory: /opt/local/var/macports/sources/rsync.macports.org/release/ports/net/curl
:debug:main OS darwin/10.8.0 (Mac OS X 10.6) arch i386
:debug:main universal_variant is false, so not adding the default universal variant
:debug:main Running callback portconfigure::add_automatic_compiler_dependencies
:debug:main Finished running callback portconfigure::add_automatic_compiler_dependencies
:debug:main Running callback portbuild::add_automatic_buildsystem_dependencies
:debug:main Finished running callback portbuild::add_automatic_buildsystem_dependencies
:debug:main No need to upgrade! curl-ca-bundle 7.40.0_0 >= curl-ca-bundle 7.40.0_0
:debug:main epoch: in tree: 0 installed: 0
:debug:main bzip2 1.0.6_0 exists in the ports tree
:debug:main bzip2 1.0.6_0  is the latest installed
:debug:main bzip2 1.0.6_0  is active
:debug:main Merging existing variants '' into variants
:debug:main new fully merged portvariants: 
:debug:main Changing to port directory: /opt/local/var/macports/sources/rsync.macports.org/release/ports/archivers/bzip2
:debug:main OS darwin/10.8.0 (Mac OS X 10.6) arch i386
:debug:main Reading variant descriptions from /opt/local/var/macports/sources/rsync.macports.org/release/ports/_resources/port1.0/variant_descriptions.conf
:debug:main universal variant already exists, so not adding the default one
:debug:main Running callback portconfigure::add_automatic_compiler_dependencies
:debug:main Finished running callback portconfigure::add_automatic_compiler_dependencies
:debug:main Running callback portbuild::add_automatic_buildsystem_dependencies
:debug:main Finished running callback portbuild::add_automatic_buildsystem_dependencies
:debug:main No need to upgrade! bzip2 1.0.6_0 >= bzip2 1.0.6_0
:debug:main epoch: in tree: 0 installed: 0
:debug:main libarchive 3.1.2_0 exists in the ports tree
:debug:main libarchive 3.1.2_0  is the latest installed
:debug:main libarchive 3.1.2_0  is active
:debug:main Merging existing variants '' into variants
:debug:main new fully merged portvariants: 
:debug:main Changing to port directory: /opt/local/var/macports/sources/rsync.macports.org/release/ports/archivers/libarchive
:debug:main OS darwin/10.8.0 (Mac OS X 10.6) arch i386
:debug:main adding the default universal variant
:debug:main Reading variant descriptions from /opt/local/var/macports/sources/rsync.macports.org/release/ports/_resources/port1.0/variant_descriptions.conf
:debug:main Running callback portconfigure::add_automatic_compiler_dependencies
:debug:main Finished running callback portconfigure::add_automatic_compiler_dependencies
:debug:main Running callback portbuild::add_automatic_buildsystem_dependencies
:debug:main Finished running callback portbuild::add_automatic_buildsystem_dependencies
:debug:main No need to upgrade! libarchive 3.1.2_0 >= libarchive 3.1.2_0
:debug:main epoch: in tree: 0 installed: 0
:debug:main libxml2 2.9.2_1 exists in the ports tree
:debug:main libxml2 2.9.2_1  is the latest installed
:debug:main libxml2 2.9.2_1  is active
:debug:main Merging existing variants '' into variants
:debug:main new fully merged portvariants: 
:debug:main Changing to port directory: /opt/local/var/macports/sources/rsync.macports.org/release/ports/textproc/libxml2
:debug:main OS darwin/10.8.0 (Mac OS X 10.6) arch i386
:debug:main adding the default universal variant
:debug:main Reading variant descriptions from /opt/local/var/macports/sources/rsync.macports.org/release/ports/_resources/port1.0/variant_descriptions.conf
:debug:main Running callback portconfigure::add_automatic_compiler_dependencies
:debug:main Finished running callback portconfigure::add_automatic_compiler_dependencies
:debug:main Running callback portbuild::add_automatic_buildsystem_dependencies
:debug:main Finished running callback portbuild::add_automatic_buildsystem_dependencies
:debug:main No need to upgrade! libxml2 2.9.2_1 >= libxml2 2.9.2_1
:debug:main epoch: in tree: 0 installed: 0
:debug:main xz 5.0.7_0 exists in the ports tree
:debug:main xz 5.0.7_0  is the latest installed
:debug:main xz 5.0.7_0  is active
:debug:main Merging existing variants '' into variants
:debug:main new fully merged portvariants: 
:debug:main Changing to port directory: /opt/local/var/macports/sources/rsync.macports.org/release/ports/archivers/xz
:debug:main OS darwin/10.8.0 (Mac OS X 10.6) arch i386
:debug:main adding the default universal variant
:debug:main Reading variant descriptions from /opt/local/var/macports/sources/rsync.macports.org/release/ports/_resources/port1.0/variant_descriptions.conf
:debug:main Running callback portconfigure::add_automatic_compiler_dependencies
:debug:main Finished running callback portconfigure::add_automatic_compiler_dependencies
:debug:main Running callback portbuild::add_automatic_buildsystem_dependencies
:debug:main Finished running callback portbuild::add_automatic_buildsystem_dependencies
:debug:main No need to upgrade! xz 5.0.7_0 >= xz 5.0.7_0
:debug:main epoch: in tree: 0 installed: 0
:debug:main lzo2 2.08_0 exists in the ports tree
:debug:main lzo2 2.08_0  is the latest installed
:debug:main lzo2 2.08_0  is active
:debug:main Merging existing variants '' into variants
:debug:main new fully merged portvariants: 
:debug:main Changing to port directory: /opt/local/var/macports/sources/rsync.macports.org/release/ports/archivers/lzo2
:debug:main OS darwin/10.8.0 (Mac OS X 10.6) arch i386
:debug:main Reading variant descriptions from /opt/local/var/macports/sources/rsync.macports.org/release/ports/_resources/port1.0/variant_descriptions.conf
:debug:main Sourcing PortGroup muniversal 1.0 from /opt/local/var/macports/sources/rsync.macports.org/release/ports/_resources/port1.0/group/muniversal-1.0.tcl
:debug:main universal variant already exists, so not adding the default one
:debug:main Running callback portconfigure::add_automatic_compiler_dependencies
:debug:main Finished running callback portconfigure::add_automatic_compiler_dependencies
:debug:main Running callback portbuild::add_automatic_buildsystem_dependencies
:debug:main Finished running callback portbuild::add_automatic_buildsystem_dependencies
:debug:main No need to upgrade! lzo2 2.08_0 >= lzo2 2.08_0
:debug:main epoch: in tree: 0 installed: 0
:debug:main pkgconfig 0.28_0 exists in the ports tree
:debug:main pkgconfig 0.28_0  is the latest installed
:debug:main pkgconfig 0.28_0  is active
:debug:main Merging existing variants '' into variants
:debug:main new fully merged portvariants: 
:debug:main Changing to port directory: /opt/local/var/macports/sources/rsync.macports.org/release/ports/devel/pkgconfig
:debug:main OS darwin/10.8.0 (Mac OS X 10.6) arch i386
:debug:main adding the default universal variant
:debug:main Reading variant descriptions from /opt/local/var/macports/sources/rsync.macports.org/release/ports/_resources/port1.0/variant_descriptions.conf
:debug:main Running callback portconfigure::add_automatic_compiler_dependencies
:debug:main Finished running callback portconfigure::add_automatic_compiler_dependencies
:debug:main Running callback portbuild::add_automatic_buildsystem_dependencies
:debug:main Finished running callback portbuild::add_automatic_buildsystem_dependencies
:debug:main No need to upgrade! pkgconfig 0.28_0 >= pkgconfig 0.28_0
:debug:main epoch: in tree: 0 installed: 0
:debug:main libusb 1.0.18_0 exists in the ports tree
:debug:main libusb 1.0.18_0  is the latest installed
:debug:main libusb 1.0.18_0  is active
:debug:main Merging existing variants '' into variants
:debug:main new fully merged portvariants: 
:debug:main Changing to port directory: /opt/local/var/macports/sources/rsync.macports.org/release/ports/devel/libusb
:debug:main OS darwin/10.8.0 (Mac OS X 10.6) arch i386
:debug:main adding the default universal variant
:debug:main Reading variant descriptions from /opt/local/var/macports/sources/rsync.macports.org/release/ports/_resources/port1.0/variant_descriptions.conf
:debug:main Running callback portconfigure::add_automatic_compiler_dependencies
:debug:main Finished running callback portconfigure::add_automatic_compiler_dependencies
:debug:main Running callback portbuild::add_automatic_buildsystem_dependencies
:debug:main Finished running callback portbuild::add_automatic_buildsystem_dependencies
:debug:main No need to upgrade! libusb 1.0.18_0 >= libusb 1.0.18_0
:debug:main epoch: in tree: 0 installed: 0
:debug:main tecla 1.6.2_0 exists in the ports tree
:debug:main tecla 1.6.2_0  is the latest installed
:debug:main tecla 1.6.2_0  is active
:debug:main Merging existing variants '' into variants
:debug:main new fully merged portvariants: 
:debug:main Changing to port directory: /opt/local/var/macports/sources/rsync.macports.org/release/ports/devel/tecla
:debug:main OS darwin/10.8.0 (Mac OS X 10.6) arch i386
:debug:main adding the default universal variant
:debug:main Reading variant descriptions from /opt/local/var/macports/sources/rsync.macports.org/release/ports/_resources/port1.0/variant_descriptions.conf
:debug:main Running callback portconfigure::add_automatic_compiler_dependencies
:debug:main Finished running callback portconfigure::add_automatic_compiler_dependencies
:debug:main Running callback portbuild::add_automatic_buildsystem_dependencies
:debug:main Finished running callback portbuild::add_automatic_buildsystem_dependencies
:debug:main No need to upgrade! tecla 1.6.2_0 >= tecla 1.6.2_0
:msg:main --->  Computing dependencies for bladeRF:info:main .:debug:main bladeRF has no conflicts
:debug:main Searching for dependency: cmake
:debug:main Found Dependency: receipt exists for cmake
:debug:main Searching for dependency: pkgconfig
:debug:main Found Dependency: receipt exists for pkgconfig
:debug:main Searching for dependency: libusb
:debug:main Found Dependency: receipt exists for libusb
:debug:main Searching for dependency: tecla
:debug:main Found Dependency: receipt exists for tecla
:msg:main 
:debug:main Executing org.macports.main (bladeRF)
:debug:archivefetch archivefetch phase started at Mon Feb  9 09:14:14 HST 2015
:msg:archivefetch --->  Fetching archive for bladeRF
:debug:archivefetch Executing org.macports.archivefetch (bladeRF)
:info:archivefetch --->  bladeRF-20150131_0+tecla.darwin_10.x86_64.tbz2 doesn't seem to exist in /opt/local/var/macports/incoming/verified
:msg:archivefetch --->  Attempting to fetch bladeRF-20150131_0+tecla.darwin_10.x86_64.tbz2 from http://packages.macports.org/bladeRF
:debug:archivefetch Fetching archive failed:: The requested URL returned error: 404
:msg:archivefetch --->  Attempting to fetch bladeRF-20150131_0+tecla.darwin_10.x86_64.tbz2 from http://mse.uk.packages.macports.org/sites/packages.macports.org/bladeRF
:debug:archivefetch Fetching archive failed:: The requested URL returned error: 404
:msg:archivefetch --->  Attempting to fetch bladeRF-20150131_0+tecla.darwin_10.x86_64.tbz2 from http://nue.de.packages.macports.org/macports/packages/bladeRF
:debug:archivefetch Fetching archive failed:: The requested URL returned error: 404
:debug:fetch fetch phase started at Mon Feb  9 09:14:16 HST 2015
:notice:fetch --->  Fetching distfiles for bladeRF
:debug:fetch Executing org.macports.fetch (bladeRF)
:debug:checksum checksum phase started at Mon Feb  9 09:14:16 HST 2015
:notice:checksum --->  Verifying checksums for bladeRF
:debug:checksum Executing org.macports.checksum (bladeRF)
:info:checksum --->  Checksumming bladeRF-4e78b0596fce7a0fe1a4cdc54a154cb536bba334.tar.gz
:debug:checksum Calculated (rmd160) is 4855596b36e02418ccda818f579d4bfda1eba00a
:debug:checksum Correct (rmd160) checksum for bladeRF-4e78b0596fce7a0fe1a4cdc54a154cb536bba334.tar.gz
:debug:checksum Calculated (sha256) is 0bcad0a9e7527783b1ff4efdf6edb5f3d1532ab3b51f7bd57403af1d06865b1c
:debug:checksum Correct (sha256) checksum for bladeRF-4e78b0596fce7a0fe1a4cdc54a154cb536bba334.tar.gz
:debug:extract extract phase started at Mon Feb  9 09:14:16 HST 2015
:notice:extract --->  Extracting bladeRF
:debug:extract Executing org.macports.extract (bladeRF)
:info:extract --->  Extracting bladeRF-4e78b0596fce7a0fe1a4cdc54a154cb536bba334.tar.gz
:debug:extract setting option extract.args to '/opt/local/var/macports/distfiles/bladeRF/bladeRF-4e78b0596fce7a0fe1a4cdc54a154cb536bba334.tar.gz'
:debug:extract Environment: 
CC_PRINT_OPTIONS='YES'
CC_PRINT_OPTIONS_FILE='/opt/local/var/macports/build/_opt_local_var_macports_sources_rsync.macports.org_release_ports_science_bladeRF/bladeRF/work/.CC_PRINT_OPTIONS'
CPATH='/opt/local/include'
LIBRARY_PATH='/opt/local/lib'
MACOSX_DEPLOYMENT_TARGET='10.6'
:debug:extract Assembled command: 'cd "/opt/local/var/macports/build/_opt_local_var_macports_sources_rsync.macports.org_release_ports_science_bladeRF/bladeRF/work" && /usr/bin/gzip -dc '/opt/local/var/macports/distfiles/bladeRF/bladeRF-4e78b0596fce7a0fe1a4cdc54a154cb536bba334.tar.gz' | /usr/bin/gnutar --no-same-owner -xf -'
:debug:extract Executing command line:  cd "/opt/local/var/macports/build/_opt_local_var_macports_sources_rsync.macports.org_release_ports_science_bladeRF/bladeRF/work" && /usr/bin/gzip -dc '/opt/local/var/macports/distfiles/bladeRF/bladeRF-4e78b0596fce7a0fe1a4cdc54a154cb536bba334.tar.gz' | /usr/bin/gnutar --no-same-owner -xf - 
:debug:extract Executing proc-post-org.macports.extract-extract-0
:debug:extract Executing proc-post-org.macports.extract-extract-1
:debug:patch patch phase started at Mon Feb  9 09:14:17 HST 2015
:debug:patch Executing org.macports.patch (bladeRF)
:debug:configure configure phase started at Mon Feb  9 09:14:17 HST 2015
:notice:configure --->  Configuring bladeRF
:debug:configure Using compiler 'Xcode GCC 4.2'
:debug:configure Executing proc-pre-org.macports.configure-configure-0
:debug:configure Executing org.macports.configure (bladeRF)
:debug:configure Environment: 
CC='/usr/bin/gcc-4.2'
CC_PRINT_OPTIONS='YES'
CC_PRINT_OPTIONS_FILE='/opt/local/var/macports/build/_opt_local_var_macports_sources_rsync.macports.org_release_ports_science_bladeRF/bladeRF/work/.CC_PRINT_OPTIONS'
CFLAGS='-Os -arch x86_64'
CPATH='/opt/local/include'
CPPFLAGS='-I/opt/local/include'
CXX='/usr/bin/g++-4.2'
CXXFLAGS='-Os -arch x86_64'
F77FLAGS='-m64'
F90FLAGS='-Os -m64'
FCFLAGS='-Os -m64'
FFLAGS='-Os'
INSTALL='/usr/bin/install -c'
LDFLAGS='-Wl,-headerpad_max_install_names -arch x86_64'
LIBRARY_PATH='/opt/local/lib'
MACOSX_DEPLOYMENT_TARGET='10.6'
OBJC='/usr/bin/gcc-4.2'
OBJCFLAGS='-Os -arch x86_64'
OBJCXX='/usr/bin/g++-4.2'
OBJCXXFLAGS='-Os -arch x86_64'
:debug:configure Assembled command: 'cd "/opt/local/var/macports/build/_opt_local_var_macports_sources_rsync.macports.org_release_ports_science_bladeRF/bladeRF/work/build" && /opt/local/bin/cmake -DCMAKE_INSTALL_PREFIX=/opt/local -DCMAKE_VERBOSE_MAKEFILE=ON -DCMAKE_COLOR_MAKEFILE=ON -DCMAKE_BUILD_TYPE=Release -DCMAKE_BUILD_WITH_INSTALL_RPATH=ON -DCMAKE_INSTALL_RPATH=/opt/local/lib -DCMAKE_INSTALL_NAME_DIR=/opt/local/lib -DCMAKE_SYSTEM_PREFIX_PATH="/opt/local;/usr" -DCMAKE_MODULE_PATH=/opt/local/share/cmake/Modules -DCMAKE_FIND_FRAMEWORK=LAST -Wno-dev -DVERSION_INFO_OVERRIDE="MacPorts-20150131" -DBUILD_DOCUMENTATION=OFF -DENABLE_LIBTECLA=ON -DCMAKE_C_FLAGS_RELEASE="-DNDEBUG" -DCMAKE_CXX_FLAGS_RELEASE="-DNDEBUG" -DCMAKE_OSX_ARCHITECTURES="x86_64" -DCMAKE_OSX_DEPLOYMENT_TARGET="10.6" -DCMAKE_OSX_SYSROOT="/" ../bladeRF-4e78b0596fce7a0fe1a4cdc54a154cb536bba334'
:debug:configure Executing command line:  cd "/opt/local/var/macports/build/_opt_local_var_macports_sources_rsync.macports.org_release_ports_science_bladeRF/bladeRF/work/build" && /opt/local/bin/cmake -DCMAKE_INSTALL_PREFIX=/opt/local -DCMAKE_VERBOSE_MAKEFILE=ON -DCMAKE_COLOR_MAKEFILE=ON -DCMAKE_BUILD_TYPE=Release -DCMAKE_BUILD_WITH_INSTALL_RPATH=ON -DCMAKE_INSTALL_RPATH=/opt/local/lib -DCMAKE_INSTALL_NAME_DIR=/opt/local/lib -DCMAKE_SYSTEM_PREFIX_PATH="/opt/local;/usr" -DCMAKE_MODULE_PATH=/opt/local/share/cmake/Modules -DCMAKE_FIND_FRAMEWORK=LAST -Wno-dev -DVERSION_INFO_OVERRIDE="MacPorts-20150131" -DBUILD_DOCUMENTATION=OFF -DENABLE_LIBTECLA=ON -DCMAKE_C_FLAGS_RELEASE="-DNDEBUG" -DCMAKE_CXX_FLAGS_RELEASE="-DNDEBUG" -DCMAKE_OSX_ARCHITECTURES="x86_64" -DCMAKE_OSX_DEPLOYMENT_TARGET="10.6" -DCMAKE_OSX_SYSROOT="/" ../bladeRF-4e78b0596fce7a0fe1a4cdc54a154cb536bba334 
:info:configure -- The C compiler identification is GNU 4.2.1
:info:configure -- The CXX compiler identification is GNU 4.2.1
:info:configure CMake Warning at /opt/local/share/cmake-3.0/Modules/Platform/Darwin.cmake:324 (message):
:info:configure   The SDK Library/Frameworks path
:info:configure 
:info:configure    //Library/Frameworks
:info:configure 
:info:configure   is not set up correctly on this system.  This is known to occur when
:info:configure   installing Xcode 3.2.6:
:info:configure 
:info:configure    http://bugs.python.org/issue14018
:info:configure 
:info:configure   The problem may cause build errors that report missing system frameworks.
:info:configure   Fix your SDK symlinks to resolve this issue and avoid this warning.
:info:configure Call Stack (most recent call first):
:info:configure   /opt/local/share/cmake-3.0/Modules/CMakeSystemSpecificInformation.cmake:36 (include)
:info:configure   
:info:configure 
:info:configure 
:info:configure -- Checking whether C compiler has -isysroot
:info:configure -- Checking whether C compiler has -isysroot - yes
:info:configure -- Checking whether C compiler supports OSX deployment target flag
:info:configure -- Checking whether C compiler supports OSX deployment target flag - yes
:info:configure -- Check for working C compiler: /usr/bin/gcc-4.2
:info:configure -- Check for working C compiler: /usr/bin/gcc-4.2 -- works
:info:configure -- Detecting C compiler ABI info
:info:configure -- Detecting C compiler ABI info - done
:info:configure -- Checking whether CXX compiler has -isysroot
:info:configure -- Checking whether CXX compiler has -isysroot - yes
:info:configure -- Checking whether CXX compiler supports OSX deployment target flag
:info:configure -- Checking whether CXX compiler supports OSX deployment target flag - yes
:info:configure -- Check for working CXX compiler: /usr/bin/g++-4.2
:info:configure -- Check for working CXX compiler: /usr/bin/g++-4.2 -- works
:info:configure -- Detecting CXX compiler ABI info
:info:configure -- Detecting CXX compiler ABI info - done
:info:configure -- Check if the system is big endian
:info:configure -- Searching 16 bit integer
:info:configure -- Looking for sys/types.h
:info:configure -- Looking for sys/types.h - found
:info:configure -- Looking for stdint.h
:info:configure -- Looking for stdint.h - found
:info:configure -- Looking for stddef.h
:info:configure -- Looking for stddef.h - found
:info:configure -- Check size of unsigned short
:info:configure -- Check size of unsigned short - done
:info:configure -- Using unsigned short
:info:configure -- Check if the system is big endian - little endian
:info:configure -- Found PkgConfig: /opt/local/bin/pkg-config (found version "0.28") 
:info:configure -- Checking libusb version...
:info:configure -- libusb version: 1.0.18
:info:configure 
:info:configure -- Looking for include file pthread.h
:info:configure -- Looking for include file pthread.h - found
:info:configure -- Looking for pthread_create
:info:configure -- Looking for pthread_create - found
:info:configure -- Found Threads: TRUE  
:info:configure -- libbladeRF version: 1.2.0-MacPorts-20150131
:info:configure -- Could not find pandoc.  Interactive help may be out of date.
:info:configure -- checking for module 'libtecla'
:info:configure --   package 'libtecla' not found
:info:configure -- Found libtecla: /opt/local/include, /opt/local/lib/libtecla.dylib
:info:configure -- libtecla support enabled
:info:configure -- Not building man page for bladeRF-cli.  (BUILD_BLADERF_CLI_DOCUMENTATION is OFF)
:info:configure -- Configured to build bladeRF-cli version: 1.1.1-MacPorts-20150131
:info:configure -- Skipping FX3 firmware build
:info:configure -- Configuring done
:info:configure -- Generating done
:info:configure -- Build files have been written to: /opt/local/var/macports/build/_opt_local_var_macports_sources_rsync.macports.org_release_ports_science_bladeRF/bladeRF/work/build
:debug:build build phase started at Mon Feb  9 09:14:21 HST 2015
:notice:build --->  Building bladeRF
:debug:build Executing org.macports.build (bladeRF)
:debug:build Environment: 
CC_PRINT_OPTIONS='YES'
CC_PRINT_OPTIONS_FILE='/opt/local/var/macports/build/_opt_local_var_macports_sources_rsync.macports.org_release_ports_science_bladeRF/bladeRF/work/.CC_PRINT_OPTIONS'
CPATH='/opt/local/include'
LIBRARY_PATH='/opt/local/lib'
MACOSX_DEPLOYMENT_TARGET='10.6'
:debug:build Assembled command: 'cd "/opt/local/var/macports/build/_opt_local_var_macports_sources_rsync.macports.org_release_ports_science_bladeRF/bladeRF/work/build" && /usr/bin/make -j2 -w all VERBOSE=1'
:debug:build Executing command line:  cd "/opt/local/var/macports/build/_opt_local_var_macports_sources_rsync.macports.org_release_ports_science_bladeRF/bladeRF/work/build" && /usr/bin/make -j2 -w all VERBOSE=1 
:info:build make: Entering directory `/opt/local/var/macports/build/_opt_local_var_macports_sources_rsync.macports.org_release_ports_science_bladeRF/bladeRF/work/build'
:info:build /opt/local/bin/cmake -H/opt/local/var/macports/build/_opt_local_var_macports_sources_rsync.macports.org_release_ports_science_bladeRF/bladeRF/work/bladeRF-4e78b0596fce7a0fe1a4cdc54a154cb536bba334 -B/opt/local/var/macports/build/_opt_local_var_macports_sources_rsync.macports.org_release_ports_science_bladeRF/bladeRF/work/build --check-build-system CMakeFiles/Makefile.cmake 0
:info:build /opt/local/bin/cmake -E cmake_progress_start /opt/local/var/macports/build/_opt_local_var_macports_sources_rsync.macports.org_release_ports_science_bladeRF/bladeRF/work/build/CMakeFiles /opt/local/var/macports/build/_opt_local_var_macports_sources_rsync.macports.org_release_ports_science_bladeRF/bladeRF/work/build/CMakeFiles/progress.marks
:info:build /usr/bin/make -f CMakeFiles/Makefile2 all
:info:build make[1]: Entering directory `/opt/local/var/macports/build/_opt_local_var_macports_sources_rsync.macports.org_release_ports_science_bladeRF/bladeRF/work/build'
:info:build /usr/bin/make -f host/libraries/libbladeRF/CMakeFiles/libbladerf_shared.dir/build.make host/libraries/libbladeRF/CMakeFiles/libbladerf_shared.dir/depend
:info:build /usr/bin/make -f host/libraries/libbladeRF_test/test_fw_check/CMakeFiles/libbladeRF_test_fw_check.dir/build.make host/libraries/libbladeRF_test/test_fw_check/CMakeFiles/libbladeRF_test_fw_check.dir/depend
:info:build make[2]: Entering directory `/opt/local/var/macports/build/_opt_local_var_macports_sources_rsync.macports.org_release_ports_science_bladeRF/bladeRF/work/build'
:info:build cd /opt/local/var/macports/build/_opt_local_var_macports_sources_rsync.macports.org_release_ports_science_bladeRF/bladeRF/work/build && /opt/local/bin/cmake -E cmake_depends "Unix Makefiles" /opt/local/var/macports/build/_opt_local_var_macports_sources_rsync.macports.org_release_ports_science_bladeRF/bladeRF/work/bladeRF-4e78b0596fce7a0fe1a4cdc54a154cb536bba334 /opt/local/var/macports/build/_opt_local_var_macports_sources_rsync.macports.org_release_ports_science_bladeRF/bladeRF/work/bladeRF-4e78b0596fce7a0fe1a4cdc54a154cb536bba334/host/libraries/libbladeRF_test/test_fw_check /opt/local/var/macports/build/_opt_local_var_macports_sources_rsync.macports.org_release_ports_science_bladeRF/bladeRF/work/build /opt/local/var/macports/build/_opt_local_var_macports_sources_rsync.macports.org_release_ports_science_bladeRF/bladeRF/work/build/host/libraries/libbladeRF_test/test_fw_check /opt/local/var/macports/build/_opt_local_var_macports_sources_rsync.macports.org_release_ports_science_bladeRF/bladeRF/work/build/host/libraries/libbladeRF_test/test_fw_check/CMakeFiles/libbladeRF_test_fw_check.dir/DependInfo.cmake --color=
:info:build make[2]: Entering directory `/opt/local/var/macports/build/_opt_local_var_macports_sources_rsync.macports.org_release_ports_science_bladeRF/bladeRF/work/build'
:info:build cd /opt/local/var/macports/build/_opt_local_var_macports_sources_rsync.macports.org_release_ports_science_bladeRF/bladeRF/work/build && /opt/local/bin/cmake -E cmake_depends "Unix Makefiles" /opt/local/var/macports/build/_opt_local_var_macports_sources_rsync.macports.org_release_ports_science_bladeRF/bladeRF/work/bladeRF-4e78b0596fce7a0fe1a4cdc54a154cb536bba334 /opt/local/var/macports/build/_opt_local_var_macports_sources_rsync.macports.org_release_ports_science_bladeRF/bladeRF/work/bladeRF-4e78b0596fce7a0fe1a4cdc54a154cb536bba334/host/libraries/libbladeRF /opt/local/var/macports/build/_opt_local_var_macports_sources_rsync.macports.org_release_ports_science_bladeRF/bladeRF/work/build /opt/local/var/macports/build/_opt_local_var_macports_sources_rsync.macports.org_release_ports_science_bladeRF/bladeRF/work/build/host/libraries/libbladeRF /opt/local/var/macports/build/_opt_local_var_macports_sources_rsync.macports.org_release_ports_science_bladeRF/bladeRF/work/build/host/libraries/libbladeRF/CMakeFiles/libbladerf_shared.dir/DependInfo.cmake --color=
:info:build Dependee "/opt/local/var/macports/build/_opt_local_var_macports_sources_rsync.macports.org_release_ports_science_bladeRF/bladeRF/work/build/host/libraries/libbladeRF_test/test_fw_check/CMakeFiles/libbladeRF_test_fw_check.dir/DependInfo.cmake" is newer than depender "/opt/local/var/macports/build/_opt_local_var_macports_sources_rsync.macports.org_release_ports_science_bladeRF/bladeRF/work/build/host/libraries/libbladeRF_test/test_fw_check/CMakeFiles/libbladeRF_test_fw_check.dir/depend.internal".
:info:build Dependee "/opt/local/var/macports/build/_opt_local_var_macports_sources_rsync.macports.org_release_ports_science_bladeRF/bladeRF/work/build/host/libraries/libbladeRF_test/test_fw_check/CMakeFiles/CMakeDirectoryInformation.cmake" is newer than depender "/opt/local/var/macports/build/_opt_local_var_macports_sources_rsync.macports.org_release_ports_science_bladeRF/bladeRF/work/build/host/libraries/libbladeRF_test/test_fw_check/CMakeFiles/libbladeRF_test_fw_check.dir/depend.internal".
:info:build Scanning dependencies of target libbladeRF_test_fw_check
:info:build make[2]: Leaving directory `/opt/local/var/macports/build/_opt_local_var_macports_sources_rsync.macports.org_release_ports_science_bladeRF/bladeRF/work/build'
:info:build Dependee "/opt/local/var/macports/build/_opt_local_var_macports_sources_rsync.macports.org_release_ports_science_bladeRF/bladeRF/work/build/host/libraries/libbladeRF/CMakeFiles/libbladerf_shared.dir/DependInfo.cmake" is newer than depender "/opt/local/var/macports/build/_opt_local_var_macports_sources_rsync.macports.org_release_ports_science_bladeRF/bladeRF/work/build/host/libraries/libbladeRF/CMakeFiles/libbladerf_shared.dir/depend.internal".
:info:build Dependee "/opt/local/var/macports/build/_opt_local_var_macports_sources_rsync.macports.org_release_ports_science_bladeRF/bladeRF/work/build/host/libraries/libbladeRF/CMakeFiles/CMakeDirectoryInformation.cmake" is newer than depender "/opt/local/var/macports/build/_opt_local_var_macports_sources_rsync.macports.org_release_ports_science_bladeRF/bladeRF/work/build/host/libraries/libbladeRF/CMakeFiles/libbladerf_shared.dir/depend.internal".
:info:build /usr/bin/make -f host/libraries/libbladeRF_test/test_fw_check/CMakeFiles/libbladeRF_test_fw_check.dir/build.make host/libraries/libbladeRF_test/test_fw_check/CMakeFiles/libbladeRF_test_fw_check.dir/build
:info:build make[2]: Entering directory `/opt/local/var/macports/build/_opt_local_var_macports_sources_rsync.macports.org_release_ports_science_bladeRF/bladeRF/work/build'
:info:build /opt/local/bin/cmake -E cmake_progress_report /opt/local/var/macports/build/_opt_local_var_macports_sources_rsync.macports.org_release_ports_science_bladeRF/bladeRF/work/build/CMakeFiles 52
:info:build [  1%] Building C object host/libraries/libbladeRF_test/test_fw_check/CMakeFiles/libbladeRF_test_fw_check.dir/__/__/libbladeRF/src/fx3_fw.c.o
:info:build cd /opt/local/var/macports/build/_opt_local_var_macports_sources_rsync.macports.org_release_ports_science_bladeRF/bladeRF/work/build/host/libraries/libbladeRF_test/test_fw_check && /usr/bin/gcc-4.2  -DLOGGING_ENABLED -DLOG_INCLUDE_FILE_INFO -DTEST_FX3_FW_VALIDATION -Os -arch x86_64  -DNDEBUG -arch x86_64 -mmacosx-version-min=10.6 -I/opt/local/var/macports/build/_opt_local_var_macports_sources_rsync.macports.org_release_ports_science_bladeRF/bladeRF/work/bladeRF-4e78b0596fce7a0fe1a4cdc54a154cb536bba334/host/libraries/libbladeRF/include -I/opt/local/var/macports/build/_opt_local_var_macports_sources_rsync.macports.org_release_ports_science_bladeRF/bladeRF/work/bladeRF-4e78b0596fce7a0fe1a4cdc54a154cb536bba334/host/libraries/libbladeRF/src -I/opt/local/var/macports/build/_opt_local_var_macports_sources_rsync.macports.org_release_ports_science_bladeRF/bladeRF/work/bladeRF-4e78b0596fce7a0fe1a4cdc54a154cb536bba334/host/common/include -I/opt/local/var/macports/build/_opt_local_var_macports_sources_rsync.macports.org_release_ports_science_bladeRF/bladeRF/work/build/host/common/include -I/opt/local/var/macports/build/_opt_local_var_macports_sources_rsync.macports.org_release_ports_science_bladeRF/bladeRF/work/bladeRF-4e78b0596fce7a0fe1a4cdc54a154cb536bba334/host/common/include/osx -I/opt/local/var/macports/build/_opt_local_var_macports_sources_rsync.macports.org_release_ports_science_bladeRF/bladeRF/work/bladeRF-4e78b0596fce7a0fe1a4cdc54a154cb536bba334/host/../firmware_common -I/opt/local/var/macports/build/_opt_local_var_macports_sources_rsync.macports.org_release_ports_science_bladeRF/bladeRF/work/bladeRF-4e78b0596fce7a0fe1a4cdc54a154cb536bba334/host/libraries/libbladeRF_test/test_fw_check/../common/include    -Wall -Wextra -Wno-unused-parameter -Werror -DSHORT_FILE_="fx3_fw.c" -o CMakeFiles/libbladeRF_test_fw_check.dir/__/__/libbladeRF/src/fx3_fw.c.o   -c /opt/local/var/macports/build/_opt_local_var_macports_sources_rsync.macports.org_release_ports_science_bladeRF/bladeRF/work/bladeRF-4e78b0596fce7a0fe1a4cdc54a154cb536bba334/host/libraries/libbladeRF/src/fx3_fw.c
:info:build cc1: warnings being treated as errors
:info:build /opt/local/var/macports/build/_opt_local_var_macports_sources_rsync.macports.org_release_ports_science_bladeRF/bladeRF/work/bladeRF-4e78b0596fce7a0fe1a4cdc54a154cb536bba334/host/libraries/libbladeRF/src/fx3_fw.c: In function ‘is_valid_fx3_ram_addr’:
:info:build /opt/local/var/macports/build/_opt_local_var_macports_sources_rsync.macports.org_release_ports_science_bladeRF/bladeRF/work/bladeRF-4e78b0596fce7a0fe1a4cdc54a154cb536bba334/host/libraries/libbladeRF/src/fx3_fw.c:93: warning: comparison of unsigned expression >= 0 is always true
:info:build Scanning dependencies of target libbladerf_shared
:info:build make[2]: *** [host/libraries/libbladeRF_test/test_fw_check/CMakeFiles/libbladeRF_test_fw_check.dir/__/__/libbladeRF/src/fx3_fw.c.o] Error 1
:info:build make[2]: Leaving directory `/opt/local/var/macports/build/_opt_local_var_macports_sources_rsync.macports.org_release_ports_science_bladeRF/bladeRF/work/build'
:info:build make[1]: *** [host/libraries/libbladeRF_test/test_fw_check/CMakeFiles/libbladeRF_test_fw_check.dir/all] Error 2
:info:build make[1]: *** Waiting for unfinished jobs....
:info:build make[2]: Leaving directory `/opt/local/var/macports/build/_opt_local_var_macports_sources_rsync.macports.org_release_ports_science_bladeRF/bladeRF/work/build'
:info:build /usr/bin/make -f host/libraries/libbladeRF/CMakeFiles/libbladerf_shared.dir/build.make host/libraries/libbladeRF/CMakeFiles/libbladerf_shared.dir/build
:info:build make[2]: Entering directory `/opt/local/var/macports/build/_opt_local_var_macports_sources_rsync.macports.org_release_ports_science_bladeRF/bladeRF/work/build'
:info:build /opt/local/bin/cmake -E cmake_progress_report /opt/local/var/macports/build/_opt_local_var_macports_sources_rsync.macports.org_release_ports_science_bladeRF/bladeRF/work/build/CMakeFiles 75
:info:build /opt/local/bin/cmake -E cmake_progress_report /opt/local/var/macports/build/_opt_local_var_macports_sources_rsync.macports.org_release_ports_science_bladeRF/bladeRF/work/build/CMakeFiles 
:info:build [  2%] [  2%] Building C object host/libraries/libbladeRF/CMakeFiles/libbladerf_shared.dir/src/backend/backend.c.o
:info:build cd /opt/local/var/macports/build/_opt_local_var_macports_sources_rsync.macports.org_release_ports_science_bladeRF/bladeRF/work/build/host/libraries/libbladeRF && /usr/bin/gcc-4.2  -DHAVE_LIBUSB_GET_VERSION -DLOGGING_ENABLED -DLOG_INCLUDE_FILE_INFO -Dlibbladerf_shared_EXPORTS -Os -arch x86_64  -fvisibility=hidden -DNDEBUG -arch x86_64 -mmacosx-version-min=10.6 -fPIC -I/opt/local/var/macports/build/_opt_local_var_macports_sources_rsync.macports.org_release_ports_science_bladeRF/bladeRF/work/bladeRF-4e78b0596fce7a0fe1a4cdc54a154cb536bba334/host/libraries/libbladeRF/include -I/opt/local/var/macports/build/_opt_local_var_macports_sources_rsync.macports.org_release_ports_science_bladeRF/bladeRF/work/bladeRF-4e78b0596fce7a0fe1a4cdc54a154cb536bba334/host/libraries/libbladeRF/src -I/opt/local/var/macports/build/_opt_local_var_macports_sources_rsync.macports.org_release_ports_science_bladeRF/bladeRF/work/bladeRF-4e78b0596fce7a0fe1a4cdc54a154cb536bba334/host/common/include -I/opt/local/var/macports/build/_opt_local_var_macports_sources_rsync.macports.org_release_ports_science_bladeRF/bladeRF/work/build/host/common/include -I/opt/local/var/macports/build/_opt_local_var_macports_sources_rsync.macports.org_release_ports_science_bladeRF/bladeRF/work/bladeRF-4e78b0596fce7a0fe1a4cdc54a154cb536bba334/host/common/include/osx -I/opt/local/var/macports/build/_opt_local_var_macports_sources_rsync.macports.org_release_ports_science_bladeRF/bladeRF/work/bladeRF-4e78b0596fce7a0fe1a4cdc54a154cb536bba334/host/../firmware_common -I/opt/local/var/macports/build/_opt_local_var_macports_sources_rsync.macports.org_release_ports_science_bladeRF/bladeRF/work/build/host/libraries/libbladeRF/src -I/opt/local/include/libusb-1.0    -Wall -Wextra -Wno-unused-parameter -Werror -DSHORT_FILE_="backend.c" -o CMakeFiles/libbladerf_shared.dir/src/backend/backend.c.o   -c /opt/local/var/macports/build/_opt_local_var_macports_sources_rsync.macports.org_release_ports_science_bladeRF/bladeRF/work/bladeRF-4e78b0596fce7a0fe1a4cdc54a154cb536bba334/host/libraries/libbladeRF/src/backend/backend.c
:info:build Building C object host/libraries/libbladeRF/CMakeFiles/libbladerf_shared.dir/src/async.c.o
:info:build cd /opt/local/var/macports/build/_opt_local_var_macports_sources_rsync.macports.org_release_ports_science_bladeRF/bladeRF/work/build/host/libraries/libbladeRF && /usr/bin/gcc-4.2  -DHAVE_LIBUSB_GET_VERSION -DLOGGING_ENABLED -DLOG_INCLUDE_FILE_INFO -Dlibbladerf_shared_EXPORTS -Os -arch x86_64  -fvisibility=hidden -DNDEBUG -arch x86_64 -mmacosx-version-min=10.6 -fPIC -I/opt/local/var/macports/build/_opt_local_var_macports_sources_rsync.macports.org_release_ports_science_bladeRF/bladeRF/work/bladeRF-4e78b0596fce7a0fe1a4cdc54a154cb536bba334/host/libraries/libbladeRF/include -I/opt/local/var/macports/build/_opt_local_var_macports_sources_rsync.macports.org_release_ports_science_bladeRF/bladeRF/work/bladeRF-4e78b0596fce7a0fe1a4cdc54a154cb536bba334/host/libraries/libbladeRF/src -I/opt/local/var/macports/build/_opt_local_var_macports_sources_rsync.macports.org_release_ports_science_bladeRF/bladeRF/work/bladeRF-4e78b0596fce7a0fe1a4cdc54a154cb536bba334/host/common/include -I/opt/local/var/macports/build/_opt_local_var_macports_sources_rsync.macports.org_release_ports_science_bladeRF/bladeRF/work/build/host/common/include -I/opt/local/var/macports/build/_opt_local_var_macports_sources_rsync.macports.org_release_ports_science_bladeRF/bladeRF/work/bladeRF-4e78b0596fce7a0fe1a4cdc54a154cb536bba334/host/common/include/osx -I/opt/local/var/macports/build/_opt_local_var_macports_sources_rsync.macports.org_release_ports_science_bladeRF/bladeRF/work/bladeRF-4e78b0596fce7a0fe1a4cdc54a154cb536bba334/host/../firmware_common -I/opt/local/var/macports/build/_opt_local_var_macports_sources_rsync.macports.org_release_ports_science_bladeRF/bladeRF/work/build/host/libraries/libbladeRF/src -I/opt/local/include/libusb-1.0    -Wall -Wextra -Wno-unused-parameter -Werror -DSHORT_FILE_="async.c" -o CMakeFiles/libbladerf_shared.dir/src/async.c.o   -c /opt/local/var/macports/build/_opt_local_var_macports_sources_rsync.macports.org_release_ports_science_bladeRF/bladeRF/work/bladeRF-4e78b0596fce7a0fe1a4cdc54a154cb536bba334/host/libraries/libbladeRF/src/async.c
:info:build /opt/local/bin/cmake -E cmake_progress_report /opt/local/var/macports/build/_opt_local_var_macports_sources_rsync.macports.org_release_ports_science_bladeRF/bladeRF/work/build/CMakeFiles 76
:info:build [  3%] /opt/local/bin/cmake -E cmake_progress_report /opt/local/var/macports/build/_opt_local_var_macports_sources_rsync.macports.org_release_ports_science_bladeRF/bladeRF/work/build/CMakeFiles 77
:info:build Building C object host/libraries/libbladeRF/CMakeFiles/libbladerf_shared.dir/src/bladerf.c.o
:info:build cd /opt/local/var/macports/build/_opt_local_var_macports_sources_rsync.macports.org_release_ports_science_bladeRF/bladeRF/work/build/host/libraries/libbladeRF && /usr/bin/gcc-4.2  -DHAVE_LIBUSB_GET_VERSION -DLOGGING_ENABLED -DLOG_INCLUDE_FILE_INFO -Dlibbladerf_shared_EXPORTS -Os -arch x86_64  -fvisibility=hidden -DNDEBUG -arch x86_64 -mmacosx-version-min=10.6 -fPIC -I/opt/local/var/macports/build/_opt_local_var_macports_sources_rsync.macports.org_release_ports_science_bladeRF/bladeRF/work/bladeRF-4e78b0596fce7a0fe1a4cdc54a154cb536bba334/host/libraries/libbladeRF/include -I/opt/local/var/macports/build/_opt_local_var_macports_sources_rsync.macports.org_release_ports_science_bladeRF/bladeRF/work/bladeRF-4e78b0596fce7a0fe1a4cdc54a154cb536bba334/host/libraries/libbladeRF/src -I/opt/local/var/macports/build/_opt_local_var_macports_sources_rsync.macports.org_release_ports_science_bladeRF/bladeRF/work/bladeRF-4e78b0596fce7a0fe1a4cdc54a154cb536bba334/host/common/include -I/opt/local/var/macports/build/_opt_local_var_macports_sources_rsync.macports.org_release_ports_science_bladeRF/bladeRF/work/build/host/common/include -I/opt/local/var/macports/build/_opt_local_var_macports_sources_rsync.macports.org_release_ports_science_bladeRF/bladeRF/work/bladeRF-4e78b0596fce7a0fe1a4cdc54a154cb536bba334/host/common/include/osx -I/opt/local/var/macports/build/_opt_local_var_macports_sources_rsync.macports.org_release_ports_science_bladeRF/bladeRF/work/bladeRF-4e78b0596fce7a0fe1a4cdc54a154cb536bba334/host/../firmware_common -I/opt/local/var/macports/build/_opt_local_var_macports_sources_rsync.macports.org_release_ports_science_bladeRF/bladeRF/work/build/host/libraries/libbladeRF/src -I/opt/local/include/libusb-1.0    -Wall -Wextra -Wno-unused-parameter -Werror -DSHORT_FILE_="bladerf.c" -o CMakeFiles/libbladerf_shared.dir/src/bladerf.c.o   -c /opt/local/var/macports/build/_opt_local_var_macports_sources_rsync.macports.org_release_ports_science_bladeRF/bladeRF/work/bladeRF-4e78b0596fce7a0fe1a4cdc54a154cb536bba334/host/libraries/libbladeRF/src/bladerf.c
:info:build [  4%] Building C object host/libraries/libbladeRF/CMakeFiles/libbladerf_shared.dir/src/bladerf_priv.c.o
:info:build cd /opt/local/var/macports/build/_opt_local_var_macports_sources_rsync.macports.org_release_ports_science_bladeRF/bladeRF/work/build/host/libraries/libbladeRF && /usr/bin/gcc-4.2  -DHAVE_LIBUSB_GET_VERSION -DLOGGING_ENABLED -DLOG_INCLUDE_FILE_INFO -Dlibbladerf_shared_EXPORTS -Os -arch x86_64  -fvisibility=hidden -DNDEBUG -arch x86_64 -mmacosx-version-min=10.6 -fPIC -I/opt/local/var/macports/build/_opt_local_var_macports_sources_rsync.macports.org_release_ports_science_bladeRF/bladeRF/work/bladeRF-4e78b0596fce7a0fe1a4cdc54a154cb536bba334/host/libraries/libbladeRF/include -I/opt/local/var/macports/build/_opt_local_var_macports_sources_rsync.macports.org_release_ports_science_bladeRF/bladeRF/work/bladeRF-4e78b0596fce7a0fe1a4cdc54a154cb536bba334/host/libraries/libbladeRF/src -I/opt/local/var/macports/build/_opt_local_var_macports_sources_rsync.macports.org_release_ports_science_bladeRF/bladeRF/work/bladeRF-4e78b0596fce7a0fe1a4cdc54a154cb536bba334/host/common/include -I/opt/local/var/macports/build/_opt_local_var_macports_sources_rsync.macports.org_release_ports_science_bladeRF/bladeRF/work/build/host/common/include -I/opt/local/var/macports/build/_opt_local_var_macports_sources_rsync.macports.org_release_ports_science_bladeRF/bladeRF/work/bladeRF-4e78b0596fce7a0fe1a4cdc54a154cb536bba334/host/common/include/osx -I/opt/local/var/macports/build/_opt_local_var_macports_sources_rsync.macports.org_release_ports_science_bladeRF/bladeRF/work/bladeRF-4e78b0596fce7a0fe1a4cdc54a154cb536bba334/host/../firmware_common -I/opt/local/var/macports/build/_opt_local_var_macports_sources_rsync.macports.org_release_ports_science_bladeRF/bladeRF/work/build/host/libraries/libbladeRF/src -I/opt/local/include/libusb-1.0    -Wall -Wextra -Wno-unused-parameter -Werror -DSHORT_FILE_="bladerf_priv.c" -o CMakeFiles/libbladerf_shared.dir/src/bladerf_priv.c.o   -c /opt/local/var/macports/build/_opt_local_var_macports_sources_rsync.macports.org_release_ports_science_bladeRF/bladeRF/work/bladeRF-4e78b0596fce7a0fe1a4cdc54a154cb536bba334/host/libraries/libbladeRF/src/bladerf_priv.c
:info:build /opt/local/bin/cmake -E cmake_progress_report /opt/local/var/macports/build/_opt_local_var_macports_sources_rsync.macports.org_release_ports_science_bladeRF/bladeRF/work/build/CMakeFiles 78
:info:build [  5%] Building C object host/libraries/libbladeRF/CMakeFiles/libbladerf_shared.dir/src/config.c.o
:info:build cd /opt/local/var/macports/build/_opt_local_var_macports_sources_rsync.macports.org_release_ports_science_bladeRF/bladeRF/work/build/host/libraries/libbladeRF && /usr/bin/gcc-4.2  -DHAVE_LIBUSB_GET_VERSION -DLOGGING_ENABLED -DLOG_INCLUDE_FILE_INFO -Dlibbladerf_shared_EXPORTS -Os -arch x86_64  -fvisibility=hidden -DNDEBUG -arch x86_64 -mmacosx-version-min=10.6 -fPIC -I/opt/local/var/macports/build/_opt_local_var_macports_sources_rsync.macports.org_release_ports_science_bladeRF/bladeRF/work/bladeRF-4e78b0596fce7a0fe1a4cdc54a154cb536bba334/host/libraries/libbladeRF/include -I/opt/local/var/macports/build/_opt_local_var_macports_sources_rsync.macports.org_release_ports_science_bladeRF/bladeRF/work/bladeRF-4e78b0596fce7a0fe1a4cdc54a154cb536bba334/host/libraries/libbladeRF/src -I/opt/local/var/macports/build/_opt_local_var_macports_sources_rsync.macports.org_release_ports_science_bladeRF/bladeRF/work/bladeRF-4e78b0596fce7a0fe1a4cdc54a154cb536bba334/host/common/include -I/opt/local/var/macports/build/_opt_local_var_macports_sources_rsync.macports.org_release_ports_science_bladeRF/bladeRF/work/build/host/common/include -I/opt/local/var/macports/build/_opt_local_var_macports_sources_rsync.macports.org_release_ports_science_bladeRF/bladeRF/work/bladeRF-4e78b0596fce7a0fe1a4cdc54a154cb536bba334/host/common/include/osx -I/opt/local/var/macports/build/_opt_local_var_macports_sources_rsync.macports.org_release_ports_science_bladeRF/bladeRF/work/bladeRF-4e78b0596fce7a0fe1a4cdc54a154cb536bba334/host/../firmware_common -I/opt/local/var/macports/build/_opt_local_var_macports_sources_rsync.macports.org_release_ports_science_bladeRF/bladeRF/work/build/host/libraries/libbladeRF/src -I/opt/local/include/libusb-1.0    -Wall -Wextra -Wno-unused-parameter -Werror -DSHORT_FILE_="config.c" -o CMakeFiles/libbladerf_shared.dir/src/config.c.o   -c /opt/local/var/macports/build/_opt_local_var_macports_sources_rsync.macports.org_release_ports_science_bladeRF/bladeRF/work/bladeRF-4e78b0596fce7a0fe1a4cdc54a154cb536bba334/host/libraries/libbladeRF/src/config.c
:info:build /opt/local/bin/cmake -E cmake_progress_report /opt/local/var/macports/build/_opt_local_var_macports_sources_rsync.macports.org_release_ports_science_bladeRF/bladeRF/work/build/CMakeFiles 79
:info:build [  6%] Building C object host/libraries/libbladeRF/CMakeFiles/libbladerf_shared.dir/src/dc_cal_table.c.o
:info:build cd /opt/local/var/macports/build/_opt_local_var_macports_sources_rsync.macports.org_release_ports_science_bladeRF/bladeRF/work/build/host/libraries/libbladeRF && /usr/bin/gcc-4.2  -DHAVE_LIBUSB_GET_VERSION -DLOGGING_ENABLED -DLOG_INCLUDE_FILE_INFO -Dlibbladerf_shared_EXPORTS -Os -arch x86_64  -fvisibility=hidden -DNDEBUG -arch x86_64 -mmacosx-version-min=10.6 -fPIC -I/opt/local/var/macports/build/_opt_local_var_macports_sources_rsync.macports.org_release_ports_science_bladeRF/bladeRF/work/bladeRF-4e78b0596fce7a0fe1a4cdc54a154cb536bba334/host/libraries/libbladeRF/include -I/opt/local/var/macports/build/_opt_local_var_macports_sources_rsync.macports.org_release_ports_science_bladeRF/bladeRF/work/bladeRF-4e78b0596fce7a0fe1a4cdc54a154cb536bba334/host/libraries/libbladeRF/src -I/opt/local/var/macports/build/_opt_local_var_macports_sources_rsync.macports.org_release_ports_science_bladeRF/bladeRF/work/bladeRF-4e78b0596fce7a0fe1a4cdc54a154cb536bba334/host/common/include -I/opt/local/var/macports/build/_opt_local_var_macports_sources_rsync.macports.org_release_ports_science_bladeRF/bladeRF/work/build/host/common/include -I/opt/local/var/macports/build/_opt_local_var_macports_sources_rsync.macports.org_release_ports_science_bladeRF/bladeRF/work/bladeRF-4e78b0596fce7a0fe1a4cdc54a154cb536bba334/host/common/include/osx -I/opt/local/var/macports/build/_opt_local_var_macports_sources_rsync.macports.org_release_ports_science_bladeRF/bladeRF/work/bladeRF-4e78b0596fce7a0fe1a4cdc54a154cb536bba334/host/../firmware_common -I/opt/local/var/macports/build/_opt_local_var_macports_sources_rsync.macports.org_release_ports_science_bladeRF/bladeRF/work/build/host/libraries/libbladeRF/src -I/opt/local/include/libusb-1.0    -Wall -Wextra -Wno-unused-parameter -Werror -DSHORT_FILE_="dc_cal_table.c" -o CMakeFiles/libbladerf_shared.dir/src/dc_cal_table.c.o   -c /opt/local/var/macports/build/_opt_local_var_macports_sources_rsync.macports.org_release_ports_science_bladeRF/bladeRF/work/bladeRF-4e78b0596fce7a0fe1a4cdc54a154cb536bba334/host/libraries/libbladeRF/src/dc_cal_table.c
:info:build /opt/local/bin/cmake -E cmake_progress_report /opt/local/var/macports/build/_opt_local_var_macports_sources_rsync.macports.org_release_ports_science_bladeRF/bladeRF/work/build/CMakeFiles 80
:info:build [  7%] Building C object host/libraries/libbladeRF/CMakeFiles/libbladerf_shared.dir/src/file_ops.c.o
:info:build cd /opt/local/var/macports/build/_opt_local_var_macports_sources_rsync.macports.org_release_ports_science_bladeRF/bladeRF/work/build/host/libraries/libbladeRF && /usr/bin/gcc-4.2  -DHAVE_LIBUSB_GET_VERSION -DLOGGING_ENABLED -DLOG_INCLUDE_FILE_INFO -Dlibbladerf_shared_EXPORTS -Os -arch x86_64  -fvisibility=hidden -DNDEBUG -arch x86_64 -mmacosx-version-min=10.6 -fPIC -I/opt/local/var/macports/build/_opt_local_var_macports_sources_rsync.macports.org_release_ports_science_bladeRF/bladeRF/work/bladeRF-4e78b0596fce7a0fe1a4cdc54a154cb536bba334/host/libraries/libbladeRF/include -I/opt/local/var/macports/build/_opt_local_var_macports_sources_rsync.macports.org_release_ports_science_bladeRF/bladeRF/work/bladeRF-4e78b0596fce7a0fe1a4cdc54a154cb536bba334/host/libraries/libbladeRF/src -I/opt/local/var/macports/build/_opt_local_var_macports_sources_rsync.macports.org_release_ports_science_bladeRF/bladeRF/work/bladeRF-4e78b0596fce7a0fe1a4cdc54a154cb536bba334/host/common/include -I/opt/local/var/macports/build/_opt_local_var_macports_sources_rsync.macports.org_release_ports_science_bladeRF/bladeRF/work/build/host/common/include -I/opt/local/var/macports/build/_opt_local_var_macports_sources_rsync.macports.org_release_ports_science_bladeRF/bladeRF/work/bladeRF-4e78b0596fce7a0fe1a4cdc54a154cb536bba334/host/common/include/osx -I/opt/local/var/macports/build/_opt_local_var_macports_sources_rsync.macports.org_release_ports_science_bladeRF/bladeRF/work/bladeRF-4e78b0596fce7a0fe1a4cdc54a154cb536bba334/host/../firmware_common -I/opt/local/var/macports/build/_opt_local_var_macports_sources_rsync.macports.org_release_ports_science_bladeRF/bladeRF/work/build/host/libraries/libbladeRF/src -I/opt/local/include/libusb-1.0    -Wall -Wextra -Wno-unused-parameter -Werror -DSHORT_FILE_="file_ops.c" -o CMakeFiles/libbladerf_shared.dir/src/file_ops.c.o   -c /opt/local/var/macports/build/_opt_local_var_macports_sources_rsync.macports.org_release_ports_science_bladeRF/bladeRF/work/bladeRF-4e78b0596fce7a0fe1a4cdc54a154cb536bba334/host/libraries/libbladeRF/src/file_ops.c
:info:build /opt/local/bin/cmake -E cmake_progress_report /opt/local/var/macports/build/_opt_local_var_macports_sources_rsync.macports.org_release_ports_science_bladeRF/bladeRF/work/build/CMakeFiles 81
:info:build [  8%] Building C object host/libraries/libbladeRF/CMakeFiles/libbladerf_shared.dir/src/fx3_fw.c.o
:info:build cd /opt/local/var/macports/build/_opt_local_var_macports_sources_rsync.macports.org_release_ports_science_bladeRF/bladeRF/work/build/host/libraries/libbladeRF && /usr/bin/gcc-4.2  -DHAVE_LIBUSB_GET_VERSION -DLOGGING_ENABLED -DLOG_INCLUDE_FILE_INFO -Dlibbladerf_shared_EXPORTS -Os -arch x86_64  -fvisibility=hidden -DNDEBUG -arch x86_64 -mmacosx-version-min=10.6 -fPIC -I/opt/local/var/macports/build/_opt_local_var_macports_sources_rsync.macports.org_release_ports_science_bladeRF/bladeRF/work/bladeRF-4e78b0596fce7a0fe1a4cdc54a154cb536bba334/host/libraries/libbladeRF/include -I/opt/local/var/macports/build/_opt_local_var_macports_sources_rsync.macports.org_release_ports_science_bladeRF/bladeRF/work/bladeRF-4e78b0596fce7a0fe1a4cdc54a154cb536bba334/host/libraries/libbladeRF/src -I/opt/local/var/macports/build/_opt_local_var_macports_sources_rsync.macports.org_release_ports_science_bladeRF/bladeRF/work/bladeRF-4e78b0596fce7a0fe1a4cdc54a154cb536bba334/host/common/include -I/opt/local/var/macports/build/_opt_local_var_macports_sources_rsync.macports.org_release_ports_science_bladeRF/bladeRF/work/build/host/common/include -I/opt/local/var/macports/build/_opt_local_var_macports_sources_rsync.macports.org_release_ports_science_bladeRF/bladeRF/work/bladeRF-4e78b0596fce7a0fe1a4cdc54a154cb536bba334/host/common/include/osx -I/opt/local/var/macports/build/_opt_local_var_macports_sources_rsync.macports.org_release_ports_science_bladeRF/bladeRF/work/bladeRF-4e78b0596fce7a0fe1a4cdc54a154cb536bba334/host/../firmware_common -I/opt/local/var/macports/build/_opt_local_var_macports_sources_rsync.macports.org_release_ports_science_bladeRF/bladeRF/work/build/host/libraries/libbladeRF/src -I/opt/local/include/libusb-1.0    -Wall -Wextra -Wno-unused-parameter -Werror -DSHORT_FILE_="fx3_fw.c" -o CMakeFiles/libbladerf_shared.dir/src/fx3_fw.c.o   -c /opt/local/var/macports/build/_opt_local_var_macports_sources_rsync.macports.org_release_ports_science_bladeRF/bladeRF/work/bladeRF-4e78b0596fce7a0fe1a4cdc54a154cb536bba334/host/libraries/libbladeRF/src/fx3_fw.c
:info:build cc1: warnings being treated as errors
:info:build /opt/local/var/macports/build/_opt_local_var_macports_sources_rsync.macports.org_release_ports_science_bladeRF/bladeRF/work/bladeRF-4e78b0596fce7a0fe1a4cdc54a154cb536bba334/host/libraries/libbladeRF/src/fx3_fw.c: In function ‘is_valid_fx3_ram_addr’:
:info:build /opt/local/var/macports/build/_opt_local_var_macports_sources_rsync.macports.org_release_ports_science_bladeRF/bladeRF/work/bladeRF-4e78b0596fce7a0fe1a4cdc54a154cb536bba334/host/libraries/libbladeRF/src/fx3_fw.c:93: warning: comparison of unsigned expression >= 0 is always true
:info:build make[2]: *** [host/libraries/libbladeRF/CMakeFiles/libbladerf_shared.dir/src/fx3_fw.c.o] Error 1
:info:build make[2]: *** Waiting for unfinished jobs....
:info:build make[2]: Leaving directory `/opt/local/var/macports/build/_opt_local_var_macports_sources_rsync.macports.org_release_ports_science_bladeRF/bladeRF/work/build'
:info:build make[1]: *** [host/libraries/libbladeRF/CMakeFiles/libbladerf_shared.dir/all] Error 2
:info:build make[1]: Leaving directory `/opt/local/var/macports/build/_opt_local_var_macports_sources_rsync.macports.org_release_ports_science_bladeRF/bladeRF/work/build'
:info:build make: *** [all] Error 2
:info:build make: Leaving directory `/opt/local/var/macports/build/_opt_local_var_macports_sources_rsync.macports.org_release_ports_science_bladeRF/bladeRF/work/build'
:info:build Command failed:  cd "/opt/local/var/macports/build/_opt_local_var_macports_sources_rsync.macports.org_release_ports_science_bladeRF/bladeRF/work/build" && /usr/bin/make -j2 -w all VERBOSE=1 
:info:build Exit code: 2
:error:build org.macports.build for port bladeRF returned: command execution failed
:debug:build Error code: CHILDSTATUS 56742 2
:debug:build Backtrace: command execution failed
    while executing
"system -nice 0 $fullcmdstring"
    ("eval" body line 1)
    invoked from within
"eval system $notty $nice \$fullcmdstring"
    invoked from within
"command_exec build"
    (procedure "portbuild::build_main" line 8)
    invoked from within
"portbuild::build_main org.macports.build"
    ("eval" body line 1)
    invoked from within
"eval $procedure $targetname"
:info:build Warning: targets not executed for bladeRF: org.macports.activate org.macports.build org.macports.destroot org.macports.install
:notice:build Please see the log file for port bladeRF for details:
    /opt/local/var/macports/logs/_opt_local_var_macports_sources_rsync.macports.org_release_ports_science_bladeRF/bladeRF/main.log

Changed 6 years ago by jbwmyoung@…

Attachment: main_v2.log added

comment:4 Changed 6 years ago by mf2k (Frank Schima)

Owner: changed from macports-tickets@… to michaelld@…

In the future, please Cc the port maintainers (port info --maintainers bladeRF), if any, and do not paste the log into the description.

comment:5 Changed 6 years ago by mf2k (Frank Schima)

Description: modified (diff)

comment:6 Changed 6 years ago by michaelld (Michael Dickens)

Should be fixed in r132772. Please do:

sudo port clean bladeRF
sudo port selfupdate
sudo port install bladeRF

and this time it should install cleanly. Please let this ticket know either way what happens.

comment:7 Changed 6 years ago by jbwmyoung@…

Sorry about the pasting of the log file. I saw it in some other tickets, so I thought it was expected. I will just attach it in the future. Also I will CC the maintainers. Thanks for the info.

It installed properly now. Thanks.

comment:8 Changed 6 years ago by michaelld (Michael Dickens)

Resolution: fixed
Status: newclosed

Great! Thanks for replying so promptly.

Note: See TracTickets for help on using tickets.