Opened 6 years ago

Closed 6 years ago

#48676 closed defect (wontfix)

lame-3.99.5_1.darwin_10.x86_64 on OSX 10.6.8

Reported by: fieldlab Owned by: macports-tickets@…
Priority: Normal Milestone:
Component: ports Version: 2.3.3
Keywords: Cc:
Port: lame

Description

Error:

:info:configure configure: creating ./config.status
:info:configure config.status: creating Makefile
:info:configure dyld: Library not loaded: /opt/local/lib/libncurses.5.dylib
:info:configure   Referenced from: /opt/local/lib/libreadline.6.dylib
:info:configure   Reason: no suitable image found.  Did find:
:info:configure 	/usr/lib/libncurses.5.dylib: no matching architecture in universal wrapper
:info:configure sed: stdout: Broken pipe
:info:configure ./config.status: line 1278: 32156 Done(1)                 eval sed \"\$ac_sed_extra\" "$ac_file_inputs"
:info:configure      32157 Trace/BPT trap          | $AWK -f "$ac_tmp/subs.awk" > $ac_tmp/out
:info:configure config.status: error: could not create Makefile
:info:configure Command failed:  cd "/opt/local/var/macports/build/_opt_local_var_macports_sources_rsync.macports.org_release_tarballs_ports_audio_lame/lame/work/lame-3.99.5" && ./configure --prefix=/opt/local 
:info:configure Exit code: 1
:error:configure Failed to configure lame, consult /opt/local/var/macports/build/_opt_local_var_macports_sources_rsync.macports.org_release_tarballs_ports_audio_lame/lame/work/lame-3.99.5/config.log
:error:configure org.macports.configure for port lame returned: configure failure: command execution failed
:debug:configure Error code: NONE
:debug:configure Backtrace: configure failure: command execution failed
    while executing
"portconfigure::configure_main org.macports.configure"
    ("eval" body line 1)
    invoked from within
"eval $procedure $targetname"
:info:configure Warning: targets not executed for lame: org.macports.install org.macports.configure org.macports.build org.macports.destroot
:notice:configure Please see the log file for port lame for details:
    /opt/local/var/macports/logs/_opt_local_var_macports_sources_rsync.macports.org_release_tarballs_ports_audio_lame/lame/main.log


build config log *


administrator$ cat /opt/local/var/macports/build/_opt_local_var_macports_sources_rsync.macports.org_release_tarballs_ports_audio_lame/lame/work/lame-3.99.5/config.log
This file contains any messages produced by compilers while
running configure, to aid debugging if configure makes a mistake.

It was created by lame configure 3.99.5, which was
generated by GNU Autoconf 2.68.  Invocation command line was

  $ ./configure --prefix=/opt/local

## --------- ##
## Platform. ##
## --------- ##

hostname = iMac-desk.local
uname -m = i386
uname -r = 10.8.0
uname -s = Darwin
uname -v = Darwin Kernel Version 10.8.0: Tue Jun  7 16:33:36 PDT 2011; root:xnu-1504.15.3~1/RELEASE_I386

/usr/bin/uname -p = i386
/bin/uname -X     = unknown

/bin/arch              = unknown
/usr/bin/arch -k       = unknown
/usr/convex/getsysinfo = unknown
/usr/bin/hostinfo      = Mach kernel version:
	 Darwin Kernel Version 10.8.0: Tue Jun  7 16:33:36 PDT 2011; root:xnu-1504.15.3~1/RELEASE_I386
Kernel configured for up to 2 processors.
2 processors are physically available.
2 processors are logically available.
Processor type: i486 (Intel 80486)
Processors active: 0 1
Primary memory available: 2.00 gigabytes
Default processor set: 85 tasks, 373 threads, 2 processors
Load average: 1.75, Mach factor: 0.86
/bin/machine           = unknown
/usr/bin/oslevel       = unknown
/bin/universe          = unknown

PATH: /opt/local/bin
PATH: /opt/local/sbin
PATH: /bin
PATH: /sbin
PATH: /usr/bin
PATH: /usr/sbin


## ----------- ##
## Core tests. ##
## ----------- ##

configure:2555: checking build system type
configure:2569: result: i686-apple-darwin10.8.0
configure:2589: checking host system type
configure:2602: result: i686-apple-darwin10.8.0
configure:2639: checking for a BSD-compatible install
configure:2707: result: /usr/bin/install -c
configure:2718: checking whether build environment is sane
configure:2768: result: yes
configure:2909: checking for a thread-safe mkdir -p
configure:2948: result: /opt/local/bin/gmkdir -p
configure:2961: checking for gawk
configure:2977: found /opt/local/bin/gawk
configure:2988: result: gawk
configure:2999: checking whether make sets $(MAKE)
configure:3021: result: yes
configure:3104: checking whether to enable maintainer-specific portions of Makefiles
configure:3113: result: no
configure:3133: checking for style of include used by make
configure:3161: result: GNU
configure:3237: checking for gcc
configure:3264: result: /usr/bin/gcc-4.2
configure:3493: checking for C compiler version
configure:3502: /usr/bin/gcc-4.2 --version >&5
i686-apple-darwin10-gcc-4.2.1 (GCC) 4.2.1 (Apple Inc. build 5666) (dot 3)
Copyright (C) 2007 Free Software Foundation, Inc.
This is free software; see the source for copying conditions.  There is NO
warranty; not even for MERCHANTABILITY or FITNESS FOR A PARTICULAR PURPOSE.

configure:3513: $? = 0
configure:3502: /usr/bin/gcc-4.2 -v >&5
Using built-in specs.
Target: i686-apple-darwin10
Configured with: /var/tmp/gcc/gcc-5666.3~6/src/configure --disable-checking --enable-werror --prefix=/usr --mandir=/share/man --enable-languages=c,objc,c++,obj-c++ --program-transform-name=/^[cg][^.-]*$/s/$/-4.2/ --with-slibdir=/usr/lib --build=i686-apple-darwin10 --program-prefix=i686-apple-darwin10- --host=x86_64-apple-darwin10 --target=i686-apple-darwin10 --with-gxx-include-dir=/include/c++/4.2.1
Thread model: posix
gcc version 4.2.1 (Apple Inc. build 5666) (dot 3)
configure:3513: $? = 0
configure:3502: /usr/bin/gcc-4.2 -V >&5
gcc-4.2: argument to `-V' is missing
configure:3513: $? = 1
configure:3502: /usr/bin/gcc-4.2 -qversion >&5
i686-apple-darwin10-gcc-4.2.1: no input files
configure:3513: $? = 1
configure:3533: checking whether the C compiler works
configure:3555: /usr/bin/gcc-4.2 -pipe -Os -arch x86_64 -I/opt/local/include -L/opt/local/lib -Wl,-headerpad_max_install_names -arch x86_64 conftest.c  >&5
configure:3559: $? = 0
configure:3607: result: yes
configure:3610: checking for C compiler default output file name
configure:3612: result: a.out
configure:3618: checking for suffix of executables
configure:3625: /usr/bin/gcc-4.2 -o conftest -pipe -Os -arch x86_64 -I/opt/local/include -L/opt/local/lib -Wl,-headerpad_max_install_names -arch x86_64 conftest.c  >&5
configure:3629: $? = 0
configure:3651: result: 
configure:3673: checking whether we are cross compiling
configure:3681: /usr/bin/gcc-4.2 -o conftest -pipe -Os -arch x86_64 -I/opt/local/include -L/opt/local/lib -Wl,-headerpad_max_install_names -arch x86_64 conftest.c  >&5
configure:3685: $? = 0
configure:3692: ./conftest
configure:3696: $? = 0
configure:3711: result: no
configure:3716: checking for suffix of object files
configure:3738: /usr/bin/gcc-4.2 -c -pipe -Os -arch x86_64 -I/opt/local/include conftest.c >&5
configure:3742: $? = 0
configure:3763: result: o
configure:3767: checking whether we are using the GNU C compiler
configure:3786: /usr/bin/gcc-4.2 -c -pipe -Os -arch x86_64 -I/opt/local/include conftest.c >&5
configure:3786: $? = 0
configure:3795: result: yes
configure:3804: checking whether /usr/bin/gcc-4.2 accepts -g
configure:3824: /usr/bin/gcc-4.2 -c -g -I/opt/local/include conftest.c >&5
configure:3824: $? = 0
configure:3865: result: yes
configure:3882: checking for /usr/bin/gcc-4.2 option to accept ISO C89
configure:3946: /usr/bin/gcc-4.2  -c -pipe -Os -arch x86_64 -I/opt/local/include conftest.c >&5
configure:3946: $? = 0
configure:3959: result: none needed
configure:3981: checking dependency style of /usr/bin/gcc-4.2
configure:4091: result: gcc3
configure:4112: checking how to run the C preprocessor
configure:4143: /usr/bin/gcc-4.2 -E -I/opt/local/include conftest.c
configure:4143: $? = 0
configure:4157: /usr/bin/gcc-4.2 -E -I/opt/local/include conftest.c
conftest.c:11:28: error: ac_nonexistent.h: No such file or directory
configure:4157: $? = 1
configure: failed program was:
| /* confdefs.h */
| #define PACKAGE_NAME "lame"
| #define PACKAGE_TARNAME "lame"
| #define PACKAGE_VERSION "3.99.5"
| #define PACKAGE_STRING "lame 3.99.5"
| #define PACKAGE_BUGREPORT "lame-dev@lists.sf.net"
| #define PACKAGE_URL ""
| #define PACKAGE "lame"
| #define VERSION "3.99.5"
| /* end confdefs.h.  */
| #include <ac_nonexistent.h>
configure:4182: result: /usr/bin/gcc-4.2 -E
configure:4202: /usr/bin/gcc-4.2 -E -I/opt/local/include conftest.c
configure:4202: $? = 0
configure:4216: /usr/bin/gcc-4.2 -E -I/opt/local/include conftest.c
conftest.c:11:28: error: ac_nonexistent.h: No such file or directory
configure:4216: $? = 1
configure: failed program was:
| /* confdefs.h */
| #define PACKAGE_NAME "lame"
| #define PACKAGE_TARNAME "lame"
| #define PACKAGE_VERSION "3.99.5"
| #define PACKAGE_STRING "lame 3.99.5"
| #define PACKAGE_BUGREPORT "lame-dev@lists.sf.net"
| #define PACKAGE_URL ""
| #define PACKAGE "lame"
| #define VERSION "3.99.5"
| /* end confdefs.h.  */
| #include <ac_nonexistent.h>
configure:4245: checking for grep that handles long lines and -e
configure:4303: result: /usr/bin/grep
configure:4308: checking for egrep
configure:4370: result: /usr/bin/grep -E
configure:4375: checking for ANSI C header files
configure:4395: /usr/bin/gcc-4.2 -c -pipe -Os -arch x86_64 -I/opt/local/include conftest.c >&5
configure:4395: $? = 0
configure:4468: /usr/bin/gcc-4.2 -o conftest -pipe -Os -arch x86_64 -I/opt/local/include -L/opt/local/lib -Wl,-headerpad_max_install_names -arch x86_64 conftest.c  >&5
configure:4468: $? = 0
configure:4468: ./conftest
configure:4468: $? = 0
configure:4479: result: yes
configure:4492: checking for sys/types.h
configure:4492: /usr/bin/gcc-4.2 -c -pipe -Os -arch x86_64 -I/opt/local/include conftest.c >&5
configure:4492: $? = 0
configure:4492: result: yes
configure:4492: checking for sys/stat.h
configure:4492: /usr/bin/gcc-4.2 -c -pipe -Os -arch x86_64 -I/opt/local/include conftest.c >&5
configure:4492: $? = 0
configure:4492: result: yes
configure:4492: checking for stdlib.h
configure:4492: /usr/bin/gcc-4.2 -c -pipe -Os -arch x86_64 -I/opt/local/include conftest.c >&5
configure:4492: $? = 0
configure:4492: result: yes
configure:4492: checking for string.h
configure:4492: /usr/bin/gcc-4.2 -c -pipe -Os -arch x86_64 -I/opt/local/include conftest.c >&5
configure:4492: $? = 0
configure:4492: result: yes
configure:4492: checking for memory.h
configure:4492: /usr/bin/gcc-4.2 -c -pipe -Os -arch x86_64 -I/opt/local/include conftest.c >&5
configure:4492: $? = 0
configure:4492: result: yes
configure:4492: checking for strings.h
configure:4492: /usr/bin/gcc-4.2 -c -pipe -Os -arch x86_64 -I/opt/local/include conftest.c >&5
configure:4492: $? = 0
configure:4492: result: yes
configure:4492: checking for inttypes.h
configure:4492: /usr/bin/gcc-4.2 -c -pipe -Os -arch x86_64 -I/opt/local/include conftest.c >&5
configure:4492: $? = 0
configure:4492: result: yes
configure:4492: checking for stdint.h
configure:4492: /usr/bin/gcc-4.2 -c -pipe -Os -arch x86_64 -I/opt/local/include conftest.c >&5
configure:4492: $? = 0
configure:4492: result: yes
configure:4492: checking for unistd.h
configure:4492: /usr/bin/gcc-4.2 -c -pipe -Os -arch x86_64 -I/opt/local/include conftest.c >&5
configure:4492: $? = 0
configure:4492: result: yes
configure:4505: checking minix/config.h usability
configure:4505: /usr/bin/gcc-4.2 -c -pipe -Os -arch x86_64 -I/opt/local/include conftest.c >&5
conftest.c:54:26: error: minix/config.h: No such file or directory
configure:4505: $? = 1
configure: failed program was:
| /* confdefs.h */
| #define PACKAGE_NAME "lame"
| #define PACKAGE_TARNAME "lame"
| #define PACKAGE_VERSION "3.99.5"
| #define PACKAGE_STRING "lame 3.99.5"
| #define PACKAGE_BUGREPORT "lame-dev@lists.sf.net"
| #define PACKAGE_URL ""
| #define PACKAGE "lame"
| #define VERSION "3.99.5"
| #define STDC_HEADERS 1
| #define HAVE_SYS_TYPES_H 1
| #define HAVE_SYS_STAT_H 1
| #define HAVE_STDLIB_H 1
| #define HAVE_STRING_H 1
| #define HAVE_MEMORY_H 1
| #define HAVE_STRINGS_H 1
| #define HAVE_INTTYPES_H 1
| #define HAVE_STDINT_H 1
| #define HAVE_UNISTD_H 1
| /* end confdefs.h.  */
| #include <stdio.h>
| #ifdef HAVE_SYS_TYPES_H
| # include <sys/types.h>
| #endif
| #ifdef HAVE_SYS_STAT_H
| # include <sys/stat.h>
| #endif
| #ifdef STDC_HEADERS
| # include <stdlib.h>
| # include <stddef.h>
| #else
| # ifdef HAVE_STDLIB_H
| #  include <stdlib.h>
| # endif
| #endif
| #ifdef HAVE_STRING_H
| # if !defined STDC_HEADERS && defined HAVE_MEMORY_H
| #  include <memory.h>
| # endif
| # include <string.h>
| #endif
| #ifdef HAVE_STRINGS_H
| # include <strings.h>
| #endif
| #ifdef HAVE_INTTYPES_H
| # include <inttypes.h>
| #endif
| #ifdef HAVE_STDINT_H
| # include <stdint.h>
| #endif
| #ifdef HAVE_UNISTD_H
| # include <unistd.h>
| #endif
| #include <minix/config.h>
configure:4505: result: no
configure:4505: checking minix/config.h presence
configure:4505: /usr/bin/gcc-4.2 -E -I/opt/local/include conftest.c
conftest.c:21:26: error: minix/config.h: No such file or directory
configure:4505: $? = 1
configure: failed program was:
| /* confdefs.h */
| #define PACKAGE_NAME "lame"
| #define PACKAGE_TARNAME "lame"
| #define PACKAGE_VERSION "3.99.5"
| #define PACKAGE_STRING "lame 3.99.5"
| #define PACKAGE_BUGREPORT "lame-dev@lists.sf.net"
| #define PACKAGE_URL ""
| #define PACKAGE "lame"
| #define VERSION "3.99.5"
| #define STDC_HEADERS 1
| #define HAVE_SYS_TYPES_H 1
| #define HAVE_SYS_STAT_H 1
| #define HAVE_STDLIB_H 1
| #define HAVE_STRING_H 1
| #define HAVE_MEMORY_H 1
| #define HAVE_STRINGS_H 1
| #define HAVE_INTTYPES_H 1
| #define HAVE_STDINT_H 1
| #define HAVE_UNISTD_H 1
| /* end confdefs.h.  */
| #include <minix/config.h>
configure:4505: result: no
configure:4505: checking for minix/config.h
configure:4505: result: no
configure:4526: checking whether it is safe to define __EXTENSIONS__
configure:4544: /usr/bin/gcc-4.2 -c -pipe -Os -arch x86_64 -I/opt/local/include conftest.c >&5
configure:4544: $? = 0
configure:4551: result: yes
configure:4566: checking for library containing strerror
configure:4597: /usr/bin/gcc-4.2 -o conftest -pipe -Os -arch x86_64 -I/opt/local/include -L/opt/local/lib -Wl,-headerpad_max_install_names -arch x86_64 conftest.c  >&5
configure:4597: $? = 0
configure:4614: result: none required
configure:4675: checking how to print strings
configure:4702: result: printf
configure:4723: checking for a sed that does not truncate output
configure:4787: result: /usr/bin/sed
configure:4805: checking for fgrep
configure:4867: result: /usr/bin/grep -F
configure:4902: checking for ld used by /usr/bin/gcc-4.2
configure:4969: result: /usr/libexec/gcc/i686-apple-darwin10/4.2.1/ld
configure:4976: checking if the linker (/usr/libexec/gcc/i686-apple-darwin10/4.2.1/ld) is GNU ld
configure:4991: result: no
configure:5003: checking for BSD- or MS-compatible name lister (nm)
configure:5052: result: /opt/local/bin/nm
configure:5182: checking the name lister (/opt/local/bin/nm) interface
configure:5189: /usr/bin/gcc-4.2 -c -pipe -Os -arch x86_64 -I/opt/local/include conftest.c >&5
configure:5192: /opt/local/bin/nm "conftest.o"
configure:5195: output
0000000000000000 D _some_variable
configure:5202: result: BSD nm
configure:5205: checking whether ln -s works
configure:5209: result: yes
configure:5217: checking the maximum length of command line arguments
configure:5342: result: 196608
configure:5359: checking whether the shell understands some XSI constructs
configure:5369: result: yes
configure:5373: checking whether the shell understands "+="
configure:5379: result: yes
configure:5414: checking for /usr/libexec/gcc/i686-apple-darwin10/4.2.1/ld option to reload object files
configure:5421: result: -r
configure:5490: checking for objdump
configure:5520: result: no
configure:5549: checking how to recognize dependent libraries
configure:5751: result: pass_all
configure:5811: checking for ar
configure:5827: found /opt/local/bin/ar
configure:5838: result: ar
configure:5916: checking for strip
configure:5932: found /opt/local/bin/strip
configure:5943: result: strip
configure:6015: checking for ranlib
configure:6031: found /opt/local/bin/ranlib
configure:6042: result: ranlib
configure:6144: checking command to parse /opt/local/bin/nm output from /usr/bin/gcc-4.2 object
configure:6262: /usr/bin/gcc-4.2 -c -pipe -Os -arch x86_64 -I/opt/local/include conftest.c >&5
configure:6265: $? = 0
configure:6269: /opt/local/bin/nm conftest.o \| sed -n -e 's/^.*[ ]\([BCDEGRST][BCDEGRST]*\)[ ][ ]*\([_A-Za-z][_A-Za-z0-9]*\)$/\1 \2 \2/p' \> conftest.nm
configure:6272: $? = 0
cannot find nm_test_var in conftest.nm
configure:6262: /usr/bin/gcc-4.2 -c -pipe -Os -arch x86_64 -I/opt/local/include conftest.c >&5
configure:6265: $? = 0
configure:6269: /opt/local/bin/nm conftest.o \| sed -n -e 's/^.*[ ]\([BCDEGRST][BCDEGRST]*\)[ ][ ]*_\([_A-Za-z][_A-Za-z0-9]*\)$/\1 _\2 \2/p' \> conftest.nm
configure:6272: $? = 0
configure:6326: /usr/bin/gcc-4.2 -o conftest -pipe -Os -arch x86_64 -I/opt/local/include -L/opt/local/lib -Wl,-headerpad_max_install_names -arch x86_64 conftest.c conftstm.o >&5
configure:6329: $? = 0
configure:6367: result: ok
configure:6631: checking for dsymutil
configure:6647: found /usr/bin/dsymutil
configure:6658: result: dsymutil
configure:6723: checking for nmedit
configure:6739: found /opt/local/bin/nmedit
configure:6750: result: nmedit
configure:6815: checking for lipo
configure:6831: found /opt/local/bin/lipo
configure:6842: result: lipo
configure:6907: checking for otool
configure:6923: found /opt/local/bin/otool
configure:6934: result: otool
configure:6999: checking for otool64
configure:7029: result: no
configure:7074: checking for -single_module linker flag
/usr/bin/gcc-4.2 -pipe -Os -arch x86_64 -L/opt/local/lib -Wl,-headerpad_max_install_names -arch x86_64 -o libconftest.dylib -dynamiclib -Wl,-single_module conftest.c
configure:7101: result: yes
configure:7103: checking for -exported_symbols_list linker flag
configure:7123: /usr/bin/gcc-4.2 -o conftest -pipe -Os -arch x86_64 -I/opt/local/include -L/opt/local/lib -Wl,-headerpad_max_install_names -arch x86_64 -Wl,-exported_symbols_list,conftest.sym conftest.c  >&5
configure:7123: $? = 0
configure:7133: result: yes
configure:7135: checking for -force_load linker flag
/usr/bin/gcc-4.2 -pipe -Os -arch x86_64 -c -o conftest.o conftest.c
ar cru libconftest.a conftest.o
ranlib libconftest.a
/usr/bin/gcc-4.2 -pipe -Os -arch x86_64 -L/opt/local/lib -Wl,-headerpad_max_install_names -arch x86_64 -o conftest conftest.c -Wl,-force_load,./libconftest.a
configure:7165: result: yes
configure:7204: checking for dlfcn.h
configure:7204: /usr/bin/gcc-4.2 -c -pipe -Os -arch x86_64 -I/opt/local/include conftest.c >&5
configure:7204: $? = 0
configure:7204: result: yes
configure:7391: checking for objdir
configure:7406: result: .libs
configure:7673: checking if /usr/bin/gcc-4.2 supports -fno-rtti -fno-exceptions
configure:7691: /usr/bin/gcc-4.2 -c -pipe -Os -arch x86_64 -I/opt/local/include -fno-rtti -fno-exceptions conftest.c >&5
cc1: warning: command line option "-fno-rtti" is valid for C++/ObjC++ but not for C
configure:7695: $? = 0
configure:7708: result: no
configure:7728: checking for /usr/bin/gcc-4.2 option to produce PIC
configure:8013: result: -fno-common -DPIC
configure:8025: checking if /usr/bin/gcc-4.2 PIC flag -fno-common -DPIC works
configure:8043: /usr/bin/gcc-4.2 -c -pipe -Os -arch x86_64 -I/opt/local/include -fno-common -DPIC -DPIC conftest.c >&5
configure:8047: $? = 0
configure:8060: result: yes
configure:8084: checking if /usr/bin/gcc-4.2 static flag -static works
configure:8112: result: no
configure:8127: checking if /usr/bin/gcc-4.2 supports -c -o file.o
configure:8148: /usr/bin/gcc-4.2 -c -pipe -Os -arch x86_64 -I/opt/local/include -o out/conftest2.o conftest.c >&5
configure:8152: $? = 0
configure:8174: result: yes
configure:8182: checking if /usr/bin/gcc-4.2 supports -c -o file.o
configure:8229: result: yes
configure:8262: checking whether the /usr/bin/gcc-4.2 linker (/usr/libexec/gcc/i686-apple-darwin10/4.2.1/ld) supports shared libraries
configure:9337: result: yes
configure:9582: checking dynamic linker characteristics
configure:10259: result: darwin10.8.0 dyld
configure:10366: checking how to hardcode library paths into programs
configure:10391: result: immediate
configure:10931: checking whether stripping libraries is possible
configure:10945: result: yes
configure:10971: checking if libtool supports shared libraries
configure:10973: result: yes
configure:10976: checking whether to build shared libraries
configure:10997: result: yes
configure:11000: checking whether to build static libraries
configure:11004: result: yes
configure:11106: checking for gcc
configure:11133: result: /usr/bin/gcc-4.2
configure:11362: checking for C compiler version
configure:11371: /usr/bin/gcc-4.2 --version >&5
i686-apple-darwin10-gcc-4.2.1 (GCC) 4.2.1 (Apple Inc. build 5666) (dot 3)
Copyright (C) 2007 Free Software Foundation, Inc.
This is free software; see the source for copying conditions.  There is NO
warranty; not even for MERCHANTABILITY or FITNESS FOR A PARTICULAR PURPOSE.

configure:11382: $? = 0
configure:11371: /usr/bin/gcc-4.2 -v >&5
Using built-in specs.
Target: i686-apple-darwin10
Configured with: /var/tmp/gcc/gcc-5666.3~6/src/configure --disable-checking --enable-werror --prefix=/usr --mandir=/share/man --enable-languages=c,objc,c++,obj-c++ --program-transform-name=/^[cg][^.-]*$/s/$/-4.2/ --with-slibdir=/usr/lib --build=i686-apple-darwin10 --program-prefix=i686-apple-darwin10- --host=x86_64-apple-darwin10 --target=i686-apple-darwin10 --with-gxx-include-dir=/include/c++/4.2.1
Thread model: posix
gcc version 4.2.1 (Apple Inc. build 5666) (dot 3)
configure:11382: $? = 0
configure:11371: /usr/bin/gcc-4.2 -V >&5
gcc-4.2: argument to `-V' is missing
configure:11382: $? = 1
configure:11371: /usr/bin/gcc-4.2 -qversion >&5
i686-apple-darwin10-gcc-4.2.1: no input files
configure:11382: $? = 1
configure:11386: checking whether we are using the GNU C compiler
configure:11414: result: yes
configure:11423: checking whether /usr/bin/gcc-4.2 accepts -g
configure:11484: result: yes
configure:11501: checking for /usr/bin/gcc-4.2 option to accept ISO C89
configure:11578: result: none needed
configure:11600: checking dependency style of /usr/bin/gcc-4.2
configure:11710: result: gcc3
configure:11727: checking version of GCC
configure:11730: result: (dot
configure:11734: checking for function prototypes
configure:11737: result: yes
configure:11760: checking for string.h
configure:11760: result: yes
configure:11772: checking dmalloc.h usability
configure:11772: /usr/bin/gcc-4.2 -c -pipe -Os -arch x86_64 -I/opt/local/include conftest.c >&5
conftest.c:64:21: error: dmalloc.h: No such file or directory
configure:11772: $? = 1
configure: failed program was:
| /* confdefs.h */
| #define PACKAGE_NAME "lame"
| #define PACKAGE_TARNAME "lame"
| #define PACKAGE_VERSION "3.99.5"
| #define PACKAGE_STRING "lame 3.99.5"
| #define PACKAGE_BUGREPORT "lame-dev@lists.sf.net"
| #define PACKAGE_URL ""
| #define PACKAGE "lame"
| #define VERSION "3.99.5"
| #define STDC_HEADERS 1
| #define HAVE_SYS_TYPES_H 1
| #define HAVE_SYS_STAT_H 1
| #define HAVE_STDLIB_H 1
| #define HAVE_STRING_H 1
| #define HAVE_MEMORY_H 1
| #define HAVE_STRINGS_H 1
| #define HAVE_INTTYPES_H 1
| #define HAVE_STDINT_H 1
| #define HAVE_UNISTD_H 1
| #define __EXTENSIONS__ 1
| #define _ALL_SOURCE 1
| #define _GNU_SOURCE 1
| #define _POSIX_PTHREAD_SEMANTICS 1
| #define _TANDEM_SOURCE 1
| #define HAVE_DLFCN_H 1
| #define LT_OBJDIR ".libs/"
| #define PROTOTYPES 1
| #define __PROTOTYPES 1
| #define HAVE_STRING_H 1
| /* end confdefs.h.  */
| #include <stdio.h>
| #ifdef HAVE_SYS_TYPES_H
| # include <sys/types.h>
| #endif
| #ifdef HAVE_SYS_STAT_H
| # include <sys/stat.h>
| #endif
| #ifdef STDC_HEADERS
| # include <stdlib.h>
| # include <stddef.h>
| #else
| # ifdef HAVE_STDLIB_H
| #  include <stdlib.h>
| # endif
| #endif
| #ifdef HAVE_STRING_H
| # if !defined STDC_HEADERS && defined HAVE_MEMORY_H
| #  include <memory.h>
| # endif
| # include <string.h>
| #endif
| #ifdef HAVE_STRINGS_H
| # include <strings.h>
| #endif
| #ifdef HAVE_INTTYPES_H
| # include <inttypes.h>
| #endif
| #ifdef HAVE_STDINT_H
| # include <stdint.h>
| #endif
| #ifdef HAVE_UNISTD_H
| # include <unistd.h>
| #endif
| #include <dmalloc.h>
configure:11772: result: no
configure:11772: checking dmalloc.h presence
configure:11772: /usr/bin/gcc-4.2 -E -I/opt/local/include conftest.c
conftest.c:31:21: error: dmalloc.h: No such file or directory
configure:11772: $? = 1
configure: failed program was:
| /* confdefs.h */
| #define PACKAGE_NAME "lame"
| #define PACKAGE_TARNAME "lame"
| #define PACKAGE_VERSION "3.99.5"
| #define PACKAGE_STRING "lame 3.99.5"
| #define PACKAGE_BUGREPORT "lame-dev@lists.sf.net"
| #define PACKAGE_URL ""
| #define PACKAGE "lame"
| #define VERSION "3.99.5"
| #define STDC_HEADERS 1
| #define HAVE_SYS_TYPES_H 1
| #define HAVE_SYS_STAT_H 1
| #define HAVE_STDLIB_H 1
| #define HAVE_STRING_H 1
| #define HAVE_MEMORY_H 1
| #define HAVE_STRINGS_H 1
| #define HAVE_INTTYPES_H 1
| #define HAVE_STDINT_H 1
| #define HAVE_UNISTD_H 1
| #define __EXTENSIONS__ 1
| #define _ALL_SOURCE 1
| #define _GNU_SOURCE 1
| #define _POSIX_PTHREAD_SEMANTICS 1
| #define _TANDEM_SOURCE 1
| #define HAVE_DLFCN_H 1
| #define LT_OBJDIR ".libs/"
| #define PROTOTYPES 1
| #define __PROTOTYPES 1
| #define HAVE_STRING_H 1
| /* end confdefs.h.  */
| #include <dmalloc.h>
configure:11772: result: no
configure:11772: checking for dmalloc.h
configure:11772: result: no
configure:11804: checking for ANSI C header files
configure:11908: result: yes
configure:11929: checking errno.h usability
configure:11929: /usr/bin/gcc-4.2 -c -pipe -Os -arch x86_64 -I/opt/local/include conftest.c >&5
configure:11929: $? = 0
configure:11929: result: yes
configure:11929: checking errno.h presence
configure:11929: /usr/bin/gcc-4.2 -E -I/opt/local/include conftest.c
configure:11929: $? = 0
configure:11929: result: yes
configure:11929: checking for errno.h
configure:11929: result: yes
configure:11929: checking fcntl.h usability
configure:11929: /usr/bin/gcc-4.2 -c -pipe -Os -arch x86_64 -I/opt/local/include conftest.c >&5
configure:11929: $? = 0
configure:11929: result: yes
configure:11929: checking fcntl.h presence
configure:11929: /usr/bin/gcc-4.2 -E -I/opt/local/include conftest.c
configure:11929: $? = 0
configure:11929: result: yes
configure:11929: checking for fcntl.h
configure:11929: result: yes
configure:11929: checking limits.h usability
configure:11929: /usr/bin/gcc-4.2 -c -pipe -Os -arch x86_64 -I/opt/local/include conftest.c >&5
configure:11929: $? = 0
configure:11929: result: yes
configure:11929: checking limits.h presence
configure:11929: /usr/bin/gcc-4.2 -E -I/opt/local/include conftest.c
configure:11929: $? = 0
configure:11929: result: yes
configure:11929: checking for limits.h
configure:11929: result: yes
configure:11929: checking for stdint.h
configure:11929: result: yes
configure:11929: checking for string.h
configure:11929: result: yes
configure:11929: checking sys/soundcard.h usability
configure:11929: /usr/bin/gcc-4.2 -c -pipe -Os -arch x86_64 -I/opt/local/include conftest.c >&5
conftest.c:70:27: error: sys/soundcard.h: No such file or directory
configure:11929: $? = 1
configure: failed program was:
| /* confdefs.h */
| #define PACKAGE_NAME "lame"
| #define PACKAGE_TARNAME "lame"
| #define PACKAGE_VERSION "3.99.5"
| #define PACKAGE_STRING "lame 3.99.5"
| #define PACKAGE_BUGREPORT "lame-dev@lists.sf.net"
| #define PACKAGE_URL ""
| #define PACKAGE "lame"
| #define VERSION "3.99.5"
| #define STDC_HEADERS 1
| #define HAVE_SYS_TYPES_H 1
| #define HAVE_SYS_STAT_H 1
| #define HAVE_STDLIB_H 1
| #define HAVE_STRING_H 1
| #define HAVE_MEMORY_H 1
| #define HAVE_STRINGS_H 1
| #define HAVE_INTTYPES_H 1
| #define HAVE_STDINT_H 1
| #define HAVE_UNISTD_H 1
| #define __EXTENSIONS__ 1
| #define _ALL_SOURCE 1
| #define _GNU_SOURCE 1
| #define _POSIX_PTHREAD_SEMANTICS 1
| #define _TANDEM_SOURCE 1
| #define HAVE_DLFCN_H 1
| #define LT_OBJDIR ".libs/"
| #define PROTOTYPES 1
| #define __PROTOTYPES 1
| #define HAVE_STRING_H 1
| #define STDC_HEADERS 1
| #define HAVE_ERRNO_H 1
| #define HAVE_FCNTL_H 1
| #define HAVE_LIMITS_H 1
| #define HAVE_STDINT_H 1
| #define HAVE_STRING_H 1
| /* end confdefs.h.  */
| #include <stdio.h>
| #ifdef HAVE_SYS_TYPES_H
| # include <sys/types.h>
| #endif
| #ifdef HAVE_SYS_STAT_H
| # include <sys/stat.h>
| #endif
| #ifdef STDC_HEADERS
| # include <stdlib.h>
| # include <stddef.h>
| #else
| # ifdef HAVE_STDLIB_H
| #  include <stdlib.h>
| # endif
| #endif
| #ifdef HAVE_STRING_H
| # if !defined STDC_HEADERS && defined HAVE_MEMORY_H
| #  include <memory.h>
| # endif
| # include <string.h>
| #endif
| #ifdef HAVE_STRINGS_H
| # include <strings.h>
| #endif
| #ifdef HAVE_INTTYPES_H
| # include <inttypes.h>
| #endif
| #ifdef HAVE_STDINT_H
| # include <stdint.h>
| #endif
| #ifdef HAVE_UNISTD_H
| # include <unistd.h>
| #endif
| #include <sys/soundcard.h>
configure:11929: result: no
configure:11929: checking sys/soundcard.h presence
configure:11929: /usr/bin/gcc-4.2 -E -I/opt/local/include conftest.c
conftest.c:37:27: error: sys/soundcard.h: No such file or directory
configure:11929: $? = 1
configure: failed program was:
| /* confdefs.h */
| #define PACKAGE_NAME "lame"
| #define PACKAGE_TARNAME "lame"
| #define PACKAGE_VERSION "3.99.5"
| #define PACKAGE_STRING "lame 3.99.5"
| #define PACKAGE_BUGREPORT "lame-dev@lists.sf.net"
| #define PACKAGE_URL ""
| #define PACKAGE "lame"
| #define VERSION "3.99.5"
| #define STDC_HEADERS 1
| #define HAVE_SYS_TYPES_H 1
| #define HAVE_SYS_STAT_H 1
| #define HAVE_STDLIB_H 1
| #define HAVE_STRING_H 1
| #define HAVE_MEMORY_H 1
| #define HAVE_STRINGS_H 1
| #define HAVE_INTTYPES_H 1
| #define HAVE_STDINT_H 1
| #define HAVE_UNISTD_H 1
| #define __EXTENSIONS__ 1
| #define _ALL_SOURCE 1
| #define _GNU_SOURCE 1
| #define _POSIX_PTHREAD_SEMANTICS 1
| #define _TANDEM_SOURCE 1
| #define HAVE_DLFCN_H 1
| #define LT_OBJDIR ".libs/"
| #define PROTOTYPES 1
| #define __PROTOTYPES 1
| #define HAVE_STRING_H 1
| #define STDC_HEADERS 1
| #define HAVE_ERRNO_H 1
| #define HAVE_FCNTL_H 1
| #define HAVE_LIMITS_H 1
| #define HAVE_STDINT_H 1
| #define HAVE_STRING_H 1
| /* end confdefs.h.  */
| #include <sys/soundcard.h>
configure:11929: result: no
configure:11929: checking for sys/soundcard.h
configure:11929: result: no
configure:11929: checking sys/time.h usability
configure:11929: /usr/bin/gcc-4.2 -c -pipe -Os -arch x86_64 -I/opt/local/include conftest.c >&5
configure:11929: $? = 0
configure:11929: result: yes
configure:11929: checking sys/time.h presence
configure:11929: /usr/bin/gcc-4.2 -E -I/opt/local/include conftest.c
configure:11929: $? = 0
configure:11929: result: yes
configure:11929: checking for sys/time.h
configure:11929: result: yes
configure:11929: checking for unistd.h
configure:11929: result: yes
configure:11929: checking xmmintrin.h usability
configure:11929: /usr/bin/gcc-4.2 -c -pipe -Os -arch x86_64 -I/opt/local/include conftest.c >&5
configure:11929: $? = 0
configure:11929: result: yes
configure:11929: checking xmmintrin.h presence
configure:11929: /usr/bin/gcc-4.2 -E -I/opt/local/include conftest.c
configure:11929: $? = 0
configure:11929: result: yes
configure:11929: checking for xmmintrin.h
configure:11929: result: yes
configure:11929: checking linux/soundcard.h usability
configure:11929: /usr/bin/gcc-4.2 -c -pipe -Os -arch x86_64 -I/opt/local/include conftest.c >&5
conftest.c:73:29: error: linux/soundcard.h: No such file or directory
configure:11929: $? = 1
configure: failed program was:
| /* confdefs.h */
| #define PACKAGE_NAME "lame"
| #define PACKAGE_TARNAME "lame"
| #define PACKAGE_VERSION "3.99.5"
| #define PACKAGE_STRING "lame 3.99.5"
| #define PACKAGE_BUGREPORT "lame-dev@lists.sf.net"
| #define PACKAGE_URL ""
| #define PACKAGE "lame"
| #define VERSION "3.99.5"
| #define STDC_HEADERS 1
| #define HAVE_SYS_TYPES_H 1
| #define HAVE_SYS_STAT_H 1
| #define HAVE_STDLIB_H 1
| #define HAVE_STRING_H 1
| #define HAVE_MEMORY_H 1
| #define HAVE_STRINGS_H 1
| #define HAVE_INTTYPES_H 1
| #define HAVE_STDINT_H 1
| #define HAVE_UNISTD_H 1
| #define __EXTENSIONS__ 1
| #define _ALL_SOURCE 1
| #define _GNU_SOURCE 1
| #define _POSIX_PTHREAD_SEMANTICS 1
| #define _TANDEM_SOURCE 1
| #define HAVE_DLFCN_H 1
| #define LT_OBJDIR ".libs/"
| #define PROTOTYPES 1
| #define __PROTOTYPES 1
| #define HAVE_STRING_H 1
| #define STDC_HEADERS 1
| #define HAVE_ERRNO_H 1
| #define HAVE_FCNTL_H 1
| #define HAVE_LIMITS_H 1
| #define HAVE_STDINT_H 1
| #define HAVE_STRING_H 1
| #define HAVE_SYS_TIME_H 1
| #define HAVE_UNISTD_H 1
| #define HAVE_XMMINTRIN_H 1
| /* end confdefs.h.  */
| #include <stdio.h>
| #ifdef HAVE_SYS_TYPES_H
| # include <sys/types.h>
| #endif
| #ifdef HAVE_SYS_STAT_H
| # include <sys/stat.h>
| #endif
| #ifdef STDC_HEADERS
| # include <stdlib.h>
| # include <stddef.h>
| #else
| # ifdef HAVE_STDLIB_H
| #  include <stdlib.h>
| # endif
| #endif
| #ifdef HAVE_STRING_H
| # if !defined STDC_HEADERS && defined HAVE_MEMORY_H
| #  include <memory.h>
| # endif
| # include <string.h>
| #endif
| #ifdef HAVE_STRINGS_H
| # include <strings.h>
| #endif
| #ifdef HAVE_INTTYPES_H
| # include <inttypes.h>
| #endif
| #ifdef HAVE_STDINT_H
| # include <stdint.h>
| #endif
| #ifdef HAVE_UNISTD_H
| # include <unistd.h>
| #endif
| #include <linux/soundcard.h>
configure:11929: result: no
configure:11929: checking linux/soundcard.h presence
configure:11929: /usr/bin/gcc-4.2 -E -I/opt/local/include conftest.c
conftest.c:40:29: error: linux/soundcard.h: No such file or directory
configure:11929: $? = 1
configure: failed program was:
| /* confdefs.h */
| #define PACKAGE_NAME "lame"
| #define PACKAGE_TARNAME "lame"
| #define PACKAGE_VERSION "3.99.5"
| #define PACKAGE_STRING "lame 3.99.5"
| #define PACKAGE_BUGREPORT "lame-dev@lists.sf.net"
| #define PACKAGE_URL ""
| #define PACKAGE "lame"
| #define VERSION "3.99.5"
| #define STDC_HEADERS 1
| #define HAVE_SYS_TYPES_H 1
| #define HAVE_SYS_STAT_H 1
| #define HAVE_STDLIB_H 1
| #define HAVE_STRING_H 1
| #define HAVE_MEMORY_H 1
| #define HAVE_STRINGS_H 1
| #define HAVE_INTTYPES_H 1
| #define HAVE_STDINT_H 1
| #define HAVE_UNISTD_H 1
| #define __EXTENSIONS__ 1
| #define _ALL_SOURCE 1
| #define _GNU_SOURCE 1
| #define _POSIX_PTHREAD_SEMANTICS 1
| #define _TANDEM_SOURCE 1
| #define HAVE_DLFCN_H 1
| #define LT_OBJDIR ".libs/"
| #define PROTOTYPES 1
| #define __PROTOTYPES 1
| #define HAVE_STRING_H 1
| #define STDC_HEADERS 1
| #define HAVE_ERRNO_H 1
| #define HAVE_FCNTL_H 1
| #define HAVE_LIMITS_H 1
| #define HAVE_STDINT_H 1
| #define HAVE_STRING_H 1
| #define HAVE_SYS_TIME_H 1
| #define HAVE_UNISTD_H 1
| #define HAVE_XMMINTRIN_H 1
| /* end confdefs.h.  */
| #include <linux/soundcard.h>
configure:11929: result: no
configure:11929: checking for linux/soundcard.h
configure:11929: result: no
configure:11940: checking for an ANSI C-conforming const
configure:12005: /usr/bin/gcc-4.2 -c -pipe -Os -arch x86_64 -I/opt/local/include conftest.c >&5
configure:12005: $? = 0
configure:12012: result: yes
configure:12020: checking for inline
configure:12036: /usr/bin/gcc-4.2 -c -pipe -Os -arch x86_64 -I/opt/local/include conftest.c >&5
configure:12036: $? = 0
configure:12044: result: inline
configure:12063: checking whether byte ordering is bigendian
configure:12078: /usr/bin/gcc-4.2 -c -pipe -Os -arch x86_64 -I/opt/local/include conftest.c >&5
configure:12078: $? = 0
configure:12123: /usr/bin/gcc-4.2 -c -pipe -Os -arch x86_64 -I/opt/local/include conftest.c >&5
configure:12123: $? = 0
configure:12141: /usr/bin/gcc-4.2 -c -pipe -Os -arch x86_64 -I/opt/local/include conftest.c >&5
conftest.c: In function 'main':
conftest.c:47: error: 'not' undeclared (first use in this function)
conftest.c:47: error: (Each undeclared identifier is reported only once
conftest.c:47: error: for each function it appears in.)
conftest.c:47: error: expected ';' before 'big'
configure:12141: $? = 1
configure: failed program was:
| /* confdefs.h */
| #define PACKAGE_NAME "lame"
| #define PACKAGE_TARNAME "lame"
| #define PACKAGE_VERSION "3.99.5"
| #define PACKAGE_STRING "lame 3.99.5"
| #define PACKAGE_BUGREPORT "lame-dev@lists.sf.net"
| #define PACKAGE_URL ""
| #define PACKAGE "lame"
| #define VERSION "3.99.5"
| #define STDC_HEADERS 1
| #define HAVE_SYS_TYPES_H 1
| #define HAVE_SYS_STAT_H 1
| #define HAVE_STDLIB_H 1
| #define HAVE_STRING_H 1
| #define HAVE_MEMORY_H 1
| #define HAVE_STRINGS_H 1
| #define HAVE_INTTYPES_H 1
| #define HAVE_STDINT_H 1
| #define HAVE_UNISTD_H 1
| #define __EXTENSIONS__ 1
| #define _ALL_SOURCE 1
| #define _GNU_SOURCE 1
| #define _POSIX_PTHREAD_SEMANTICS 1
| #define _TANDEM_SOURCE 1
| #define HAVE_DLFCN_H 1
| #define LT_OBJDIR ".libs/"
| #define PROTOTYPES 1
| #define __PROTOTYPES 1
| #define HAVE_STRING_H 1
| #define STDC_HEADERS 1
| #define HAVE_ERRNO_H 1
| #define HAVE_FCNTL_H 1
| #define HAVE_LIMITS_H 1
| #define HAVE_STDINT_H 1
| #define HAVE_STRING_H 1
| #define HAVE_SYS_TIME_H 1
| #define HAVE_UNISTD_H 1
| #define HAVE_XMMINTRIN_H 1
| /* end confdefs.h.  */
| #include <sys/types.h>
| 		#include <sys/param.h>
| 
| int
| main ()
| {
| #if BYTE_ORDER != BIG_ENDIAN
| 		 not big endian
| 		#endif
| 
|   ;
|   return 0;
| }
configure:12269: result: no
configure:12296: checking for special C compiler options needed for large files
configure:12341: result: no
configure:12347: checking for _FILE_OFFSET_BITS value needed for large files
configure:12372: /usr/bin/gcc-4.2 -c -pipe -Os -arch x86_64 -I/opt/local/include conftest.c >&5
configure:12372: $? = 0
configure:12404: result: no
configure:12492: checking size of short
configure:12497: /usr/bin/gcc-4.2 -o conftest -pipe -Os -arch x86_64 -I/opt/local/include -L/opt/local/lib -Wl,-headerpad_max_install_names -arch x86_64 conftest.c  >&5
configure:12497: $? = 0
configure:12497: ./conftest
configure:12497: $? = 0
configure:12511: result: 2
configure:12525: checking size of unsigned short
configure:12530: /usr/bin/gcc-4.2 -o conftest -pipe -Os -arch x86_64 -I/opt/local/include -L/opt/local/lib -Wl,-headerpad_max_install_names -arch x86_64 conftest.c  >&5
configure:12530: $? = 0
configure:12530: ./conftest
configure:12530: $? = 0
configure:12544: result: 2
configure:12558: checking size of int
configure:12563: /usr/bin/gcc-4.2 -o conftest -pipe -Os -arch x86_64 -I/opt/local/include -L/opt/local/lib -Wl,-headerpad_max_install_names -arch x86_64 conftest.c  >&5
configure:12563: $? = 0
configure:12563: ./conftest
configure:12563: $? = 0
configure:12577: result: 4
configure:12591: checking size of unsigned int
configure:12596: /usr/bin/gcc-4.2 -o conftest -pipe -Os -arch x86_64 -I/opt/local/include -L/opt/local/lib -Wl,-headerpad_max_install_names -arch x86_64 conftest.c  >&5
configure:12596: $? = 0
configure:12596: ./conftest
configure:12596: $? = 0
configure:12610: result: 4
configure:12624: checking size of long
configure:12629: /usr/bin/gcc-4.2 -o conftest -pipe -Os -arch x86_64 -I/opt/local/include -L/opt/local/lib -Wl,-headerpad_max_install_names -arch x86_64 conftest.c  >&5
configure:12629: $? = 0
configure:12629: ./conftest
configure:12629: $? = 0
configure:12643: result: 8
configure:12657: checking size of unsigned long
configure:12662: /usr/bin/gcc-4.2 -o conftest -pipe -Os -arch x86_64 -I/opt/local/include -L/opt/local/lib -Wl,-headerpad_max_install_names -arch x86_64 conftest.c  >&5
configure:12662: $? = 0
configure:12662: ./conftest
configure:12662: $? = 0
configure:12676: result: 8
configure:12690: checking size of long long
configure:12695: /usr/bin/gcc-4.2 -o conftest -pipe -Os -arch x86_64 -I/opt/local/include -L/opt/local/lib -Wl,-headerpad_max_install_names -arch x86_64 conftest.c  >&5
configure:12695: $? = 0
configure:12695: ./conftest
configure:12695: $? = 0
configure:12709: result: 8
configure:12723: checking size of unsigned long long
configure:12728: /usr/bin/gcc-4.2 -o conftest -pipe -Os -arch x86_64 -I/opt/local/include -L/opt/local/lib -Wl,-headerpad_max_install_names -arch x86_64 conftest.c  >&5
configure:12728: $? = 0
configure:12728: ./conftest
configure:12728: $? = 0
configure:12742: result: 8
configure:12756: checking size of float
configure:12761: /usr/bin/gcc-4.2 -o conftest -pipe -Os -arch x86_64 -I/opt/local/include -L/opt/local/lib -Wl,-headerpad_max_install_names -arch x86_64 conftest.c  >&5
configure:12761: $? = 0
configure:12761: ./conftest
configure:12761: $? = 0
configure:12775: result: 4
configure:12789: checking size of double
configure:12794: /usr/bin/gcc-4.2 -o conftest -pipe -Os -arch x86_64 -I/opt/local/include -L/opt/local/lib -Wl,-headerpad_max_install_names -arch x86_64 conftest.c  >&5
configure:12794: $? = 0
configure:12794: ./conftest
configure:12794: $? = 0
configure:12808: result: 8
configure:12838: checking for long double with more range or precision than double
configure:12873: /usr/bin/gcc-4.2 -c -pipe -Os -arch x86_64 -I/opt/local/include conftest.c >&5
configure:12873: $? = 0
configure:12880: result: yes
configure:12931: checking for uint8_t
configure:12931: /usr/bin/gcc-4.2 -c -pipe -Os -arch x86_64 -I/opt/local/include conftest.c >&5
configure:12931: $? = 0
configure:12931: /usr/bin/gcc-4.2 -c -pipe -Os -arch x86_64 -I/opt/local/include conftest.c >&5
conftest.c: In function 'main':
conftest.c:88: error: expected expression before ')' token
configure:12931: $? = 1
configure: failed program was:
| /* confdefs.h */
| #define PACKAGE_NAME "lame"
| #define PACKAGE_TARNAME "lame"
| #define PACKAGE_VERSION "3.99.5"
| #define PACKAGE_STRING "lame 3.99.5"
| #define PACKAGE_BUGREPORT "lame-dev@lists.sf.net"
| #define PACKAGE_URL ""
| #define PACKAGE "lame"
| #define VERSION "3.99.5"
| #define STDC_HEADERS 1
| #define HAVE_SYS_TYPES_H 1
| #define HAVE_SYS_STAT_H 1
| #define HAVE_STDLIB_H 1
| #define HAVE_STRING_H 1
| #define HAVE_MEMORY_H 1
| #define HAVE_STRINGS_H 1
| #define HAVE_INTTYPES_H 1
| #define HAVE_STDINT_H 1
| #define HAVE_UNISTD_H 1
| #define __EXTENSIONS__ 1
| #define _ALL_SOURCE 1
| #define _GNU_SOURCE 1
| #define _POSIX_PTHREAD_SEMANTICS 1
| #define _TANDEM_SOURCE 1
| #define HAVE_DLFCN_H 1
| #define LT_OBJDIR ".libs/"
| #define PROTOTYPES 1
| #define __PROTOTYPES 1
| #define HAVE_STRING_H 1
| #define STDC_HEADERS 1
| #define HAVE_ERRNO_H 1
| #define HAVE_FCNTL_H 1
| #define HAVE_LIMITS_H 1
| #define HAVE_STDINT_H 1
| #define HAVE_STRING_H 1
| #define HAVE_SYS_TIME_H 1
| #define HAVE_UNISTD_H 1
| #define HAVE_XMMINTRIN_H 1
| #define SIZEOF_SHORT 2
| #define SIZEOF_UNSIGNED_SHORT 2
| #define SIZEOF_INT 4
| #define SIZEOF_UNSIGNED_INT 4
| #define SIZEOF_LONG 8
| #define SIZEOF_UNSIGNED_LONG 8
| #define SIZEOF_LONG_LONG 8
| #define SIZEOF_UNSIGNED_LONG_LONG 8
| #define SIZEOF_FLOAT 4
| #define SIZEOF_DOUBLE 8
| #define HAVE_LONG_DOUBLE_WIDER 1
| #define HAVE_LONG_DOUBLE 1
| /* end confdefs.h.  */
| #include <stdio.h>
| #ifdef HAVE_SYS_TYPES_H
| # include <sys/types.h>
| #endif
| #ifdef HAVE_SYS_STAT_H
| # include <sys/stat.h>
| #endif
| #ifdef STDC_HEADERS
| # include <stdlib.h>
| # include <stddef.h>
| #else
| # ifdef HAVE_STDLIB_H
| #  include <stdlib.h>
| # endif
| #endif
| #ifdef HAVE_STRING_H
| # if !defined STDC_HEADERS && defined HAVE_MEMORY_H
| #  include <memory.h>
| # endif
| # include <string.h>
| #endif
| #ifdef HAVE_STRINGS_H
| # include <strings.h>
| #endif
| #ifdef HAVE_INTTYPES_H
| # include <inttypes.h>
| #endif
| #ifdef HAVE_STDINT_H
| # include <stdint.h>
| #endif
| #ifdef HAVE_UNISTD_H
| # include <unistd.h>
| #endif
| int
| main ()
| {
| if (sizeof ((uint8_t)))
| 	    return 0;
|   ;
|   return 0;
| }
configure:12931: result: yes
configure:12940: checking for int8_t
configure:12940: /usr/bin/gcc-4.2 -c -pipe -Os -arch x86_64 -I/opt/local/include conftest.c >&5
configure:12940: $? = 0
configure:12940: /usr/bin/gcc-4.2 -c -pipe -Os -arch x86_64 -I/opt/local/include conftest.c >&5
conftest.c: In function 'main':
conftest.c:89: error: expected expression before ')' token
configure:12940: $? = 1
configure: failed program was:
| /* confdefs.h */
| #define PACKAGE_NAME "lame"
| #define PACKAGE_TARNAME "lame"
| #define PACKAGE_VERSION "3.99.5"
| #define PACKAGE_STRING "lame 3.99.5"
| #define PACKAGE_BUGREPORT "lame-dev@lists.sf.net"
| #define PACKAGE_URL ""
| #define PACKAGE "lame"
| #define VERSION "3.99.5"
| #define STDC_HEADERS 1
| #define HAVE_SYS_TYPES_H 1
| #define HAVE_SYS_STAT_H 1
| #define HAVE_STDLIB_H 1
| #define HAVE_STRING_H 1
| #define HAVE_MEMORY_H 1
| #define HAVE_STRINGS_H 1
| #define HAVE_INTTYPES_H 1
| #define HAVE_STDINT_H 1
| #define HAVE_UNISTD_H 1
| #define __EXTENSIONS__ 1
| #define _ALL_SOURCE 1
| #define _GNU_SOURCE 1
| #define _POSIX_PTHREAD_SEMANTICS 1
| #define _TANDEM_SOURCE 1
| #define HAVE_DLFCN_H 1
| #define LT_OBJDIR ".libs/"
| #define PROTOTYPES 1
| #define __PROTOTYPES 1
| #define HAVE_STRING_H 1
| #define STDC_HEADERS 1
| #define HAVE_ERRNO_H 1
| #define HAVE_FCNTL_H 1
| #define HAVE_LIMITS_H 1
| #define HAVE_STDINT_H 1
| #define HAVE_STRING_H 1
| #define HAVE_SYS_TIME_H 1
| #define HAVE_UNISTD_H 1
| #define HAVE_XMMINTRIN_H 1
| #define SIZEOF_SHORT 2
| #define SIZEOF_UNSIGNED_SHORT 2
| #define SIZEOF_INT 4
| #define SIZEOF_UNSIGNED_INT 4
| #define SIZEOF_LONG 8
| #define SIZEOF_UNSIGNED_LONG 8
| #define SIZEOF_LONG_LONG 8
| #define SIZEOF_UNSIGNED_LONG_LONG 8
| #define SIZEOF_FLOAT 4
| #define SIZEOF_DOUBLE 8
| #define HAVE_LONG_DOUBLE_WIDER 1
| #define HAVE_LONG_DOUBLE 1
| #define HAVE_UINT8_T 1
| /* end confdefs.h.  */
| #include <stdio.h>
| #ifdef HAVE_SYS_TYPES_H
| # include <sys/types.h>
| #endif
| #ifdef HAVE_SYS_STAT_H
| # include <sys/stat.h>
| #endif
| #ifdef STDC_HEADERS
| # include <stdlib.h>
| # include <stddef.h>
| #else
| # ifdef HAVE_STDLIB_H
| #  include <stdlib.h>
| # endif
| #endif
| #ifdef HAVE_STRING_H
| # if !defined STDC_HEADERS && defined HAVE_MEMORY_H
| #  include <memory.h>
| # endif
| # include <string.h>
| #endif
| #ifdef HAVE_STRINGS_H
| # include <strings.h>
| #endif
| #ifdef HAVE_INTTYPES_H
| # include <inttypes.h>
| #endif
| #ifdef HAVE_STDINT_H
| # include <stdint.h>
| #endif
| #ifdef HAVE_UNISTD_H
| # include <unistd.h>
| #endif
| int
| main ()
| {
| if (sizeof ((int8_t)))
| 	    return 0;
|   ;
|   return 0;
| }
configure:12940: result: yes
configure:12949: checking for uint16_t
configure:12949: /usr/bin/gcc-4.2 -c -pipe -Os -arch x86_64 -I/opt/local/include conftest.c >&5
configure:12949: $? = 0
configure:12949: /usr/bin/gcc-4.2 -c -pipe -Os -arch x86_64 -I/opt/local/include conftest.c >&5
conftest.c: In function 'main':
conftest.c:90: error: expected expression before ')' token
configure:12949: $? = 1
configure: failed program was:
| /* confdefs.h */
| #define PACKAGE_NAME "lame"
| #define PACKAGE_TARNAME "lame"
| #define PACKAGE_VERSION "3.99.5"
| #define PACKAGE_STRING "lame 3.99.5"
| #define PACKAGE_BUGREPORT "lame-dev@lists.sf.net"
| #define PACKAGE_URL ""
| #define PACKAGE "lame"
| #define VERSION "3.99.5"
| #define STDC_HEADERS 1
| #define HAVE_SYS_TYPES_H 1
| #define HAVE_SYS_STAT_H 1
| #define HAVE_STDLIB_H 1
| #define HAVE_STRING_H 1
| #define HAVE_MEMORY_H 1
| #define HAVE_STRINGS_H 1
| #define HAVE_INTTYPES_H 1
| #define HAVE_STDINT_H 1
| #define HAVE_UNISTD_H 1
| #define __EXTENSIONS__ 1
| #define _ALL_SOURCE 1
| #define _GNU_SOURCE 1
| #define _POSIX_PTHREAD_SEMANTICS 1
| #define _TANDEM_SOURCE 1
| #define HAVE_DLFCN_H 1
| #define LT_OBJDIR ".libs/"
| #define PROTOTYPES 1
| #define __PROTOTYPES 1
| #define HAVE_STRING_H 1
| #define STDC_HEADERS 1
| #define HAVE_ERRNO_H 1
| #define HAVE_FCNTL_H 1
| #define HAVE_LIMITS_H 1
| #define HAVE_STDINT_H 1
| #define HAVE_STRING_H 1
| #define HAVE_SYS_TIME_H 1
| #define HAVE_UNISTD_H 1
| #define HAVE_XMMINTRIN_H 1
| #define SIZEOF_SHORT 2
| #define SIZEOF_UNSIGNED_SHORT 2
| #define SIZEOF_INT 4
| #define SIZEOF_UNSIGNED_INT 4
| #define SIZEOF_LONG 8
| #define SIZEOF_UNSIGNED_LONG 8
| #define SIZEOF_LONG_LONG 8
| #define SIZEOF_UNSIGNED_LONG_LONG 8
| #define SIZEOF_FLOAT 4
| #define SIZEOF_DOUBLE 8
| #define HAVE_LONG_DOUBLE_WIDER 1
| #define HAVE_LONG_DOUBLE 1
| #define HAVE_UINT8_T 1
| #define HAVE_INT8_T 1
| /* end confdefs.h.  */
| #include <stdio.h>
| #ifdef HAVE_SYS_TYPES_H
| # include <sys/types.h>
| #endif
| #ifdef HAVE_SYS_STAT_H
| # include <sys/stat.h>
| #endif
| #ifdef STDC_HEADERS
| # include <stdlib.h>
| # include <stddef.h>
| #else
| # ifdef HAVE_STDLIB_H
| #  include <stdlib.h>
| # endif
| #endif
| #ifdef HAVE_STRING_H
| # if !defined STDC_HEADERS && defined HAVE_MEMORY_H
| #  include <memory.h>
| # endif
| # include <string.h>
| #endif
| #ifdef HAVE_STRINGS_H
| # include <strings.h>
| #endif
| #ifdef HAVE_INTTYPES_H
| # include <inttypes.h>
| #endif
| #ifdef HAVE_STDINT_H
| # include <stdint.h>
| #endif
| #ifdef HAVE_UNISTD_H
| # include <unistd.h>
| #endif
| int
| main ()
| {
| if (sizeof ((uint16_t)))
| 	    return 0;
|   ;
|   return 0;
| }
configure:12949: result: yes
configure:12958: checking for int16_t
configure:12958: /usr/bin/gcc-4.2 -c -pipe -Os -arch x86_64 -I/opt/local/include conftest.c >&5
configure:12958: $? = 0
configure:12958: /usr/bin/gcc-4.2 -c -pipe -Os -arch x86_64 -I/opt/local/include conftest.c >&5
conftest.c: In function 'main':
conftest.c:91: error: expected expression before ')' token
configure:12958: $? = 1
configure: failed program was:
| /* confdefs.h */
| #define PACKAGE_NAME "lame"
| #define PACKAGE_TARNAME "lame"
| #define PACKAGE_VERSION "3.99.5"
| #define PACKAGE_STRING "lame 3.99.5"
| #define PACKAGE_BUGREPORT "lame-dev@lists.sf.net"
| #define PACKAGE_URL ""
| #define PACKAGE "lame"
| #define VERSION "3.99.5"
| #define STDC_HEADERS 1
| #define HAVE_SYS_TYPES_H 1
| #define HAVE_SYS_STAT_H 1
| #define HAVE_STDLIB_H 1
| #define HAVE_STRING_H 1
| #define HAVE_MEMORY_H 1
| #define HAVE_STRINGS_H 1
| #define HAVE_INTTYPES_H 1
| #define HAVE_STDINT_H 1
| #define HAVE_UNISTD_H 1
| #define __EXTENSIONS__ 1
| #define _ALL_SOURCE 1
| #define _GNU_SOURCE 1
| #define _POSIX_PTHREAD_SEMANTICS 1
| #define _TANDEM_SOURCE 1
| #define HAVE_DLFCN_H 1
| #define LT_OBJDIR ".libs/"
| #define PROTOTYPES 1
| #define __PROTOTYPES 1
| #define HAVE_STRING_H 1
| #define STDC_HEADERS 1
| #define HAVE_ERRNO_H 1
| #define HAVE_FCNTL_H 1
| #define HAVE_LIMITS_H 1
| #define HAVE_STDINT_H 1
| #define HAVE_STRING_H 1
| #define HAVE_SYS_TIME_H 1
| #define HAVE_UNISTD_H 1
| #define HAVE_XMMINTRIN_H 1
| #define SIZEOF_SHORT 2
| #define SIZEOF_UNSIGNED_SHORT 2
| #define SIZEOF_INT 4
| #define SIZEOF_UNSIGNED_INT 4
| #define SIZEOF_LONG 8
| #define SIZEOF_UNSIGNED_LONG 8
| #define SIZEOF_LONG_LONG 8
| #define SIZEOF_UNSIGNED_LONG_LONG 8
| #define SIZEOF_FLOAT 4
| #define SIZEOF_DOUBLE 8
| #define HAVE_LONG_DOUBLE_WIDER 1
| #define HAVE_LONG_DOUBLE 1
| #define HAVE_UINT8_T 1
| #define HAVE_INT8_T 1
| #define HAVE_UINT16_T 1
| /* end confdefs.h.  */
| #include <stdio.h>
| #ifdef HAVE_SYS_TYPES_H
| # include <sys/types.h>
| #endif
| #ifdef HAVE_SYS_STAT_H
| # include <sys/stat.h>
| #endif
| #ifdef STDC_HEADERS
| # include <stdlib.h>
| # include <stddef.h>
| #else
| # ifdef HAVE_STDLIB_H
| #  include <stdlib.h>
| # endif
| #endif
| #ifdef HAVE_STRING_H
| # if !defined STDC_HEADERS && defined HAVE_MEMORY_H
| #  include <memory.h>
| # endif
| # include <string.h>
| #endif
| #ifdef HAVE_STRINGS_H
| # include <strings.h>
| #endif
| #ifdef HAVE_INTTYPES_H
| # include <inttypes.h>
| #endif
| #ifdef HAVE_STDINT_H
| # include <stdint.h>
| #endif
| #ifdef HAVE_UNISTD_H
| # include <unistd.h>
| #endif
| int
| main ()
| {
| if (sizeof ((int16_t)))
| 	    return 0;
|   ;
|   return 0;
| }
configure:12958: result: yes
configure:12967: checking for uint32_t
configure:12967: /usr/bin/gcc-4.2 -c -pipe -Os -arch x86_64 -I/opt/local/include conftest.c >&5
configure:12967: $? = 0
configure:12967: /usr/bin/gcc-4.2 -c -pipe -Os -arch x86_64 -I/opt/local/include conftest.c >&5
conftest.c: In function 'main':
conftest.c:92: error: expected expression before ')' token
configure:12967: $? = 1
configure: failed program was:
| /* confdefs.h */
| #define PACKAGE_NAME "lame"
| #define PACKAGE_TARNAME "lame"
| #define PACKAGE_VERSION "3.99.5"
| #define PACKAGE_STRING "lame 3.99.5"
| #define PACKAGE_BUGREPORT "lame-dev@lists.sf.net"
| #define PACKAGE_URL ""
| #define PACKAGE "lame"
| #define VERSION "3.99.5"
| #define STDC_HEADERS 1
| #define HAVE_SYS_TYPES_H 1
| #define HAVE_SYS_STAT_H 1
| #define HAVE_STDLIB_H 1
| #define HAVE_STRING_H 1
| #define HAVE_MEMORY_H 1
| #define HAVE_STRINGS_H 1
| #define HAVE_INTTYPES_H 1
| #define HAVE_STDINT_H 1
| #define HAVE_UNISTD_H 1
| #define __EXTENSIONS__ 1
| #define _ALL_SOURCE 1
| #define _GNU_SOURCE 1
| #define _POSIX_PTHREAD_SEMANTICS 1
| #define _TANDEM_SOURCE 1
| #define HAVE_DLFCN_H 1
| #define LT_OBJDIR ".libs/"
| #define PROTOTYPES 1
| #define __PROTOTYPES 1
| #define HAVE_STRING_H 1
| #define STDC_HEADERS 1
| #define HAVE_ERRNO_H 1
| #define HAVE_FCNTL_H 1
| #define HAVE_LIMITS_H 1
| #define HAVE_STDINT_H 1
| #define HAVE_STRING_H 1
| #define HAVE_SYS_TIME_H 1
| #define HAVE_UNISTD_H 1
| #define HAVE_XMMINTRIN_H 1
| #define SIZEOF_SHORT 2
| #define SIZEOF_UNSIGNED_SHORT 2
| #define SIZEOF_INT 4
| #define SIZEOF_UNSIGNED_INT 4
| #define SIZEOF_LONG 8
| #define SIZEOF_UNSIGNED_LONG 8
| #define SIZEOF_LONG_LONG 8
| #define SIZEOF_UNSIGNED_LONG_LONG 8
| #define SIZEOF_FLOAT 4
| #define SIZEOF_DOUBLE 8
| #define HAVE_LONG_DOUBLE_WIDER 1
| #define HAVE_LONG_DOUBLE 1
| #define HAVE_UINT8_T 1
| #define HAVE_INT8_T 1
| #define HAVE_UINT16_T 1
| #define HAVE_INT16_T 1
| /* end confdefs.h.  */
| #include <stdio.h>
| #ifdef HAVE_SYS_TYPES_H
| # include <sys/types.h>
| #endif
| #ifdef HAVE_SYS_STAT_H
| # include <sys/stat.h>
| #endif
| #ifdef STDC_HEADERS
| # include <stdlib.h>
| # include <stddef.h>
| #else
| # ifdef HAVE_STDLIB_H
| #  include <stdlib.h>
| # endif
| #endif
| #ifdef HAVE_STRING_H
| # if !defined STDC_HEADERS && defined HAVE_MEMORY_H
| #  include <memory.h>
| # endif
| # include <string.h>
| #endif
| #ifdef HAVE_STRINGS_H
| # include <strings.h>
| #endif
| #ifdef HAVE_INTTYPES_H
| # include <inttypes.h>
| #endif
| #ifdef HAVE_STDINT_H
| # include <stdint.h>
| #endif
| #ifdef HAVE_UNISTD_H
| # include <unistd.h>
| #endif
| int
| main ()
| {
| if (sizeof ((uint32_t)))
| 	    return 0;
|   ;
|   return 0;
| }
configure:12967: result: yes
configure:12976: checking for int32_t
configure:12976: /usr/bin/gcc-4.2 -c -pipe -Os -arch x86_64 -I/opt/local/include conftest.c >&5
configure:12976: $? = 0
configure:12976: /usr/bin/gcc-4.2 -c -pipe -Os -arch x86_64 -I/opt/local/include conftest.c >&5
conftest.c: In function 'main':
conftest.c:93: error: expected expression before ')' token
configure:12976: $? = 1
configure: failed program was:
| /* confdefs.h */
| #define PACKAGE_NAME "lame"
| #define PACKAGE_TARNAME "lame"
| #define PACKAGE_VERSION "3.99.5"
| #define PACKAGE_STRING "lame 3.99.5"
| #define PACKAGE_BUGREPORT "lame-dev@lists.sf.net"
| #define PACKAGE_URL ""
| #define PACKAGE "lame"
| #define VERSION "3.99.5"
| #define STDC_HEADERS 1
| #define HAVE_SYS_TYPES_H 1
| #define HAVE_SYS_STAT_H 1
| #define HAVE_STDLIB_H 1
| #define HAVE_STRING_H 1
| #define HAVE_MEMORY_H 1
| #define HAVE_STRINGS_H 1
| #define HAVE_INTTYPES_H 1
| #define HAVE_STDINT_H 1
| #define HAVE_UNISTD_H 1
| #define __EXTENSIONS__ 1
| #define _ALL_SOURCE 1
| #define _GNU_SOURCE 1
| #define _POSIX_PTHREAD_SEMANTICS 1
| #define _TANDEM_SOURCE 1
| #define HAVE_DLFCN_H 1
| #define LT_OBJDIR ".libs/"
| #define PROTOTYPES 1
| #define __PROTOTYPES 1
| #define HAVE_STRING_H 1
| #define STDC_HEADERS 1
| #define HAVE_ERRNO_H 1
| #define HAVE_FCNTL_H 1
| #define HAVE_LIMITS_H 1
| #define HAVE_STDINT_H 1
| #define HAVE_STRING_H 1
| #define HAVE_SYS_TIME_H 1
| #define HAVE_UNISTD_H 1
| #define HAVE_XMMINTRIN_H 1
| #define SIZEOF_SHORT 2
| #define SIZEOF_UNSIGNED_SHORT 2
| #define SIZEOF_INT 4
| #define SIZEOF_UNSIGNED_INT 4
| #define SIZEOF_LONG 8
| #define SIZEOF_UNSIGNED_LONG 8
| #define SIZEOF_LONG_LONG 8
| #define SIZEOF_UNSIGNED_LONG_LONG 8
| #define SIZEOF_FLOAT 4
| #define SIZEOF_DOUBLE 8
| #define HAVE_LONG_DOUBLE_WIDER 1
| #define HAVE_LONG_DOUBLE 1
| #define HAVE_UINT8_T 1
| #define HAVE_INT8_T 1
| #define HAVE_UINT16_T 1
| #define HAVE_INT16_T 1
| #define HAVE_UINT32_T 1
| /* end confdefs.h.  */
| #include <stdio.h>
| #ifdef HAVE_SYS_TYPES_H
| # include <sys/types.h>
| #endif
| #ifdef HAVE_SYS_STAT_H
| # include <sys/stat.h>
| #endif
| #ifdef STDC_HEADERS
| # include <stdlib.h>
| # include <stddef.h>
| #else
| # ifdef HAVE_STDLIB_H
| #  include <stdlib.h>
| # endif
| #endif
| #ifdef HAVE_STRING_H
| # if !defined STDC_HEADERS && defined HAVE_MEMORY_H
| #  include <memory.h>
| # endif
| # include <string.h>
| #endif
| #ifdef HAVE_STRINGS_H
| # include <strings.h>
| #endif
| #ifdef HAVE_INTTYPES_H
| # include <inttypes.h>
| #endif
| #ifdef HAVE_STDINT_H
| # include <stdint.h>
| #endif
| #ifdef HAVE_UNISTD_H
| # include <unistd.h>
| #endif
| int
| main ()
| {
| if (sizeof ((int32_t)))
| 	    return 0;
|   ;
|   return 0;
| }
configure:12976: result: yes
configure:12985: checking for uint64_t
configure:12985: /usr/bin/gcc-4.2 -c -pipe -Os -arch x86_64 -I/opt/local/include conftest.c >&5
configure:12985: $? = 0
configure:12985: /usr/bin/gcc-4.2 -c -pipe -Os -arch x86_64 -I/opt/local/include conftest.c >&5
conftest.c: In function 'main':
conftest.c:94: error: expected expression before ')' token
configure:12985: $? = 1
configure: failed program was:
| /* confdefs.h */
| #define PACKAGE_NAME "lame"
| #define PACKAGE_TARNAME "lame"
| #define PACKAGE_VERSION "3.99.5"
| #define PACKAGE_STRING "lame 3.99.5"
| #define PACKAGE_BUGREPORT "lame-dev@lists.sf.net"
| #define PACKAGE_URL ""
| #define PACKAGE "lame"
| #define VERSION "3.99.5"
| #define STDC_HEADERS 1
| #define HAVE_SYS_TYPES_H 1
| #define HAVE_SYS_STAT_H 1
| #define HAVE_STDLIB_H 1
| #define HAVE_STRING_H 1
| #define HAVE_MEMORY_H 1
| #define HAVE_STRINGS_H 1
| #define HAVE_INTTYPES_H 1
| #define HAVE_STDINT_H 1
| #define HAVE_UNISTD_H 1
| #define __EXTENSIONS__ 1
| #define _ALL_SOURCE 1
| #define _GNU_SOURCE 1
| #define _POSIX_PTHREAD_SEMANTICS 1
| #define _TANDEM_SOURCE 1
| #define HAVE_DLFCN_H 1
| #define LT_OBJDIR ".libs/"
| #define PROTOTYPES 1
| #define __PROTOTYPES 1
| #define HAVE_STRING_H 1
| #define STDC_HEADERS 1
| #define HAVE_ERRNO_H 1
| #define HAVE_FCNTL_H 1
| #define HAVE_LIMITS_H 1
| #define HAVE_STDINT_H 1
| #define HAVE_STRING_H 1
| #define HAVE_SYS_TIME_H 1
| #define HAVE_UNISTD_H 1
| #define HAVE_XMMINTRIN_H 1
| #define SIZEOF_SHORT 2
| #define SIZEOF_UNSIGNED_SHORT 2
| #define SIZEOF_INT 4
| #define SIZEOF_UNSIGNED_INT 4
| #define SIZEOF_LONG 8
| #define SIZEOF_UNSIGNED_LONG 8
| #define SIZEOF_LONG_LONG 8
| #define SIZEOF_UNSIGNED_LONG_LONG 8
| #define SIZEOF_FLOAT 4
| #define SIZEOF_DOUBLE 8
| #define HAVE_LONG_DOUBLE_WIDER 1
| #define HAVE_LONG_DOUBLE 1
| #define HAVE_UINT8_T 1
| #define HAVE_INT8_T 1
| #define HAVE_UINT16_T 1
| #define HAVE_INT16_T 1
| #define HAVE_UINT32_T 1
| #define HAVE_INT32_T 1
| /* end confdefs.h.  */
| #include <stdio.h>
| #ifdef HAVE_SYS_TYPES_H
| # include <sys/types.h>
| #endif
| #ifdef HAVE_SYS_STAT_H
| # include <sys/stat.h>
| #endif
| #ifdef STDC_HEADERS
| # include <stdlib.h>
| # include <stddef.h>
| #else
| # ifdef HAVE_STDLIB_H
| #  include <stdlib.h>
| # endif
| #endif
| #ifdef HAVE_STRING_H
| # if !defined STDC_HEADERS && defined HAVE_MEMORY_H
| #  include <memory.h>
| # endif
| # include <string.h>
| #endif
| #ifdef HAVE_STRINGS_H
| # include <strings.h>
| #endif
| #ifdef HAVE_INTTYPES_H
| # include <inttypes.h>
| #endif
| #ifdef HAVE_STDINT_H
| # include <stdint.h>
| #endif
| #ifdef HAVE_UNISTD_H
| # include <unistd.h>
| #endif
| int
| main ()
| {
| if (sizeof ((uint64_t)))
| 	    return 0;
|   ;
|   return 0;
| }
configure:12985: result: yes
configure:12994: checking for int64_t
configure:12994: /usr/bin/gcc-4.2 -c -pipe -Os -arch x86_64 -I/opt/local/include conftest.c >&5
configure:12994: $? = 0
configure:12994: /usr/bin/gcc-4.2 -c -pipe -Os -arch x86_64 -I/opt/local/include conftest.c >&5
conftest.c: In function 'main':
conftest.c:95: error: expected expression before ')' token
configure:12994: $? = 1
configure: failed program was:
| /* confdefs.h */
| #define PACKAGE_NAME "lame"
| #define PACKAGE_TARNAME "lame"
| #define PACKAGE_VERSION "3.99.5"
| #define PACKAGE_STRING "lame 3.99.5"
| #define PACKAGE_BUGREPORT "lame-dev@lists.sf.net"
| #define PACKAGE_URL ""
| #define PACKAGE "lame"
| #define VERSION "3.99.5"
| #define STDC_HEADERS 1
| #define HAVE_SYS_TYPES_H 1
| #define HAVE_SYS_STAT_H 1
| #define HAVE_STDLIB_H 1
| #define HAVE_STRING_H 1
| #define HAVE_MEMORY_H 1
| #define HAVE_STRINGS_H 1
| #define HAVE_INTTYPES_H 1
| #define HAVE_STDINT_H 1
| #define HAVE_UNISTD_H 1
| #define __EXTENSIONS__ 1
| #define _ALL_SOURCE 1
| #define _GNU_SOURCE 1
| #define _POSIX_PTHREAD_SEMANTICS 1
| #define _TANDEM_SOURCE 1
| #define HAVE_DLFCN_H 1
| #define LT_OBJDIR ".libs/"
| #define PROTOTYPES 1
| #define __PROTOTYPES 1
| #define HAVE_STRING_H 1
| #define STDC_HEADERS 1
| #define HAVE_ERRNO_H 1
| #define HAVE_FCNTL_H 1
| #define HAVE_LIMITS_H 1
| #define HAVE_STDINT_H 1
| #define HAVE_STRING_H 1
| #define HAVE_SYS_TIME_H 1
| #define HAVE_UNISTD_H 1
| #define HAVE_XMMINTRIN_H 1
| #define SIZEOF_SHORT 2
| #define SIZEOF_UNSIGNED_SHORT 2
| #define SIZEOF_INT 4
| #define SIZEOF_UNSIGNED_INT 4
| #define SIZEOF_LONG 8
| #define SIZEOF_UNSIGNED_LONG 8
| #define SIZEOF_LONG_LONG 8
| #define SIZEOF_UNSIGNED_LONG_LONG 8
| #define SIZEOF_FLOAT 4
| #define SIZEOF_DOUBLE 8
| #define HAVE_LONG_DOUBLE_WIDER 1
| #define HAVE_LONG_DOUBLE 1
| #define HAVE_UINT8_T 1
| #define HAVE_INT8_T 1
| #define HAVE_UINT16_T 1
| #define HAVE_INT16_T 1
| #define HAVE_UINT32_T 1
| #define HAVE_INT32_T 1
| #define HAVE_UINT64_T 1
| /* end confdefs.h.  */
| #include <stdio.h>
| #ifdef HAVE_SYS_TYPES_H
| # include <sys/types.h>
| #endif
| #ifdef HAVE_SYS_STAT_H
| # include <sys/stat.h>
| #endif
| #ifdef STDC_HEADERS
| # include <stdlib.h>
| # include <stddef.h>
| #else
| # ifdef HAVE_STDLIB_H
| #  include <stdlib.h>
| # endif
| #endif
| #ifdef HAVE_STRING_H
| # if !defined STDC_HEADERS && defined HAVE_MEMORY_H
| #  include <memory.h>
| # endif
| # include <string.h>
| #endif
| #ifdef HAVE_STRINGS_H
| # include <strings.h>
| #endif
| #ifdef HAVE_INTTYPES_H
| # include <inttypes.h>
| #endif
| #ifdef HAVE_STDINT_H
| # include <stdint.h>
| #endif
| #ifdef HAVE_UNISTD_H
| # include <unistd.h>
| #endif
| int
| main ()
| {
| if (sizeof ((int64_t)))
| 	    return 0;
|   ;
|   return 0;
| }
configure:12994: result: yes
configure:13099: checking for IEEE854 compliant 80 bit floats
configure:13137: /usr/bin/gcc-4.2 -o conftest -pipe -Os -arch x86_64 -I/opt/local/include -L/opt/local/lib -Wl,-headerpad_max_install_names -arch x86_64 conftest.c  >&5
configure:13137: $? = 0
configure:13137: ./conftest
configure:13137: $? = 1
configure: program exited with status 1
configure: failed program was:
| /* confdefs.h */
| #define PACKAGE_NAME "lame"
| #define PACKAGE_TARNAME "lame"
| #define PACKAGE_VERSION "3.99.5"
| #define PACKAGE_STRING "lame 3.99.5"
| #define PACKAGE_BUGREPORT "lame-dev@lists.sf.net"
| #define PACKAGE_URL ""
| #define PACKAGE "lame"
| #define VERSION "3.99.5"
| #define STDC_HEADERS 1
| #define HAVE_SYS_TYPES_H 1
| #define HAVE_SYS_STAT_H 1
| #define HAVE_STDLIB_H 1
| #define HAVE_STRING_H 1
| #define HAVE_MEMORY_H 1
| #define HAVE_STRINGS_H 1
| #define HAVE_INTTYPES_H 1
| #define HAVE_STDINT_H 1
| #define HAVE_UNISTD_H 1
| #define __EXTENSIONS__ 1
| #define _ALL_SOURCE 1
| #define _GNU_SOURCE 1
| #define _POSIX_PTHREAD_SEMANTICS 1
| #define _TANDEM_SOURCE 1
| #define HAVE_DLFCN_H 1
| #define LT_OBJDIR ".libs/"
| #define PROTOTYPES 1
| #define __PROTOTYPES 1
| #define HAVE_STRING_H 1
| #define STDC_HEADERS 1
| #define HAVE_ERRNO_H 1
| #define HAVE_FCNTL_H 1
| #define HAVE_LIMITS_H 1
| #define HAVE_STDINT_H 1
| #define HAVE_STRING_H 1
| #define HAVE_SYS_TIME_H 1
| #define HAVE_UNISTD_H 1
| #define HAVE_XMMINTRIN_H 1
| #define SIZEOF_SHORT 2
| #define SIZEOF_UNSIGNED_SHORT 2
| #define SIZEOF_INT 4
| #define SIZEOF_UNSIGNED_INT 4
| #define SIZEOF_LONG 8
| #define SIZEOF_UNSIGNED_LONG 8
| #define SIZEOF_LONG_LONG 8
| #define SIZEOF_UNSIGNED_LONG_LONG 8
| #define SIZEOF_FLOAT 4
| #define SIZEOF_DOUBLE 8
| #define HAVE_LONG_DOUBLE_WIDER 1
| #define HAVE_LONG_DOUBLE 1
| #define HAVE_UINT8_T 1
| #define HAVE_INT8_T 1
| #define HAVE_UINT16_T 1
| #define HAVE_INT16_T 1
| #define HAVE_UINT32_T 1
| #define HAVE_INT32_T 1
| #define HAVE_UINT64_T 1
| #define HAVE_INT64_T 1
| #define A_UINT32_T unsigned int
| #define A_INT32_T int
| #define A_UINT64_T unsigned long
| #define A_INT64_T long
| /* end confdefs.h.  */
| 
| int   float2long_IEEE_compliance ( void )
| {
|     struct {
|         long padding; /* to prevent unaligned access */
|         float  f;
|     } s;
|     s.f = 12582912.; if ( *(long*)(&s.f) != 1262485504l ) return 0;
|     s.f = 12615679.; if ( *(long*)(&s.f) != 1262518271l ) return 0;
|     s.f = 13582912.; if ( *(long*)(&s.f) != 1263485504l ) return 0;
|     s.f = 12550145.; if ( *(long*)(&s.f) != 1262452737l ) return 0;
|     s.f = 11582912.; if ( *(long*)(&s.f) != 1261485504l ) return 0;
|     return 1;
| }
| 
| int main(void)
| {
|     int retval;
| 
|     retval = float2long_IEEE_compliance();
| 
|     /* no error return -> success */
|     return !retval;
| }
| 
configure:13147: result: no
configure:13168: checking for ieee754_float64_t
configure:13168: /usr/bin/gcc-4.2 -c -pipe -Os -arch x86_64 -I/opt/local/include conftest.c >&5
conftest.c: In function 'main':
conftest.c:100: error: 'ieee754_float64_t' undeclared (first use in this function)
conftest.c:100: error: (Each undeclared identifier is reported only once
conftest.c:100: error: for each function it appears in.)
configure:13168: $? = 1
configure: failed program was:
| /* confdefs.h */
| #define PACKAGE_NAME "lame"
| #define PACKAGE_TARNAME "lame"
| #define PACKAGE_VERSION "3.99.5"
| #define PACKAGE_STRING "lame 3.99.5"
| #define PACKAGE_BUGREPORT "lame-dev@lists.sf.net"
| #define PACKAGE_URL ""
| #define PACKAGE "lame"
| #define VERSION "3.99.5"
| #define STDC_HEADERS 1
| #define HAVE_SYS_TYPES_H 1
| #define HAVE_SYS_STAT_H 1
| #define HAVE_STDLIB_H 1
| #define HAVE_STRING_H 1
| #define HAVE_MEMORY_H 1
| #define HAVE_STRINGS_H 1
| #define HAVE_INTTYPES_H 1
| #define HAVE_STDINT_H 1
| #define HAVE_UNISTD_H 1
| #define __EXTENSIONS__ 1
| #define _ALL_SOURCE 1
| #define _GNU_SOURCE 1
| #define _POSIX_PTHREAD_SEMANTICS 1
| #define _TANDEM_SOURCE 1
| #define HAVE_DLFCN_H 1
| #define LT_OBJDIR ".libs/"
| #define PROTOTYPES 1
| #define __PROTOTYPES 1
| #define HAVE_STRING_H 1
| #define STDC_HEADERS 1
| #define HAVE_ERRNO_H 1
| #define HAVE_FCNTL_H 1
| #define HAVE_LIMITS_H 1
| #define HAVE_STDINT_H 1
| #define HAVE_STRING_H 1
| #define HAVE_SYS_TIME_H 1
| #define HAVE_UNISTD_H 1
| #define HAVE_XMMINTRIN_H 1
| #define SIZEOF_SHORT 2
| #define SIZEOF_UNSIGNED_SHORT 2
| #define SIZEOF_INT 4
| #define SIZEOF_UNSIGNED_INT 4
| #define SIZEOF_LONG 8
| #define SIZEOF_UNSIGNED_LONG 8
| #define SIZEOF_LONG_LONG 8
| #define SIZEOF_UNSIGNED_LONG_LONG 8
| #define SIZEOF_FLOAT 4
| #define SIZEOF_DOUBLE 8
| #define HAVE_LONG_DOUBLE_WIDER 1
| #define HAVE_LONG_DOUBLE 1
| #define HAVE_UINT8_T 1
| #define HAVE_INT8_T 1
| #define HAVE_UINT16_T 1
| #define HAVE_INT16_T 1
| #define HAVE_UINT32_T 1
| #define HAVE_INT32_T 1
| #define HAVE_UINT64_T 1
| #define HAVE_INT64_T 1
| #define A_UINT32_T unsigned int
| #define A_INT32_T int
| #define A_UINT64_T unsigned long
| #define A_INT64_T long
| /* end confdefs.h.  */
| #include <stdio.h>
| #ifdef HAVE_SYS_TYPES_H
| # include <sys/types.h>
| #endif
| #ifdef HAVE_SYS_STAT_H
| # include <sys/stat.h>
| #endif
| #ifdef STDC_HEADERS
| # include <stdlib.h>
| # include <stddef.h>
| #else
| # ifdef HAVE_STDLIB_H
| #  include <stdlib.h>
| # endif
| #endif
| #ifdef HAVE_STRING_H
| # if !defined STDC_HEADERS && defined HAVE_MEMORY_H
| #  include <memory.h>
| # endif
| # include <string.h>
| #endif
| #ifdef HAVE_STRINGS_H
| # include <strings.h>
| #endif
| #ifdef HAVE_INTTYPES_H
| # include <inttypes.h>
| #endif
| #ifdef HAVE_STDINT_H
| # include <stdint.h>
| #endif
| #ifdef HAVE_UNISTD_H
| # include <unistd.h>
| #endif
| int
| main ()
| {
| if (sizeof (ieee754_float64_t))
| 	 return 0;
|   ;
|   return 0;
| }
configure:13168: result: no
configure:13177: checking for ieee754_float32_t
configure:13177: /usr/bin/gcc-4.2 -c -pipe -Os -arch x86_64 -I/opt/local/include conftest.c >&5
conftest.c: In function 'main':
conftest.c:100: error: 'ieee754_float32_t' undeclared (first use in this function)
conftest.c:100: error: (Each undeclared identifier is reported only once
conftest.c:100: error: for each function it appears in.)
configure:13177: $? = 1
configure: failed program was:
| /* confdefs.h */
| #define PACKAGE_NAME "lame"
| #define PACKAGE_TARNAME "lame"
| #define PACKAGE_VERSION "3.99.5"
| #define PACKAGE_STRING "lame 3.99.5"
| #define PACKAGE_BUGREPORT "lame-dev@lists.sf.net"
| #define PACKAGE_URL ""
| #define PACKAGE "lame"
| #define VERSION "3.99.5"
| #define STDC_HEADERS 1
| #define HAVE_SYS_TYPES_H 1
| #define HAVE_SYS_STAT_H 1
| #define HAVE_STDLIB_H 1
| #define HAVE_STRING_H 1
| #define HAVE_MEMORY_H 1
| #define HAVE_STRINGS_H 1
| #define HAVE_INTTYPES_H 1
| #define HAVE_STDINT_H 1
| #define HAVE_UNISTD_H 1
| #define __EXTENSIONS__ 1
| #define _ALL_SOURCE 1
| #define _GNU_SOURCE 1
| #define _POSIX_PTHREAD_SEMANTICS 1
| #define _TANDEM_SOURCE 1
| #define HAVE_DLFCN_H 1
| #define LT_OBJDIR ".libs/"
| #define PROTOTYPES 1
| #define __PROTOTYPES 1
| #define HAVE_STRING_H 1
| #define STDC_HEADERS 1
| #define HAVE_ERRNO_H 1
| #define HAVE_FCNTL_H 1
| #define HAVE_LIMITS_H 1
| #define HAVE_STDINT_H 1
| #define HAVE_STRING_H 1
| #define HAVE_SYS_TIME_H 1
| #define HAVE_UNISTD_H 1
| #define HAVE_XMMINTRIN_H 1
| #define SIZEOF_SHORT 2
| #define SIZEOF_UNSIGNED_SHORT 2
| #define SIZEOF_INT 4
| #define SIZEOF_UNSIGNED_INT 4
| #define SIZEOF_LONG 8
| #define SIZEOF_UNSIGNED_LONG 8
| #define SIZEOF_LONG_LONG 8
| #define SIZEOF_UNSIGNED_LONG_LONG 8
| #define SIZEOF_FLOAT 4
| #define SIZEOF_DOUBLE 8
| #define HAVE_LONG_DOUBLE_WIDER 1
| #define HAVE_LONG_DOUBLE 1
| #define HAVE_UINT8_T 1
| #define HAVE_INT8_T 1
| #define HAVE_UINT16_T 1
| #define HAVE_INT16_T 1
| #define HAVE_UINT32_T 1
| #define HAVE_INT32_T 1
| #define HAVE_UINT64_T 1
| #define HAVE_INT64_T 1
| #define A_UINT32_T unsigned int
| #define A_INT32_T int
| #define A_UINT64_T unsigned long
| #define A_INT64_T long
| /* end confdefs.h.  */
| #include <stdio.h>
| #ifdef HAVE_SYS_TYPES_H
| # include <sys/types.h>
| #endif
| #ifdef HAVE_SYS_STAT_H
| # include <sys/stat.h>
| #endif
| #ifdef STDC_HEADERS
| # include <stdlib.h>
| # include <stddef.h>
| #else
| # ifdef HAVE_STDLIB_H
| #  include <stdlib.h>
| # endif
| #endif
| #ifdef HAVE_STRING_H
| # if !defined STDC_HEADERS && defined HAVE_MEMORY_H
| #  include <memory.h>
| # endif
| # include <string.h>
| #endif
| #ifdef HAVE_STRINGS_H
| # include <strings.h>
| #endif
| #ifdef HAVE_INTTYPES_H
| # include <inttypes.h>
| #endif
| #ifdef HAVE_STDINT_H
| # include <stdint.h>
| #endif
| #ifdef HAVE_UNISTD_H
| # include <unistd.h>
| #endif
| int
| main ()
| {
| if (sizeof (ieee754_float32_t))
| 	 return 0;
|   ;
|   return 0;
| }
configure:13177: result: no
configure:13242: checking for size_t
configure:13242: /usr/bin/gcc-4.2 -c -pipe -Os -arch x86_64 -I/opt/local/include conftest.c >&5
configure:13242: $? = 0
configure:13242: /usr/bin/gcc-4.2 -c -pipe -Os -arch x86_64 -I/opt/local/include conftest.c >&5
conftest.c: In function 'main':
conftest.c:101: error: expected expression before ')' token
configure:13242: $? = 1
configure: failed program was:
| /* confdefs.h */
| #define PACKAGE_NAME "lame"
| #define PACKAGE_TARNAME "lame"
| #define PACKAGE_VERSION "3.99.5"
| #define PACKAGE_STRING "lame 3.99.5"
| #define PACKAGE_BUGREPORT "lame-dev@lists.sf.net"
| #define PACKAGE_URL ""
| #define PACKAGE "lame"
| #define VERSION "3.99.5"
| #define STDC_HEADERS 1
| #define HAVE_SYS_TYPES_H 1
| #define HAVE_SYS_STAT_H 1
| #define HAVE_STDLIB_H 1
| #define HAVE_STRING_H 1
| #define HAVE_MEMORY_H 1
| #define HAVE_STRINGS_H 1
| #define HAVE_INTTYPES_H 1
| #define HAVE_STDINT_H 1
| #define HAVE_UNISTD_H 1
| #define __EXTENSIONS__ 1
| #define _ALL_SOURCE 1
| #define _GNU_SOURCE 1
| #define _POSIX_PTHREAD_SEMANTICS 1
| #define _TANDEM_SOURCE 1
| #define HAVE_DLFCN_H 1
| #define LT_OBJDIR ".libs/"
| #define PROTOTYPES 1
| #define __PROTOTYPES 1
| #define HAVE_STRING_H 1
| #define STDC_HEADERS 1
| #define HAVE_ERRNO_H 1
| #define HAVE_FCNTL_H 1
| #define HAVE_LIMITS_H 1
| #define HAVE_STDINT_H 1
| #define HAVE_STRING_H 1
| #define HAVE_SYS_TIME_H 1
| #define HAVE_UNISTD_H 1
| #define HAVE_XMMINTRIN_H 1
| #define SIZEOF_SHORT 2
| #define SIZEOF_UNSIGNED_SHORT 2
| #define SIZEOF_INT 4
| #define SIZEOF_UNSIGNED_INT 4
| #define SIZEOF_LONG 8
| #define SIZEOF_UNSIGNED_LONG 8
| #define SIZEOF_LONG_LONG 8
| #define SIZEOF_UNSIGNED_LONG_LONG 8
| #define SIZEOF_FLOAT 4
| #define SIZEOF_DOUBLE 8
| #define HAVE_LONG_DOUBLE_WIDER 1
| #define HAVE_LONG_DOUBLE 1
| #define HAVE_UINT8_T 1
| #define HAVE_INT8_T 1
| #define HAVE_UINT16_T 1
| #define HAVE_INT16_T 1
| #define HAVE_UINT32_T 1
| #define HAVE_INT32_T 1
| #define HAVE_UINT64_T 1
| #define HAVE_INT64_T 1
| #define A_UINT32_T unsigned int
| #define A_INT32_T int
| #define A_UINT64_T unsigned long
| #define A_INT64_T long
| #define LAME_LIBRARY_BUILD 1
| /* end confdefs.h.  */
| #include <stdio.h>
| #ifdef HAVE_SYS_TYPES_H
| # include <sys/types.h>
| #endif
| #ifdef HAVE_SYS_STAT_H
| # include <sys/stat.h>
| #endif
| #ifdef STDC_HEADERS
| # include <stdlib.h>
| # include <stddef.h>
| #else
| # ifdef HAVE_STDLIB_H
| #  include <stdlib.h>
| # endif
| #endif
| #ifdef HAVE_STRING_H
| # if !defined STDC_HEADERS && defined HAVE_MEMORY_H
| #  include <memory.h>
| # endif
| # include <string.h>
| #endif
| #ifdef HAVE_STRINGS_H
| # include <strings.h>
| #endif
| #ifdef HAVE_INTTYPES_H
| # include <inttypes.h>
| #endif
| #ifdef HAVE_STDINT_H
| # include <stdint.h>
| #endif
| #ifdef HAVE_UNISTD_H
| # include <unistd.h>
| #endif
| int
| main ()
| {
| if (sizeof ((size_t)))
| 	    return 0;
|   ;
|   return 0;
| }
configure:13242: result: yes
configure:13253: checking whether time.h and sys/time.h may both be included
configure:13273: /usr/bin/gcc-4.2 -c -pipe -Os -arch x86_64 -I/opt/local/include conftest.c >&5
configure:13273: $? = 0
configure:13280: result: yes
configure:13291: checking for working alloca.h
configure:13308: /usr/bin/gcc-4.2 -o conftest -pipe -Os -arch x86_64 -I/opt/local/include -L/opt/local/lib -Wl,-headerpad_max_install_names -arch x86_64 conftest.c  >&5
configure:13308: $? = 0
configure:13316: result: yes
configure:13324: checking for alloca
configure:13361: /usr/bin/gcc-4.2 -o conftest -pipe -Os -arch x86_64 -I/opt/local/include -L/opt/local/lib -Wl,-headerpad_max_install_names -arch x86_64 conftest.c  >&5
configure:13361: $? = 0
configure:13369: result: yes
configure:13481: checking for gettimeofday
configure:13481: /usr/bin/gcc-4.2 -o conftest -pipe -Os -arch x86_64 -I/opt/local/include -L/opt/local/lib -Wl,-headerpad_max_install_names -arch x86_64 conftest.c  >&5
configure:13481: $? = 0
configure:13481: result: yes
configure:13481: checking for strtol
configure:13481: /usr/bin/gcc-4.2 -o conftest -pipe -Os -arch x86_64 -I/opt/local/include -L/opt/local/lib -Wl,-headerpad_max_install_names -arch x86_64 conftest.c  >&5
configure:13481: $? = 0
configure:13481: result: yes
configure:13498: checking for socket
configure:13498: /usr/bin/gcc-4.2 -o conftest -pipe -Os -arch x86_64 -I/opt/local/include -L/opt/local/lib -Wl,-headerpad_max_install_names -arch x86_64 conftest.c  >&5
configure:13498: $? = 0
configure:13498: result: yes
configure:13583: checking termcap.h usability
configure:13583: /usr/bin/gcc-4.2 -c -pipe -Os -arch x86_64 -I/opt/local/include conftest.c >&5
configure:13583: $? = 0
configure:13583: result: yes
configure:13583: checking termcap.h presence
configure:13583: /usr/bin/gcc-4.2 -E -I/opt/local/include conftest.c
configure:13583: $? = 0
configure:13583: result: yes
configure:13583: checking for termcap.h
configure:13583: result: yes
configure:13595: checking ncurses/termcap.h usability
configure:13595: /usr/bin/gcc-4.2 -c -pipe -Os -arch x86_64 -I/opt/local/include conftest.c >&5
conftest.c:105:29: error: ncurses/termcap.h: No such file or directory
configure:13595: $? = 1
configure: failed program was:
| /* confdefs.h */
| #define PACKAGE_NAME "lame"
| #define PACKAGE_TARNAME "lame"
| #define PACKAGE_VERSION "3.99.5"
| #define PACKAGE_STRING "lame 3.99.5"
| #define PACKAGE_BUGREPORT "lame-dev@lists.sf.net"
| #define PACKAGE_URL ""
| #define PACKAGE "lame"
| #define VERSION "3.99.5"
| #define STDC_HEADERS 1
| #define HAVE_SYS_TYPES_H 1
| #define HAVE_SYS_STAT_H 1
| #define HAVE_STDLIB_H 1
| #define HAVE_STRING_H 1
| #define HAVE_MEMORY_H 1
| #define HAVE_STRINGS_H 1
| #define HAVE_INTTYPES_H 1
| #define HAVE_STDINT_H 1
| #define HAVE_UNISTD_H 1
| #define __EXTENSIONS__ 1
| #define _ALL_SOURCE 1
| #define _GNU_SOURCE 1
| #define _POSIX_PTHREAD_SEMANTICS 1
| #define _TANDEM_SOURCE 1
| #define HAVE_DLFCN_H 1
| #define LT_OBJDIR ".libs/"
| #define PROTOTYPES 1
| #define __PROTOTYPES 1
| #define HAVE_STRING_H 1
| #define STDC_HEADERS 1
| #define HAVE_ERRNO_H 1
| #define HAVE_FCNTL_H 1
| #define HAVE_LIMITS_H 1
| #define HAVE_STDINT_H 1
| #define HAVE_STRING_H 1
| #define HAVE_SYS_TIME_H 1
| #define HAVE_UNISTD_H 1
| #define HAVE_XMMINTRIN_H 1
| #define SIZEOF_SHORT 2
| #define SIZEOF_UNSIGNED_SHORT 2
| #define SIZEOF_INT 4
| #define SIZEOF_UNSIGNED_INT 4
| #define SIZEOF_LONG 8
| #define SIZEOF_UNSIGNED_LONG 8
| #define SIZEOF_LONG_LONG 8
| #define SIZEOF_UNSIGNED_LONG_LONG 8
| #define SIZEOF_FLOAT 4
| #define SIZEOF_DOUBLE 8
| #define HAVE_LONG_DOUBLE_WIDER 1
| #define HAVE_LONG_DOUBLE 1
| #define HAVE_UINT8_T 1
| #define HAVE_INT8_T 1
| #define HAVE_UINT16_T 1
| #define HAVE_INT16_T 1
| #define HAVE_UINT32_T 1
| #define HAVE_INT32_T 1
| #define HAVE_UINT64_T 1
| #define HAVE_INT64_T 1
| #define A_UINT32_T unsigned int
| #define A_INT32_T int
| #define A_UINT64_T unsigned long
| #define A_INT64_T long
| #define LAME_LIBRARY_BUILD 1
| #define TIME_WITH_SYS_TIME 1
| #define HAVE_ALLOCA_H 1
| #define HAVE_ALLOCA 1
| #define HAVE_GETTIMEOFDAY 1
| #define HAVE_STRTOL 1
| #define HAVE_SOCKET 1
| #define HAVE_TERMCAP_H 1
| /* end confdefs.h.  */
| #include <stdio.h>
| #ifdef HAVE_SYS_TYPES_H
| # include <sys/types.h>
| #endif
| #ifdef HAVE_SYS_STAT_H
| # include <sys/stat.h>
| #endif
| #ifdef STDC_HEADERS
| # include <stdlib.h>
| # include <stddef.h>
| #else
| # ifdef HAVE_STDLIB_H
| #  include <stdlib.h>
| # endif
| #endif
| #ifdef HAVE_STRING_H
| # if !defined STDC_HEADERS && defined HAVE_MEMORY_H
| #  include <memory.h>
| # endif
| # include <string.h>
| #endif
| #ifdef HAVE_STRINGS_H
| # include <strings.h>
| #endif
| #ifdef HAVE_INTTYPES_H
| # include <inttypes.h>
| #endif
| #ifdef HAVE_STDINT_H
| # include <stdint.h>
| #endif
| #ifdef HAVE_UNISTD_H
| # include <unistd.h>
| #endif
| #include <ncurses/termcap.h>
configure:13595: result: no
configure:13595: checking ncurses/termcap.h presence
configure:13595: /usr/bin/gcc-4.2 -E -I/opt/local/include conftest.c
conftest.c:72:29: error: ncurses/termcap.h: No such file or directory
configure:13595: $? = 1
configure: failed program was:
| /* confdefs.h */
| #define PACKAGE_NAME "lame"
| #define PACKAGE_TARNAME "lame"
| #define PACKAGE_VERSION "3.99.5"
| #define PACKAGE_STRING "lame 3.99.5"
| #define PACKAGE_BUGREPORT "lame-dev@lists.sf.net"
| #define PACKAGE_URL ""
| #define PACKAGE "lame"
| #define VERSION "3.99.5"
| #define STDC_HEADERS 1
| #define HAVE_SYS_TYPES_H 1
| #define HAVE_SYS_STAT_H 1
| #define HAVE_STDLIB_H 1
| #define HAVE_STRING_H 1
| #define HAVE_MEMORY_H 1
| #define HAVE_STRINGS_H 1
| #define HAVE_INTTYPES_H 1
| #define HAVE_STDINT_H 1
| #define HAVE_UNISTD_H 1
| #define __EXTENSIONS__ 1
| #define _ALL_SOURCE 1
| #define _GNU_SOURCE 1
| #define _POSIX_PTHREAD_SEMANTICS 1
| #define _TANDEM_SOURCE 1
| #define HAVE_DLFCN_H 1
| #define LT_OBJDIR ".libs/"
| #define PROTOTYPES 1
| #define __PROTOTYPES 1
| #define HAVE_STRING_H 1
| #define STDC_HEADERS 1
| #define HAVE_ERRNO_H 1
| #define HAVE_FCNTL_H 1
| #define HAVE_LIMITS_H 1
| #define HAVE_STDINT_H 1
| #define HAVE_STRING_H 1
| #define HAVE_SYS_TIME_H 1
| #define HAVE_UNISTD_H 1
| #define HAVE_XMMINTRIN_H 1
| #define SIZEOF_SHORT 2
| #define SIZEOF_UNSIGNED_SHORT 2
| #define SIZEOF_INT 4
| #define SIZEOF_UNSIGNED_INT 4
| #define SIZEOF_LONG 8
| #define SIZEOF_UNSIGNED_LONG 8
| #define SIZEOF_LONG_LONG 8
| #define SIZEOF_UNSIGNED_LONG_LONG 8
| #define SIZEOF_FLOAT 4
| #define SIZEOF_DOUBLE 8
| #define HAVE_LONG_DOUBLE_WIDER 1
| #define HAVE_LONG_DOUBLE 1
| #define HAVE_UINT8_T 1
| #define HAVE_INT8_T 1
| #define HAVE_UINT16_T 1
| #define HAVE_INT16_T 1
| #define HAVE_UINT32_T 1
| #define HAVE_INT32_T 1
| #define HAVE_UINT64_T 1
| #define HAVE_INT64_T 1
| #define A_UINT32_T unsigned int
| #define A_INT32_T int
| #define A_UINT64_T unsigned long
| #define A_INT64_T long
| #define LAME_LIBRARY_BUILD 1
| #define TIME_WITH_SYS_TIME 1
| #define HAVE_ALLOCA_H 1
| #define HAVE_ALLOCA 1
| #define HAVE_GETTIMEOFDAY 1
| #define HAVE_STRTOL 1
| #define HAVE_SOCKET 1
| #define HAVE_TERMCAP_H 1
| /* end confdefs.h.  */
| #include <ncurses/termcap.h>
configure:13595: result: no
configure:13595: checking for ncurses/termcap.h
configure:13595: result: no
configure:13605: checking for initscr in -ltermcap
configure:13630: /usr/bin/gcc-4.2 -o conftest -pipe -Os -arch x86_64 -I/opt/local/include -L/opt/local/lib -Wl,-headerpad_max_install_names -arch x86_64 conftest.c -ltermcap   >&5
configure:13630: $? = 0
configure:13639: result: yes
configure:13645: checking for initscr in -lcurses
configure:13670: /usr/bin/gcc-4.2 -o conftest -pipe -Os -arch x86_64 -I/opt/local/include -L/opt/local/lib -Wl,-headerpad_max_install_names -arch x86_64 conftest.c -lcurses   >&5
configure:13670: $? = 0
configure:13679: result: yes
configure:13685: checking for initscr in -lncurses
configure:13710: /usr/bin/gcc-4.2 -o conftest -pipe -Os -arch x86_64 -I/opt/local/include -L/opt/local/lib -Wl,-headerpad_max_install_names -arch x86_64 conftest.c -lncurses   >&5
configure:13710: $? = 0
configure:13719: result: yes
configure:13766: checking for ld used by GCC
configure:13830: result: /usr/libexec/gcc/i686-apple-darwin10/4.2.1/ld
configure:13837: checking if the linker (/usr/libexec/gcc/i686-apple-darwin10/4.2.1/ld) is GNU ld
configure:13850: result: no
configure:13857: checking for shared library run path origin
configure:13870: result: done
configure:14448: checking for iconv
configure:14470: /usr/bin/gcc-4.2 -o conftest -pipe -Os -arch x86_64 -I/opt/local/include -L/opt/local/lib -Wl,-headerpad_max_install_names -arch x86_64 conftest.c  >&5
Undefined symbols:
  "_libiconv_open", referenced from:
      _main in ccvqzIix.o
  "_libiconv", referenced from:
      _main in ccvqzIix.o
  "_libiconv_close", referenced from:
      _main in ccvqzIix.o
ld: symbol(s) not found
collect2: ld returned 1 exit status
configure:14470: $? = 1
configure: failed program was:
| /* confdefs.h */
| #define PACKAGE_NAME "lame"
| #define PACKAGE_TARNAME "lame"
| #define PACKAGE_VERSION "3.99.5"
| #define PACKAGE_STRING "lame 3.99.5"
| #define PACKAGE_BUGREPORT "lame-dev@lists.sf.net"
| #define PACKAGE_URL ""
| #define PACKAGE "lame"
| #define VERSION "3.99.5"
| #define STDC_HEADERS 1
| #define HAVE_SYS_TYPES_H 1
| #define HAVE_SYS_STAT_H 1
| #define HAVE_STDLIB_H 1
| #define HAVE_STRING_H 1
| #define HAVE_MEMORY_H 1
| #define HAVE_STRINGS_H 1
| #define HAVE_INTTYPES_H 1
| #define HAVE_STDINT_H 1
| #define HAVE_UNISTD_H 1
| #define __EXTENSIONS__ 1
| #define _ALL_SOURCE 1
| #define _GNU_SOURCE 1
| #define _POSIX_PTHREAD_SEMANTICS 1
| #define _TANDEM_SOURCE 1
| #define HAVE_DLFCN_H 1
| #define LT_OBJDIR ".libs/"
| #define PROTOTYPES 1
| #define __PROTOTYPES 1
| #define HAVE_STRING_H 1
| #define STDC_HEADERS 1
| #define HAVE_ERRNO_H 1
| #define HAVE_FCNTL_H 1
| #define HAVE_LIMITS_H 1
| #define HAVE_STDINT_H 1
| #define HAVE_STRING_H 1
| #define HAVE_SYS_TIME_H 1
| #define HAVE_UNISTD_H 1
| #define HAVE_XMMINTRIN_H 1
| #define SIZEOF_SHORT 2
| #define SIZEOF_UNSIGNED_SHORT 2
| #define SIZEOF_INT 4
| #define SIZEOF_UNSIGNED_INT 4
| #define SIZEOF_LONG 8
| #define SIZEOF_UNSIGNED_LONG 8
| #define SIZEOF_LONG_LONG 8
| #define SIZEOF_UNSIGNED_LONG_LONG 8
| #define SIZEOF_FLOAT 4
| #define SIZEOF_DOUBLE 8
| #define HAVE_LONG_DOUBLE_WIDER 1
| #define HAVE_LONG_DOUBLE 1
| #define HAVE_UINT8_T 1
| #define HAVE_INT8_T 1
| #define HAVE_UINT16_T 1
| #define HAVE_INT16_T 1
| #define HAVE_UINT32_T 1
| #define HAVE_INT32_T 1
| #define HAVE_UINT64_T 1
| #define HAVE_INT64_T 1
| #define A_UINT32_T unsigned int
| #define A_INT32_T int
| #define A_UINT64_T unsigned long
| #define A_INT64_T long
| #define LAME_LIBRARY_BUILD 1
| #define TIME_WITH_SYS_TIME 1
| #define HAVE_ALLOCA_H 1
| #define HAVE_ALLOCA 1
| #define HAVE_GETTIMEOFDAY 1
| #define HAVE_STRTOL 1
| #define HAVE_SOCKET 1
| #define HAVE_TERMCAP_H 1
| /* end confdefs.h.  */
| #include <stdlib.h>
| #include <iconv.h>
| int
| main ()
| {
| iconv_t cd = iconv_open("","");
|        iconv(cd,NULL,NULL,NULL,NULL);
|        iconv_close(cd);
|   ;
|   return 0;
| }
configure:14492: /usr/bin/gcc-4.2 -o conftest -pipe -Os -arch x86_64 -I/opt/local/include -L/opt/local/lib -Wl,-headerpad_max_install_names -arch x86_64 conftest.c  -liconv >&5
configure:14492: $? = 0
configure:14502: result: yes
configure:14505: checking for working iconv
configure:14600: /usr/bin/gcc-4.2 -o conftest -pipe -Os -arch x86_64 -I/opt/local/include -L/opt/local/lib -Wl,-headerpad_max_install_names -arch x86_64 conftest.c  -liconv >&5
configure:14600: $? = 0
configure:14600: ./conftest
configure:14600: $? = 0
configure:14612: result: yes
configure:14627: checking how to link with libiconv
configure:14629: result: -liconv
configure:14640: checking for iconv declaration
configure:14669: /usr/bin/gcc-4.2 -c -pipe -Os -arch x86_64 -I/opt/local/include conftest.c >&5
configure:14669: $? = 0
configure:14680: result:
         extern size_t iconv (iconv_t cd, char * *inbuf, size_t *inbytesleft, char * *outbuf, size_t *outbytesleft);
configure:14691: checking for cos in -lm
configure:14716: /usr/bin/gcc-4.2 -o conftest -pipe -Os -arch x86_64 -I/opt/local/include -L/opt/local/lib -Wl,-headerpad_max_install_names -arch x86_64 conftest.c -lm   >&5
conftest.c:81: warning: conflicting types for built-in function 'cos'
configure:14716: $? = 0
configure:14725: result: yes
configure:14731: checking for cos in -lffm
configure:14756: /usr/bin/gcc-4.2 -o conftest -pipe -Os -arch x86_64 -I/opt/local/include -L/opt/local/lib -Wl,-headerpad_max_install_names -arch x86_64 conftest.c -lffm   >&5
conftest.c:81: warning: conflicting types for built-in function 'cos'
ld: library not found for -lffm
collect2: ld returned 1 exit status
configure:14756: $? = 1
configure: failed program was:
| /* confdefs.h */
| #define PACKAGE_NAME "lame"
| #define PACKAGE_TARNAME "lame"
| #define PACKAGE_VERSION "3.99.5"
| #define PACKAGE_STRING "lame 3.99.5"
| #define PACKAGE_BUGREPORT "lame-dev@lists.sf.net"
| #define PACKAGE_URL ""
| #define PACKAGE "lame"
| #define VERSION "3.99.5"
| #define STDC_HEADERS 1
| #define HAVE_SYS_TYPES_H 1
| #define HAVE_SYS_STAT_H 1
| #define HAVE_STDLIB_H 1
| #define HAVE_STRING_H 1
| #define HAVE_MEMORY_H 1
| #define HAVE_STRINGS_H 1
| #define HAVE_INTTYPES_H 1
| #define HAVE_STDINT_H 1
| #define HAVE_UNISTD_H 1
| #define __EXTENSIONS__ 1
| #define _ALL_SOURCE 1
| #define _GNU_SOURCE 1
| #define _POSIX_PTHREAD_SEMANTICS 1
| #define _TANDEM_SOURCE 1
| #define HAVE_DLFCN_H 1
| #define LT_OBJDIR ".libs/"
| #define PROTOTYPES 1
| #define __PROTOTYPES 1
| #define HAVE_STRING_H 1
| #define STDC_HEADERS 1
| #define HAVE_ERRNO_H 1
| #define HAVE_FCNTL_H 1
| #define HAVE_LIMITS_H 1
| #define HAVE_STDINT_H 1
| #define HAVE_STRING_H 1
| #define HAVE_SYS_TIME_H 1
| #define HAVE_UNISTD_H 1
| #define HAVE_XMMINTRIN_H 1
| #define SIZEOF_SHORT 2
| #define SIZEOF_UNSIGNED_SHORT 2
| #define SIZEOF_INT 4
| #define SIZEOF_UNSIGNED_INT 4
| #define SIZEOF_LONG 8
| #define SIZEOF_UNSIGNED_LONG 8
| #define SIZEOF_LONG_LONG 8
| #define SIZEOF_UNSIGNED_LONG_LONG 8
| #define SIZEOF_FLOAT 4
| #define SIZEOF_DOUBLE 8
| #define HAVE_LONG_DOUBLE_WIDER 1
| #define HAVE_LONG_DOUBLE 1
| #define HAVE_UINT8_T 1
| #define HAVE_INT8_T 1
| #define HAVE_UINT16_T 1
| #define HAVE_INT16_T 1
| #define HAVE_UINT32_T 1
| #define HAVE_INT32_T 1
| #define HAVE_UINT64_T 1
| #define HAVE_INT64_T 1
| #define A_UINT32_T unsigned int
| #define A_INT32_T int
| #define A_UINT64_T unsigned long
| #define A_INT64_T long
| #define LAME_LIBRARY_BUILD 1
| #define TIME_WITH_SYS_TIME 1
| #define HAVE_ALLOCA_H 1
| #define HAVE_ALLOCA 1
| #define HAVE_GETTIMEOFDAY 1
| #define HAVE_STRTOL 1
| #define HAVE_SOCKET 1
| #define HAVE_TERMCAP_H 1
| #define HAVE_ICONV 1
| #define ICONV_CONST 
| /* end confdefs.h.  */
| 
| /* Override any GCC internal prototype to avoid an error.
|    Use char because int might match the return type of a GCC
|    builtin and then its argument prototype would still apply.  */
| #ifdef __cplusplus
| extern "C"
| #endif
| char cos ();
| int
| main ()
| {
| return cos ();
|   ;
|   return 0;
| }
configure:14765: result: no
configure:14779: checking for cos in -lcpml
configure:14804: /usr/bin/gcc-4.2 -o conftest -pipe -Os -arch x86_64 -I/opt/local/include -L/opt/local/lib -Wl,-headerpad_max_install_names -arch x86_64 conftest.c -lcpml   >&5
conftest.c:81: warning: conflicting types for built-in function 'cos'
ld: library not found for -lcpml
collect2: ld returned 1 exit status
configure:14804: $? = 1
configure: failed program was:
| /* confdefs.h */
| #define PACKAGE_NAME "lame"
| #define PACKAGE_TARNAME "lame"
| #define PACKAGE_VERSION "3.99.5"
| #define PACKAGE_STRING "lame 3.99.5"
| #define PACKAGE_BUGREPORT "lame-dev@lists.sf.net"
| #define PACKAGE_URL ""
| #define PACKAGE "lame"
| #define VERSION "3.99.5"
| #define STDC_HEADERS 1
| #define HAVE_SYS_TYPES_H 1
| #define HAVE_SYS_STAT_H 1
| #define HAVE_STDLIB_H 1
| #define HAVE_STRING_H 1
| #define HAVE_MEMORY_H 1
| #define HAVE_STRINGS_H 1
| #define HAVE_INTTYPES_H 1
| #define HAVE_STDINT_H 1
| #define HAVE_UNISTD_H 1
| #define __EXTENSIONS__ 1
| #define _ALL_SOURCE 1
| #define _GNU_SOURCE 1
| #define _POSIX_PTHREAD_SEMANTICS 1
| #define _TANDEM_SOURCE 1
| #define HAVE_DLFCN_H 1
| #define LT_OBJDIR ".libs/"
| #define PROTOTYPES 1
| #define __PROTOTYPES 1
| #define HAVE_STRING_H 1
| #define STDC_HEADERS 1
| #define HAVE_ERRNO_H 1
| #define HAVE_FCNTL_H 1
| #define HAVE_LIMITS_H 1
| #define HAVE_STDINT_H 1
| #define HAVE_STRING_H 1
| #define HAVE_SYS_TIME_H 1
| #define HAVE_UNISTD_H 1
| #define HAVE_XMMINTRIN_H 1
| #define SIZEOF_SHORT 2
| #define SIZEOF_UNSIGNED_SHORT 2
| #define SIZEOF_INT 4
| #define SIZEOF_UNSIGNED_INT 4
| #define SIZEOF_LONG 8
| #define SIZEOF_UNSIGNED_LONG 8
| #define SIZEOF_LONG_LONG 8
| #define SIZEOF_UNSIGNED_LONG_LONG 8
| #define SIZEOF_FLOAT 4
| #define SIZEOF_DOUBLE 8
| #define HAVE_LONG_DOUBLE_WIDER 1
| #define HAVE_LONG_DOUBLE 1
| #define HAVE_UINT8_T 1
| #define HAVE_INT8_T 1
| #define HAVE_UINT16_T 1
| #define HAVE_INT16_T 1
| #define HAVE_UINT32_T 1
| #define HAVE_INT32_T 1
| #define HAVE_UINT64_T 1
| #define HAVE_INT64_T 1
| #define A_UINT32_T unsigned int
| #define A_INT32_T int
| #define A_UINT64_T unsigned long
| #define A_INT64_T long
| #define LAME_LIBRARY_BUILD 1
| #define TIME_WITH_SYS_TIME 1
| #define HAVE_ALLOCA_H 1
| #define HAVE_ALLOCA 1
| #define HAVE_GETTIMEOFDAY 1
| #define HAVE_STRTOL 1
| #define HAVE_SOCKET 1
| #define HAVE_TERMCAP_H 1
| #define HAVE_ICONV 1
| #define ICONV_CONST 
| /* end confdefs.h.  */
| 
| /* Override any GCC internal prototype to avoid an error.
|    Use char because int might match the return type of a GCC
|    builtin and then its argument prototype would still apply.  */
| #ifdef __cplusplus
| extern "C"
| #endif
| char cos ();
| int
| main ()
| {
| return cos ();
|   ;
|   return 0;
| }
configure:14813: result: no
configure:14871: checking for gtk-config
configure:14889: found /opt/local/bin/gtk-config
configure:14902: result: /opt/local/bin/gtk-config
configure:14911: checking for GTK - version >= 1.2.0
configure:15012: /usr/bin/gcc-4.2 -o conftest -pipe -Os -arch x86_64 -I/opt/local/include/gtk-1.2 -I/opt/local/include/glib-1.2 -I/opt/local/lib/glib/include -I/opt/local/include -I/opt/local/include -L/opt/local/lib -Wl,-headerpad_max_install_names -arch x86_64 conftest.c -L/opt/local/lib -L/opt/local/lib -lgtk -lgdk -lgmodule -lglib -lXext -lX11 -lm  >&5
configure:15012: $? = 0
configure:15012: ./conftest
configure:15012: $? = 0
configure:15026: result: yes
configure:15094: checking use of ElectricFence malloc debugging
configure:15159: result: no
configure:15369: checking use of file io
configure:15398: result: lame
configure:15406: checking use of analyzer hooks
configure:15428: result: yes
configure:15432: checking use of mpg123 decoder
configure:15460: result: yes (Layer 1, 2, 3)
configure:15464: checking if the lame frontend should be build
configure:15475: result: yes
configure:15485: checking if mp3x is requested
configure:15500: result: no
configure:15517: checking if mp3rtp is requested
configure:15535: result: no
configure:15539: checking if dynamic linking of the frontends is requested
configure:15550: result: no
configure:15650: checking for termcap
configure:15661: result: yes
configure:15733: checking if I have to build the internal vector lib
configure:15735: result: yes
configure:15741: checking for nasm
configure:15759: found /usr/bin/nasm
configure:15772: result: /usr/bin/nasm
configure:15784: checking for assembler routines for this processor type
configure:15811: result: no
configure:15844: checking for additional optimizations
configure:16028: result: no
configure:16040: checking for debug options
configure:16091: result: no
configure:16444: creating ./config.status

## ---------------------- ##
## Running config.status. ##
## ---------------------- ##

This file was extended by lame config.status 3.99.5, which was
generated by GNU Autoconf 2.68.  Invocation command line was

  CONFIG_FILES    = 
  CONFIG_HEADERS  = 
  CONFIG_LINKS    = 
  CONFIG_COMMANDS = 
  $ ./config.status 

on iMac-desk.local

config.status:1201: creating Makefile
config.status:1353: error: could not create Makefile

## ---------------- ##
## Cache variables. ##
## ---------------- ##

ac_cv_build=i686-apple-darwin10.8.0
ac_cv_c_bigendian=no
ac_cv_c_compiler_gnu=yes
ac_cv_c_const=yes
ac_cv_c_inline=inline
ac_cv_c_long_double=yes
ac_cv_env_CC_set=set
ac_cv_env_CC_value=/usr/bin/gcc-4.2
ac_cv_env_CFLAGS_set=set
ac_cv_env_CFLAGS_value='-pipe -Os -arch x86_64'
ac_cv_env_CPPFLAGS_set=set
ac_cv_env_CPPFLAGS_value=-I/opt/local/include
ac_cv_env_CPP_set=
ac_cv_env_CPP_value=
ac_cv_env_LDFLAGS_set=set
ac_cv_env_LDFLAGS_value='-L/opt/local/lib -Wl,-headerpad_max_install_names -arch x86_64'
ac_cv_env_LIBS_set=
ac_cv_env_LIBS_value=
ac_cv_env_PKG_CONFIG_LIBDIR_set=
ac_cv_env_PKG_CONFIG_LIBDIR_value=
ac_cv_env_PKG_CONFIG_PATH_set=
ac_cv_env_PKG_CONFIG_PATH_value=
ac_cv_env_PKG_CONFIG_set=
ac_cv_env_PKG_CONFIG_value=
ac_cv_env_SNDFILE_CFLAGS_set=
ac_cv_env_SNDFILE_CFLAGS_value=
ac_cv_env_SNDFILE_LIBS_set=
ac_cv_env_SNDFILE_LIBS_value=
ac_cv_env_build_alias_set=
ac_cv_env_build_alias_value=
ac_cv_env_host_alias_set=
ac_cv_env_host_alias_value=
ac_cv_env_target_alias_set=
ac_cv_env_target_alias_value=
ac_cv_func_alloca_works=yes
ac_cv_func_gettimeofday=yes
ac_cv_func_socket=yes
ac_cv_func_strtol=yes
ac_cv_header_dlfcn_h=yes
ac_cv_header_dmalloc_h=no
ac_cv_header_errno_h=yes
ac_cv_header_fcntl_h=yes
ac_cv_header_inttypes_h=yes
ac_cv_header_limits_h=yes
ac_cv_header_linux_soundcard_h=no
ac_cv_header_memory_h=yes
ac_cv_header_minix_config_h=no
ac_cv_header_ncurses_termcap_h=no
ac_cv_header_stdc=yes
ac_cv_header_stdint_h=yes
ac_cv_header_stdlib_h=yes
ac_cv_header_string_h=yes
ac_cv_header_strings_h=yes
ac_cv_header_sys_soundcard_h=no
ac_cv_header_sys_stat_h=yes
ac_cv_header_sys_time_h=yes
ac_cv_header_sys_types_h=yes
ac_cv_header_termcap_h=yes
ac_cv_header_time=yes
ac_cv_header_unistd_h=yes
ac_cv_header_xmmintrin_h=yes
ac_cv_host=i686-apple-darwin10.8.0
ac_cv_lib_cpml_cos=no
ac_cv_lib_curses_initscr=yes
ac_cv_lib_ffm_cos=no
ac_cv_lib_m_cos=yes
ac_cv_lib_ncurses_initscr=yes
ac_cv_lib_termcap_initscr=yes
ac_cv_objext=o
ac_cv_path_EGREP='/usr/bin/grep -E'
ac_cv_path_FGREP='/usr/bin/grep -F'
ac_cv_path_GREP=/usr/bin/grep
ac_cv_path_GTK_CONFIG=/opt/local/bin/gtk-config
ac_cv_path_NASM=/usr/bin/nasm
ac_cv_path_SED=/usr/bin/sed
ac_cv_path_mkdir=/opt/local/bin/gmkdir
ac_cv_prog_AWK=gawk
ac_cv_prog_CPP='/usr/bin/gcc-4.2 -E'
ac_cv_prog_ac_ct_AR=ar
ac_cv_prog_ac_ct_CC=/usr/bin/gcc-4.2
ac_cv_prog_ac_ct_DSYMUTIL=dsymutil
ac_cv_prog_ac_ct_LIPO=lipo
ac_cv_prog_ac_ct_NMEDIT=nmedit
ac_cv_prog_ac_ct_OTOOL=otool
ac_cv_prog_ac_ct_RANLIB=ranlib
ac_cv_prog_ac_ct_STRIP=strip
ac_cv_prog_cc_c89=
ac_cv_prog_cc_g=yes
ac_cv_prog_make_make_set=yes
ac_cv_safe_to_define___extensions__=yes
ac_cv_search_strerror='none required'
ac_cv_sizeof_double=8
ac_cv_sizeof_float=4
ac_cv_sizeof_int=4
ac_cv_sizeof_long=8
ac_cv_sizeof_long_long=8
ac_cv_sizeof_short=2
ac_cv_sizeof_unsigned_int=4
ac_cv_sizeof_unsigned_long=8
ac_cv_sizeof_unsigned_long_long=8
ac_cv_sizeof_unsigned_short=2
ac_cv_sys_file_offset_bits=no
ac_cv_sys_largefile_CC=no
ac_cv_type_ieee754_float32_t=no
ac_cv_type_ieee754_float64_t=no
ac_cv_type_int16_t=yes
ac_cv_type_int32_t=yes
ac_cv_type_int64_t=yes
ac_cv_type_int8_t=yes
ac_cv_type_long_double_wider=yes
ac_cv_type_size_t=yes
ac_cv_type_uint16_t=yes
ac_cv_type_uint32_t=yes
ac_cv_type_uint64_t=yes
ac_cv_type_uint8_t=yes
ac_cv_working_alloca_h=yes
acl_cv_hardcode_direct=no
acl_cv_hardcode_libdir_flag_spec=
acl_cv_hardcode_libdir_separator=
acl_cv_hardcode_minus_L=no
acl_cv_libext=a
acl_cv_libname_spec='lib$name'
acl_cv_library_names_spec='$libname$shrext'
acl_cv_path_LD=/usr/libexec/gcc/i686-apple-darwin10/4.2.1/ld
acl_cv_prog_gnu_ld=no
acl_cv_rpath=done
acl_cv_shlibext=dylib
acl_cv_wl=-Wl,
alex_cv_ieee854_float80=no
am_cv_CC_dependencies_compiler_type=gcc3
am_cv_func_iconv=yes
am_cv_func_iconv_works=yes
am_cv_lib_iconv=yes
am_cv_proto_iconv='extern size_t iconv (iconv_t cd, char * *inbuf, size_t *inbytesleft, char * *outbuf, size_t *outbytesleft);'
am_cv_proto_iconv_arg1=
lt_cv_apple_cc_single_mod=yes
lt_cv_deplibs_check_method=pass_all
lt_cv_file_magic_cmd='$MAGIC_CMD'
lt_cv_file_magic_test_file=
lt_cv_ld_exported_symbols_list=yes
lt_cv_ld_force_load=yes
lt_cv_ld_reload_flag=-r
lt_cv_nm_interface='BSD nm'
lt_cv_objdir=.libs
lt_cv_path_LD=/usr/libexec/gcc/i686-apple-darwin10/4.2.1/ld
lt_cv_path_NM=/opt/local/bin/nm
lt_cv_prog_compiler_c_o=yes
lt_cv_prog_compiler_pic_works=yes
lt_cv_prog_compiler_rtti_exceptions=no
lt_cv_prog_compiler_static_works=no
lt_cv_prog_gnu_ld=no
lt_cv_sys_global_symbol_pipe='sed -n -e '\''s/^.*[	 ]\([BCDEGRST][BCDEGRST]*\)[	 ][	 ]*_\([_A-Za-z][_A-Za-z0-9]*\)$/\1 _\2 \2/p'\'''
lt_cv_sys_global_symbol_to_c_name_address='sed -n -e '\''s/^: \([^ ]*\) $/  {\"\1\", (void *) 0},/p'\'' -e '\''s/^[BCDEGRST]* \([^ ]*\) \([^ ]*\)$/  {"\2", (void *) \&\2},/p'\'''
lt_cv_sys_global_symbol_to_c_name_address_lib_prefix='sed -n -e '\''s/^: \([^ ]*\) $/  {\"\1\", (void *) 0},/p'\'' -e '\''s/^[BCDEGRST]* \([^ ]*\) \(lib[^ ]*\)$/  {"\2", (void *) \&\2},/p'\'' -e '\''s/^[BCDEGRST]* \([^ ]*\) \([^ ]*\)$/  {"lib\2", (void *) \&\2},/p'\'''
lt_cv_sys_global_symbol_to_cdecl='sed -n -e '\''s/^T .* \(.*\)$/extern int \1();/p'\'' -e '\''s/^[BCDEGRST]* .* \(.*\)$/extern char \1;/p'\'''
lt_cv_sys_max_cmd_len=196608

## ----------------- ##
## Output variables. ##
## ----------------- ##

ACLOCAL='${SHELL} /opt/local/var/macports/build/_opt_local_var_macports_sources_rsync.macports.org_release_tarballs_ports_audio_lame/lame/work/lame-3.99.5/missing --run aclocal-1.11'
ALLOCA=''
AMDEPBACKSLASH='\'
AMDEP_FALSE='#'
AMDEP_TRUE=''
AMTAR='${SHELL} /opt/local/var/macports/build/_opt_local_var_macports_sources_rsync.macports.org_release_tarballs_ports_audio_lame/lame/work/lame-3.99.5/missing --run tar'
ANSI2KNR=''
AR='ar'
AUTOCONF='${SHELL} /opt/local/var/macports/build/_opt_local_var_macports_sources_rsync.macports.org_release_tarballs_ports_audio_lame/lame/work/lame-3.99.5/missing --run autoconf'
AUTOHEADER='${SHELL} /opt/local/var/macports/build/_opt_local_var_macports_sources_rsync.macports.org_release_tarballs_ports_audio_lame/lame/work/lame-3.99.5/missing --run autoheader'
AUTOMAKE='${SHELL} /opt/local/var/macports/build/_opt_local_var_macports_sources_rsync.macports.org_release_tarballs_ports_audio_lame/lame/work/lame-3.99.5/missing --run automake-1.11'
AWK='gawk'
CC='/usr/bin/gcc-4.2'
CCDEPMODE='depmode=gcc3'
CFLAGS=' -Wall -pipe -Os -arch x86_64 -fno-common'
CONFIG_DEFS=''
CONFIG_MATH_LIB='-lm'
CPP='/usr/bin/gcc-4.2 -E'
CPPFLAGS='-I/opt/local/include'
CPUCCODE=''
CPUTYPE='i386'
CYGPATH_W='echo'
DEFS='-DHAVE_CONFIG_H'
DEPDIR='.deps'
DSYMUTIL='dsymutil'
DUMPBIN=''
ECHO_C='\c'
ECHO_N=''
ECHO_T=''
EGREP='/usr/bin/grep -E'
EXEEXT=''
FGREP='/usr/bin/grep -F'
FRONTEND_CFLAGS=' '
FRONTEND_LDADD='-lncurses  -L/opt/local/lib -liconv -R/opt/local/lib -lm'
FRONTEND_LDFLAGS=' -static'
GREP='/usr/bin/grep'
GTK_CFLAGS='-I/opt/local/include/gtk-1.2 -I/opt/local/include/glib-1.2 -I/opt/local/lib/glib/include -I/opt/local/include'
GTK_CONFIG='/opt/local/bin/gtk-config'
GTK_LIBS='-L/opt/local/lib -L/opt/local/lib -lgtk -lgdk -lgmodule -lglib -lXext -lX11 -lm'
HAVE_NASM_FALSE=''
HAVE_NASM_TRUE='#'
INCLUDES='-I$(top_srcdir)/include -I$(srcdir)'
INSTALL_DATA='${INSTALL} -m 644'
INSTALL_PROGRAM='${INSTALL}'
INSTALL_SCRIPT='${INSTALL}'
INSTALL_STRIP_PROGRAM='$(install_sh) -c -s'
LD='/usr/libexec/gcc/i686-apple-darwin10/4.2.1/ld'
LDADD=''
LDFLAGS='-L/opt/local/lib -Wl,-headerpad_max_install_names -arch x86_64'
LIBICONV='-liconv'
LIBOBJS=''
LIBS=''
LIBTOOL='$(SHELL) $(top_builddir)/libtool'
LIBTOOL_DEPS='./ltmain.sh'
LIB_MAJOR_VERSION='0'
LIB_MINOR_VERSION='0'
LIB_WITH_DECODER_FALSE='#'
LIB_WITH_DECODER_TRUE=''
LIPO='lipo'
LN_S='ln -s'
LTLIBICONV='-L/opt/local/lib -liconv -R/opt/local/lib'
LTLIBOBJS=''
MAINT='#'
MAINTAINER_MODE_FALSE=''
MAINTAINER_MODE_TRUE='#'
MAKEDEP='-make'
MAKEINFO='${SHELL} /opt/local/var/macports/build/_opt_local_var_macports_sources_rsync.macports.org_release_tarballs_ports_audio_lame/lame/work/lame-3.99.5/missing --run makeinfo'
MKDIR_P='/opt/local/bin/gmkdir -p'
NASM='no'
NASM_FORMAT='-f macho'
NM='/opt/local/bin/nm'
NMEDIT='nmedit'
OBJDUMP='false'
OBJEXT='o'
OTOOL64=':'
OTOOL='otool'
PACKAGE='lame'
PACKAGE_BUGREPORT='lame-dev@lists.sf.net'
PACKAGE_NAME='lame'
PACKAGE_STRING='lame 3.99.5'
PACKAGE_TARNAME='lame'
PACKAGE_URL=''
PACKAGE_VERSION='3.99.5'
PATH_SEPARATOR=':'
PKG_CONFIG=''
PKG_CONFIG_LIBDIR=''
PKG_CONFIG_PATH=''
RANLIB='ranlib'
RM_F='rm -f'
SED='/usr/bin/sed'
SET_MAKE=''
SHELL='/bin/sh'
SNDFILE_CFLAGS=''
SNDFILE_LIBS=''
STRIP='strip'
U=''
VERSION='3.99.5'
WITH_FRONTEND='lame'
WITH_MP3RTP=''
WITH_MP3X=''
WITH_VECTOR_FALSE='#'
WITH_VECTOR_TRUE=''
WITH_XMM_FALSE='#'
WITH_XMM_TRUE=''
ac_ct_CC='/usr/bin/gcc-4.2'
ac_ct_DUMPBIN=''
am__EXEEXT_FALSE=''
am__EXEEXT_TRUE='#'
am__fastdepCC_FALSE='#'
am__fastdepCC_TRUE=''
am__include='include'
am__isrc=''
am__leading_dot='.'
am__quote=''
am__tar='${AMTAR} chof - "$$tardir"'
am__untar='${AMTAR} xf -'
bindir='${exec_prefix}/bin'
build='i686-apple-darwin10.8.0'
build_alias=''
build_cpu='i686'
build_os='darwin10.8.0'
build_vendor='apple'
datadir='${datarootdir}'
datarootdir='${prefix}/share'
docdir='${datarootdir}/doc/${PACKAGE_TARNAME}'
dvidir='${docdir}'
exec_prefix='${prefix}'
host='i686-apple-darwin10.8.0'
host_alias=''
host_cpu='i686'
host_os='darwin10.8.0'
host_vendor='apple'
htmldir='${docdir}'
includedir='${prefix}/include'
infodir='${datarootdir}/info'
install_sh='${SHELL} /opt/local/var/macports/build/_opt_local_var_macports_sources_rsync.macports.org_release_tarballs_ports_audio_lame/lame/work/lame-3.99.5/install-sh'
libdir='${exec_prefix}/lib'
libexecdir='${exec_prefix}/libexec'
localedir='${datarootdir}/locale'
localstatedir='${prefix}/var'
mandir='${datarootdir}/man'
mkdir_p='/opt/local/bin/gmkdir -p'
oldincludedir='/usr/include'
pdfdir='${docdir}'
prefix='/opt/local'
program_transform_name='s,x,x,'
psdir='${docdir}'
sbindir='${exec_prefix}/sbin'
sharedstatedir='${prefix}/com'
sysconfdir='${prefix}/etc'
target_alias=''

## ----------- ##
## confdefs.h. ##
## ----------- ##

/* confdefs.h */
#define PACKAGE_NAME "lame"
#define PACKAGE_TARNAME "lame"
#define PACKAGE_VERSION "3.99.5"
#define PACKAGE_STRING "lame 3.99.5"
#define PACKAGE_BUGREPORT "lame-dev@lists.sf.net"
#define PACKAGE_URL ""
#define PACKAGE "lame"
#define VERSION "3.99.5"
#define STDC_HEADERS 1
#define HAVE_SYS_TYPES_H 1
#define HAVE_SYS_STAT_H 1
#define HAVE_STDLIB_H 1
#define HAVE_STRING_H 1
#define HAVE_MEMORY_H 1
#define HAVE_STRINGS_H 1
#define HAVE_INTTYPES_H 1
#define HAVE_STDINT_H 1
#define HAVE_UNISTD_H 1
#define __EXTENSIONS__ 1
#define _ALL_SOURCE 1
#define _GNU_SOURCE 1
#define _POSIX_PTHREAD_SEMANTICS 1
#define _TANDEM_SOURCE 1
#define HAVE_DLFCN_H 1
#define LT_OBJDIR ".libs/"
#define PROTOTYPES 1
#define __PROTOTYPES 1
#define HAVE_STRING_H 1
#define STDC_HEADERS 1
#define HAVE_ERRNO_H 1
#define HAVE_FCNTL_H 1
#define HAVE_LIMITS_H 1
#define HAVE_STDINT_H 1
#define HAVE_STRING_H 1
#define HAVE_SYS_TIME_H 1
#define HAVE_UNISTD_H 1
#define HAVE_XMMINTRIN_H 1
#define SIZEOF_SHORT 2
#define SIZEOF_UNSIGNED_SHORT 2
#define SIZEOF_INT 4
#define SIZEOF_UNSIGNED_INT 4
#define SIZEOF_LONG 8
#define SIZEOF_UNSIGNED_LONG 8
#define SIZEOF_LONG_LONG 8
#define SIZEOF_UNSIGNED_LONG_LONG 8
#define SIZEOF_FLOAT 4
#define SIZEOF_DOUBLE 8
#define HAVE_LONG_DOUBLE_WIDER 1
#define HAVE_LONG_DOUBLE 1
#define HAVE_UINT8_T 1
#define HAVE_INT8_T 1
#define HAVE_UINT16_T 1
#define HAVE_INT16_T 1
#define HAVE_UINT32_T 1
#define HAVE_INT32_T 1
#define HAVE_UINT64_T 1
#define HAVE_INT64_T 1
#define A_UINT32_T unsigned int
#define A_INT32_T int
#define A_UINT64_T unsigned long
#define A_INT64_T long
#define LAME_LIBRARY_BUILD 1
#define TIME_WITH_SYS_TIME 1
#define HAVE_ALLOCA_H 1
#define HAVE_ALLOCA 1
#define HAVE_GETTIMEOFDAY 1
#define HAVE_STRTOL 1
#define HAVE_SOCKET 1
#define HAVE_TERMCAP_H 1
#define HAVE_ICONV 1
#define ICONV_CONST 
#define HAVE_MPGLIB 1
#define DECODE_ON_THE_FLY 1
#define HAVE_TERMCAP 1
#define TAKEHIRO_IEEE754_HACK 1
#define USE_FAST_LOG 1
#define NDEBUG 1

configure: exit 1
administrator$

main log *


administrator$ cat /opt/local/var/macports/logs/_opt_local_var_macports_sources_rsync.macports.org_release_tarballs_ports_audio_lame/lame/main.log
version:1
:msg:main --->  Computing dependencies for lame:info:main .:debug:main lame has no conflicts
:debug:main Searching for dependency: ncurses
:debug:main Found Dependency: receipt exists for ncurses
:debug:main Searching for dependency: libiconv
:debug:main Found Dependency: receipt exists for libiconv
:msg:main 
:debug:main Executing org.macports.main (lame)
:debug:main changing euid/egid - current euid: 0 - current egid: 0
:debug:main egid changed to: 501
:debug:main euid changed to: 504
:debug:archivefetch archivefetch phase started at Sat Aug 22 11:47:19 CDT 2015
:msg:archivefetch --->  Fetching archive for lame
:warn:archivefetch Your DNS servers incorrectly claim to know the address of nonexistent hosts. This may cause checksum mismatches for some ports. See this page for more information: <https://trac.macports.org/wiki/MisbehavingServers>
:debug:archivefetch Executing org.macports.archivefetch (lame)
:debug:archivefetch euid/egid changed to: 0/0
:debug:archivefetch chowned /opt/local/var/macports/incoming to macports
:debug:archivefetch euid/egid changed to: 504/501
:info:archivefetch --->  lame-3.99.5_1.darwin_10.x86_64.tbz2 doesn't seem to exist in /opt/local/var/macports/incoming/verified
:msg:archivefetch --->  Attempting to fetch lame-3.99.5_1.darwin_10.x86_64.tbz2 from http://packages.macports.org/lame
:debug:archivefetch Fetching archive failed:: The requested URL returned error: 404
:msg:archivefetch --->  Attempting to fetch lame-3.99.5_1.darwin_10.x86_64.tbz2 from http://lil.fr.packages.macports.org/lame
:debug:archivefetch Fetching archive failed:: The requested URL returned error: 404
:msg:archivefetch --->  Attempting to fetch lame-3.99.5_1.darwin_10.x86_64.tbz2 from http://mse.uk.packages.macports.org/sites/packages.macports.org/lame
:debug:archivefetch Fetching archive failed:: The requested URL returned error: 404
:debug:archivefetch Privilege de-escalation not attempted as not running as root.
:debug:fetch fetch phase started at Sat Aug 22 11:47:20 CDT 2015
:notice:fetch --->  Fetching distfiles for lame
:debug:fetch Executing org.macports.fetch (lame)
:debug:fetch Privilege de-escalation not attempted as not running as root.
:debug:checksum checksum phase started at Sat Aug 22 11:47:20 CDT 2015
:notice:checksum --->  Verifying checksums for lame
:debug:checksum Executing org.macports.checksum (lame)
:info:checksum --->  Checksumming lame-3.99.5.tar.gz
:debug:checksum Calculated (rmd160) is 8a0990af918b635cc79eb27a3beafc6c0ee13a9f
:debug:checksum Correct (rmd160) checksum for lame-3.99.5.tar.gz
:debug:checksum Calculated (sha256) is 24346b4158e4af3bd9f2e194bb23eb473c75fb7377011523353196b19b9a23ff
:debug:checksum Correct (sha256) checksum for lame-3.99.5.tar.gz
:debug:checksum Privilege de-escalation not attempted as not running as root.
:debug:extract extract phase started at Sat Aug 22 11:47:20 CDT 2015
:notice:extract --->  Extracting lame
:debug:extract Executing org.macports.extract (lame)
:info:extract --->  Extracting lame-3.99.5.tar.gz
:debug:extract setting option extract.args to '/opt/local/var/macports/distfiles/lame/lame-3.99.5.tar.gz'
:debug:extract Environment: 
CC_PRINT_OPTIONS='YES'
CC_PRINT_OPTIONS_FILE='/opt/local/var/macports/build/_opt_local_var_macports_sources_rsync.macports.org_release_tarballs_ports_audio_lame/lame/work/.CC_PRINT_OPTIONS'
CPATH='/opt/local/include'
LIBRARY_PATH='/opt/local/lib'
MACOSX_DEPLOYMENT_TARGET='10.6'
:debug:extract Assembled command: 'cd "/opt/local/var/macports/build/_opt_local_var_macports_sources_rsync.macports.org_release_tarballs_ports_audio_lame/lame/work" && /usr/bin/gzip -dc '/opt/local/var/macports/distfiles/lame/lame-3.99.5.tar.gz' | /usr/bin/gnutar --no-same-owner -xf -'
:debug:extract Executing command line:  cd "/opt/local/var/macports/build/_opt_local_var_macports_sources_rsync.macports.org_release_tarballs_ports_audio_lame/lame/work" && /usr/bin/gzip -dc '/opt/local/var/macports/distfiles/lame/lame-3.99.5.tar.gz' | /usr/bin/gnutar --no-same-owner -xf - 
:debug:extract euid/egid changed to: 0/0
:debug:extract chowned /opt/local/var/macports/build/_opt_local_var_macports_sources_rsync.macports.org_release_tarballs_ports_audio_lame/lame/work to macports
:debug:extract euid/egid changed to: 504/501
:debug:extract Privilege de-escalation not attempted as not running as root.
:debug:patch patch phase started at Sat Aug 22 11:47:20 CDT 2015
:debug:patch Executing org.macports.patch (lame)
:debug:patch Privilege de-escalation not attempted as not running as root.
:debug:configure configure phase started at Sat Aug 22 11:47:20 CDT 2015
:notice:configure --->  Configuring lame
:debug:configure Using compiler 'Xcode GCC 4.2'
:debug:configure Executing org.macports.configure (lame)
:debug:configure Environment: 
CC='/usr/bin/gcc-4.2'
CC_PRINT_OPTIONS='YES'
CC_PRINT_OPTIONS_FILE='/opt/local/var/macports/build/_opt_local_var_macports_sources_rsync.macports.org_release_tarballs_ports_audio_lame/lame/work/.CC_PRINT_OPTIONS'
CFLAGS='-pipe -Os -arch x86_64'
CPATH='/opt/local/include'
CPPFLAGS='-I/opt/local/include'
CXX='/usr/bin/g++-4.2'
CXXFLAGS='-pipe -Os -arch x86_64'
F77FLAGS='-m64'
F90FLAGS='-pipe -Os -m64'
FCFLAGS='-pipe -Os -m64'
FFLAGS='-pipe -Os'
INSTALL='/usr/bin/install -c'
LDFLAGS='-L/opt/local/lib -Wl,-headerpad_max_install_names -arch x86_64'
LIBRARY_PATH='/opt/local/lib'
MACOSX_DEPLOYMENT_TARGET='10.6'
OBJC='/usr/bin/gcc-4.2'
OBJCFLAGS='-pipe -Os -arch x86_64'
OBJCXX='/usr/bin/g++-4.2'
OBJCXXFLAGS='-pipe -Os -arch x86_64'
:debug:configure Assembled command: 'cd "/opt/local/var/macports/build/_opt_local_var_macports_sources_rsync.macports.org_release_tarballs_ports_audio_lame/lame/work/lame-3.99.5" && ./configure --prefix=/opt/local'
:debug:configure Executing command line:  cd "/opt/local/var/macports/build/_opt_local_var_macports_sources_rsync.macports.org_release_tarballs_ports_audio_lame/lame/work/lame-3.99.5" && ./configure --prefix=/opt/local 
:info:configure checking build system type... i686-apple-darwin10.8.0
:info:configure checking host system type... i686-apple-darwin10.8.0
:info:configure checking for a BSD-compatible install... /usr/bin/install -c
:info:configure checking whether build environment is sane... yes
:info:configure checking for a thread-safe mkdir -p... /opt/local/bin/gmkdir -p
:info:configure checking for gawk... gawk
:info:configure checking whether make sets $(MAKE)... yes
:info:configure checking whether to enable maintainer-specific portions of Makefiles... no
:info:configure checking for style of include used by make... GNU
:info:configure checking for gcc... /usr/bin/gcc-4.2
:info:configure checking whether the C compiler works... yes
:info:configure checking for C compiler default output file name... a.out
:info:configure checking for suffix of executables... 
:info:configure checking whether we are cross compiling... no
:info:configure checking for suffix of object files... o
:info:configure checking whether we are using the GNU C compiler... yes
:info:configure checking whether /usr/bin/gcc-4.2 accepts -g... yes
:info:configure checking for /usr/bin/gcc-4.2 option to accept ISO C89... none needed
:info:configure checking dependency style of /usr/bin/gcc-4.2... gcc3
:info:configure checking how to run the C preprocessor... /usr/bin/gcc-4.2 -E
:info:configure checking for grep that handles long lines and -e... /usr/bin/grep
:info:configure checking for egrep... /usr/bin/grep -E
:info:configure checking for ANSI C header files... yes
:info:configure checking for sys/types.h... yes
:info:configure checking for sys/stat.h... yes
:info:configure checking for stdlib.h... yes
:info:configure checking for string.h... yes
:info:configure checking for memory.h... yes
:info:configure checking for strings.h... yes
:info:configure checking for inttypes.h... yes
:info:configure checking for stdint.h... yes
:info:configure checking for unistd.h... yes
:info:configure checking minix/config.h usability... no
:info:configure checking minix/config.h presence... no
:info:configure checking for minix/config.h... no
:info:configure checking whether it is safe to define __EXTENSIONS__... yes
:info:configure checking for library containing strerror... none required
:info:configure checking how to print strings... printf
:info:configure checking for a sed that does not truncate output... /usr/bin/sed
:info:configure checking for fgrep... /usr/bin/grep -F
:info:configure checking for ld used by /usr/bin/gcc-4.2... /usr/libexec/gcc/i686-apple-darwin10/4.2.1/ld
:info:configure checking if the linker (/usr/libexec/gcc/i686-apple-darwin10/4.2.1/ld) is GNU ld... no
:info:configure checking for BSD- or MS-compatible name lister (nm)... /opt/local/bin/nm
:info:configure checking the name lister (/opt/local/bin/nm) interface... BSD nm
:info:configure checking whether ln -s works... yes
:info:configure checking the maximum length of command line arguments... 196608
:info:configure checking whether the shell understands some XSI constructs... yes
:info:configure checking whether the shell understands "+="... yes
:info:configure checking for /usr/libexec/gcc/i686-apple-darwin10/4.2.1/ld option to reload object files... -r
:info:configure checking for objdump... no
:info:configure checking how to recognize dependent libraries... pass_all
:info:configure checking for ar... ar
:info:configure checking for strip... strip
:info:configure checking for ranlib... ranlib
:info:configure checking command to parse /opt/local/bin/nm output from /usr/bin/gcc-4.2 object... ok
:info:configure checking for dsymutil... dsymutil
:info:configure checking for nmedit... nmedit
:info:configure checking for lipo... lipo
:info:configure checking for otool... otool
:info:configure checking for otool64... no
:info:configure checking for -single_module linker flag... yes
:info:configure checking for -exported_symbols_list linker flag... yes
:info:configure checking for -force_load linker flag... yes
:info:configure checking for dlfcn.h... yes
:info:configure checking for objdir... .libs
:info:configure checking if /usr/bin/gcc-4.2 supports -fno-rtti -fno-exceptions... no
:info:configure checking for /usr/bin/gcc-4.2 option to produce PIC... -fno-common -DPIC
:info:configure checking if /usr/bin/gcc-4.2 PIC flag -fno-common -DPIC works... yes
:info:configure checking if /usr/bin/gcc-4.2 static flag -static works... no
:info:configure checking if /usr/bin/gcc-4.2 supports -c -o file.o... yes
:info:configure checking if /usr/bin/gcc-4.2 supports -c -o file.o... (cached) yes
:info:configure checking whether the /usr/bin/gcc-4.2 linker (/usr/libexec/gcc/i686-apple-darwin10/4.2.1/ld) supports shared libraries... yes
:info:configure checking dynamic linker characteristics... darwin10.8.0 dyld
:info:configure checking how to hardcode library paths into programs... immediate
:info:configure checking whether stripping libraries is possible... yes
:info:configure checking if libtool supports shared libraries... yes
:info:configure checking whether to build shared libraries... yes
:info:configure checking whether to build static libraries... yes
:info:configure checking for gcc... (cached) /usr/bin/gcc-4.2
:info:configure checking whether we are using the GNU C compiler... (cached) yes
:info:configure checking whether /usr/bin/gcc-4.2 accepts -g... (cached) yes
:info:configure checking for /usr/bin/gcc-4.2 option to accept ISO C89... (cached) none needed
:info:configure checking dependency style of /usr/bin/gcc-4.2... (cached) gcc3
:info:configure checking version of GCC... (dot
:info:configure checking for function prototypes... yes
:info:configure checking for string.h... (cached) yes
:info:configure checking dmalloc.h usability... no
:info:configure checking dmalloc.h presence... no
:info:configure checking for dmalloc.h... no
:info:configure checking for ANSI C header files... (cached) yes
:info:configure checking errno.h usability... yes
:info:configure checking errno.h presence... yes
:info:configure checking for errno.h... yes
:info:configure checking fcntl.h usability... yes
:info:configure checking fcntl.h presence... yes
:info:configure checking for fcntl.h... yes
:info:configure checking limits.h usability... yes
:info:configure checking limits.h presence... yes
:info:configure checking for limits.h... yes
:info:configure checking for stdint.h... (cached) yes
:info:configure checking for string.h... (cached) yes
:info:configure checking sys/soundcard.h usability... no
:info:configure checking sys/soundcard.h presence... no
:info:configure checking for sys/soundcard.h... no
:info:configure checking sys/time.h usability... yes
:info:configure checking sys/time.h presence... yes
:info:configure checking for sys/time.h... yes
:info:configure checking for unistd.h... (cached) yes
:info:configure checking xmmintrin.h usability... yes
:info:configure checking xmmintrin.h presence... yes
:info:configure checking for xmmintrin.h... yes
:info:configure checking linux/soundcard.h usability... no
:info:configure checking linux/soundcard.h presence... no
:info:configure checking for linux/soundcard.h... no
:info:configure checking for an ANSI C-conforming const... yes
:info:configure checking for inline... inline
:info:configure checking whether byte ordering is bigendian... no
:info:configure checking for special C compiler options needed for large files... no
:info:configure checking for _FILE_OFFSET_BITS value needed for large files... no
:info:configure checking size of short... 2
:info:configure checking size of unsigned short... 2
:info:configure checking size of int... 4
:info:configure checking size of unsigned int... 4
:info:configure checking size of long... 8
:info:configure checking size of unsigned long... 8
:info:configure checking size of long long... 8
:info:configure checking size of unsigned long long... 8
:info:configure checking size of float... 4
:info:configure checking size of double... 8
:info:configure checking for long double with more range or precision than double... yes
:info:configure checking for uint8_t... yes
:info:configure checking for int8_t... yes
:info:configure checking for uint16_t... yes
:info:configure checking for int16_t... yes
:info:configure checking for uint32_t... yes
:info:configure checking for int32_t... yes
:info:configure checking for uint64_t... yes
:info:configure checking for int64_t... yes
:info:configure checking for IEEE854 compliant 80 bit floats... no
:info:configure checking for ieee754_float64_t... no
:info:configure checking for ieee754_float32_t... no
:info:configure checking for size_t... yes
:info:configure checking whether time.h and sys/time.h may both be included... yes
:info:configure checking for working alloca.h... yes
:info:configure checking for alloca... yes
:info:configure checking for gettimeofday... yes
:info:configure checking for strtol... yes
:info:configure checking for socket... yes
:info:configure checking termcap.h usability... yes
:info:configure checking termcap.h presence... yes
:info:configure checking for termcap.h... yes
:info:configure checking ncurses/termcap.h usability... no
:info:configure checking ncurses/termcap.h presence... no
:info:configure checking for ncurses/termcap.h... no
:info:configure checking for initscr in -ltermcap... yes
:info:configure checking for initscr in -lcurses... yes
:info:configure checking for initscr in -lncurses... yes
:info:configure checking for ld used by GCC... /usr/libexec/gcc/i686-apple-darwin10/4.2.1/ld
:info:configure checking if the linker (/usr/libexec/gcc/i686-apple-darwin10/4.2.1/ld) is GNU ld... no
:info:configure checking for shared library run path origin... done
:info:configure checking for iconv... yes
:info:configure checking for working iconv... yes
:info:configure checking how to link with libiconv... -liconv
:info:configure checking for iconv declaration... 
:info:configure          extern size_t iconv (iconv_t cd, char * *inbuf, size_t *inbytesleft, char * *outbuf, size_t *outbytesleft);
:info:configure checking for cos in -lm... yes
:info:configure checking for cos in -lffm... no
:info:configure checking for cos in -lcpml... no
:info:configure checking for gtk-config... /opt/local/bin/gtk-config
:info:configure checking for GTK - version >= 1.2.0... yes
:info:configure checking use of ElectricFence malloc debugging... no
:info:configure checking use of file io... lame
:info:configure checking use of analyzer hooks... yes
:info:configure checking use of mpg123 decoder... yes (Layer 1, 2, 3)
:info:configure checking if the lame frontend should be build... yes
:info:configure checking if mp3x is requested... no
:info:configure checking if mp3rtp is requested... no
:info:configure checking if dynamic linking of the frontends is requested... no
:info:configure checking for termcap... yes
:info:configure checking if I have to build the internal vector lib... yes
:info:configure checking for nasm... /usr/bin/nasm
:info:configure checking for assembler routines for this processor type... no
:info:configure checking for additional optimizations... no
:info:configure checking for debug options... no
:info:configure configure: creating ./config.status
:info:configure config.status: creating Makefile
:info:configure dyld: Library not loaded: /opt/local/lib/libncurses.5.dylib
:info:configure   Referenced from: /opt/local/lib/libreadline.6.dylib
:info:configure   Reason: no suitable image found.  Did find:
:info:configure 	/usr/lib/libncurses.5.dylib: no matching architecture in universal wrapper
:info:configure sed: stdout: Broken pipe
:info:configure ./config.status: line 1278: 32156 Done(1)                 eval sed \"\$ac_sed_extra\" "$ac_file_inputs"
:info:configure      32157 Trace/BPT trap          | $AWK -f "$ac_tmp/subs.awk" > $ac_tmp/out
:info:configure config.status: error: could not create Makefile
:info:configure Command failed:  cd "/opt/local/var/macports/build/_opt_local_var_macports_sources_rsync.macports.org_release_tarballs_ports_audio_lame/lame/work/lame-3.99.5" && ./configure --prefix=/opt/local 
:info:configure Exit code: 1
:error:configure Failed to configure lame, consult /opt/local/var/macports/build/_opt_local_var_macports_sources_rsync.macports.org_release_tarballs_ports_audio_lame/lame/work/lame-3.99.5/config.log
:error:configure org.macports.configure for port lame returned: configure failure: command execution failed
:debug:configure Error code: NONE
:debug:configure Backtrace: configure failure: command execution failed
    while executing
"portconfigure::configure_main org.macports.configure"
    ("eval" body line 1)
    invoked from within
"eval $procedure $targetname"
:info:configure Warning: targets not executed for lame: org.macports.install org.macports.configure org.macports.build org.macports.destroot
:notice:configure Please see the log file for port lame for details:
    /opt/local/var/macports/logs/_opt_local_var_macports_sources_rsync.macports.org_release_tarballs_ports_audio_lame/lame/main.log

Change History (2)

comment:1 Changed 6 years ago by mf2k (Frank Schima)

Keywords: lame ncurses removed

Please attach log files instead of pasting them into the description.

comment:2 Changed 6 years ago by ryandesign (Ryan Schmidt)

Resolution: wontfix
Status: newclosed

Upgrade the readline port first. Then continue with what you were trying to upgrade. See ProblemHotlist#ncurses6.

Note: See TracTickets for help on using tickets.