Opened 11 years ago
Closed 11 years ago
#50823 closed defect (duplicate)
openssl build failure on 10.6
| Reported by: | chillin- | Owned by: | larryv (Lawrence Velázquez) |
|---|---|---|---|
| Priority: | Normal | Milestone: | |
| Component: | ports | Version: | |
| Keywords: | snowleopard | Cc: | neverpanic (Clemens Lang), mojca (Mojca Miklavec) |
| Port: | openssl |
Description
/usr/bin/perl asm/sha1-x86_64.pl macosx > sha1-x86_64.s
/usr/bin/gcc-4.2 -I.. -I../.. -I../modes -I../asn1 -I../evp -I../../include -fPIC -fno-common -DOPENSSL_PIC -DZLIB -DOPENSSL_THREADS -D_REENTRANT -DDSO_DLFCN -DHAVE_DLFCN_H -arch x86_64 -O3 -DL_ENDIAN -Wall -DOPENSSL_IA32_SSE2 -DOPENSSL_BN_ASM_MONT -DOPENSSL_BN_ASM_MONT5 -DOPENSSL_BN_ASM_GF2m -DSHA1_ASM -DSHA256_ASM -DSHA512_ASM -DMD5_ASM -DAES_ASM -DVPAES_ASM -DBSAES_ASM -DWHIRLPOOL_ASM -DGHASH_ASM -DECP_NISTZ256_ASM -c -o sha1-x86_64.o sha1-x86_64.s
sha1-x86_64.s:1243:missing or invalid immediate expression `0b00011011' taken as 0
sha1-x86_64.s:1243:suffix or operands invalid for `pshufd'
sha1-x86_64.s:1245:missing or invalid immediate expression `0b00011011' taken as 0
sha1-x86_64.s:1245:suffix or operands invalid for `pshufd'
sha1-x86_64.s:1395:missing or invalid immediate expression `0b00011011' taken as 0
sha1-x86_64.s:1395:suffix or operands invalid for `pshufd'
sha1-x86_64.s:1396:missing or invalid immediate expression `0b00011011' taken as 0
sha1-x86_64.s:1396:suffix or operands invalid for `pshufd'
make[2]: *** [sha1-x86_64.o] Error 1
make[2]: Leaving directory `/opt/local/var/macports/build/_opt_local_var_macports_sources_rsync.macports.org_release_tarballs_ports_devel_openssl/openssl/work/openssl-1.0.2g/crypto/sha'
make[1]: *** [subdirs] Error 1
make[1]: Leaving directory `/opt/local/var/macports/build/_opt_local_var_macports_sources_rsync.macports.org_release_tarballs_ports_devel_openssl/openssl/work/openssl-1.0.2g/crypto'
make: *** [build_crypto] Error 1
make: Leaving directory `/opt/local/var/macports/build/_opt_local_var_macports_sources_rsync.macports.org_release_tarballs_ports_devel_openssl/openssl/work/openssl-1.0.2g'
Command failed: cd "/opt/local/var/macports/build/_opt_local_var_macports_sources_rsync.macports.org_release_tarballs_ports_devel_openssl/openssl/work/openssl-1.0.2g" && /usr/bin/make -w all
Exit code: 2
Error: org.macports.build for port openssl returned: command execution failed
Warning: targets not executed for openssl: org.macports.install org.macports.build org.macports.destroot
Please see the log file for port openssl for details:
/opt/local/var/macports/logs/_opt_local_var_macports_sources_rsync.macports.org_release_tarballs_ports_devel_openssl/openssl/main.log
Error: Unable to upgrade port: 1
Attachments (1)
Change History (4)
Changed 11 years ago by chillin-
| Attachment: | openssl.main.log added |
|---|
comment:1 Changed 11 years ago by mojca (Mojca Miklavec)
| Cc: | cal@… mojca@… added |
|---|---|
| Keywords: | openssl removed |
| Owner: | changed from macports-tickets@… to larryv@… |
| Version: | 2.3.4 |
comment:2 Changed 11 years ago by chillin-
Dupe!
Looks to be the same as report 50771. Please close or delete, thank you. Sorry!
comment:3 Changed 11 years ago by mojca (Mojca Miklavec)
| Resolution: | → duplicate |
|---|---|
| Status: | new → closed |
I'm sorry. I actually checked the list, but I didn't notice the other ticket because it was on top of the list as a high priority one (and the top of the list usually contains tickets that are 6 years old or so).
Note: See
TracTickets for help on using
tickets.

main.log