Opened 17 months ago

Last modified 17 months ago

#51567 new defect

avr-libc @1.8.1: avr-gcc: error: missing argument to ‘-mmcu=’

Reported by: feilipu (Phillip Stevens) Owned by: macports-tickets@…
Priority: Normal Milestone:
Component: ports Version: 2.3.4
Keywords: tiger Cc:
Port: avr-libc

Description

Mac G4 DA OSX 10.4 Xcode 2.5

Error: org.macports.build for port avr-libc returned: command execution failed
Error: Processing of port avr-libc failed

mcu=avr2 -D__COMPILING_AVR_LIBC__ -mcall-prologues -Os  -Os -fno-jump-tables -DS
CANF_LEVEL=SCANF_STD -c -o vfscanf_std.o ../../../libc/stdio/vfscanf.c
:info:build avr-gcc -DHAVE_CONFIG_H -I. -I../../.. -I../../../common -I../../../
include -I../../../include -I/opt/local/include -Wall -W -Wstrict-prototypes -D_
_COMPILING_AVR_LIBC__ -mcall-prologues -Os -x assembler-with-cpp -D__COMPILING_A
VR_LIBC__ -c -o eerd_block_at90s1200.o  \
:info:build     -mmcu=          \
:info:build     ../../../libc/misc/eerd_block.S
:info:build avr-gcc: error: missing argument to <E2><80><98>-mmcu=<E2><80><99>
:info:build make[5]: *** [eerd_block_at90s1200.o] Error 1
:info:build make[5]: Leaving directory `/opt/local/var/macports/build/_opt_local
_var_macports_sources_rsync.macports.org_release_tarballs_ports_cross_avr-libc/a
vr-libc/work/avr-libc-1.8.1/avr/lib/avr2'

build log attached

Attachments (1)

avr-libc_build.log (223.9 KB) - added by feilipu (Phillip Stevens) 17 months ago.
avr-libc build log

Download all attachments as: .zip

Change History (2)

Changed 17 months ago by feilipu (Phillip Stevens)

avr-libc build log

comment:1 Changed 17 months ago by ryandesign (Ryan Schmidt)

  • Keywords tiger added
  • Port avr-libc added
  • Summary changed from avr-libc 1.8.1 failed to build on 10.4 to avr-libc @1.8.1: avr-gcc: error: missing argument to ‘-mmcu=’
Note: See TracTickets for help on using tickets.