Opened 14 years ago

Closed 14 years ago

#5377 closed defect (fixed)

BUG: samba 3.0.20 fails to build

Reported by: ben@… Owned by: mww@…
Priority: Normal Milestone:
Component: ports Version: 1.0
Keywords: Cc:
Port:

Description

Darwin assam 8.2.0 Darwin Kernel Version 8.2.0: Fri Jun 24 17:46:54 PDT 2005; root:xnu-792.2.4.obj~3/RELEASE_PPC Power Macintosh powerpc

version: samba3 3.0.20, net/samba3 (Variants: darwin_8)

DarwinPorts base version 1.102 installed

Complete build log attached: tail is: Compiling lib/readline.c lib/readline.c: In function 'smb_readline': lib/readline.c:108: error: 'rl_event_hook' undeclared (first use in this function) lib/readline.c:108: error: (Each undeclared identifier is reported only once lib/readline.c:108: error: for each function it appears in.) lib/readline.c: In function 'cmd_history': lib/readline.c:150: warning: assignment makes pointer from integer without a cast make: * [lib/readline.o] Error 1

Attachments (1)

tmp2 (55.0 KB) - added by ben@… 14 years ago.
build log

Download all attachments as: .zip

Change History (2)

Changed 14 years ago by ben@…

Attachment: tmp2 added

build log

comment:1 Changed 14 years ago by mww@…

Resolution: fixed
Status: newclosed

I suppose the addition of --without-readline fixed that? (please re-open if this aint the case)

Note: See TracTickets for help on using tickets.