Opened 3 years ago

Closed 3 years ago

#54664 closed defect (fixed)

db48 @4.8.30_4 compilation failure with clang-3.9 on 10.6.8

Reported by: ballapete (Peter Dyballa) Owned by: jmroot (Joshua Root)
Priority: Normal Milestone:
Component: ports Version:
Keywords: snowleopard Cc:
Port: db48

Description

In #54646 I startet to have trouble with upgrading subversion. After deactivating and removing both db46 and 48 port decided to install db48 again:

oot 292 /\ port -n upgrade --force db_select
--->  Computing dependencies for db_select
--->  Fetching distfiles for db_select
--->  Verifying checksums for db_select
--->  Extracting db_select
--->  Configuring db_select
--->  Building db_select
--->  Staging db_select into destroot
--->  Deactivating db_select @0.1_3
--->  Cleaning db_select
--->  Uninstalling db_select @0.1_3
--->  Cleaning db_select
--->  Computing dependencies for db_select
--->  Installing db_select @0.1_3
--->  Activating db_select @0.1_3
--->  Cleaning db_select
--->  Updating database of binaries
--->  Scanning binaries for linking errors
--->  Found 24 broken files, matching files to ports
--->  Found 5 broken ports, determining rebuild order
You can always run 'port rev-upgrade' again to fix errors.
The following ports will be rebuilt:
 python27 @2.7.13
 apr-util @1.6.0
 serf1 @1.3.8
 subversion @1.9.6+tools+unicode_path
 openldap @2.4.45
Continue? [Y/n]: Y
--->  Computing dependencies for db48
--->  Fetching distfiles for db48
--->  Attempting to fetch db-4.8.30.tar.gz from https://distfiles.macports.org/db48
--->  Verifying checksums for db48
--->  Extracting db48
--->  Applying patches to db48
--->  Configuring db48
--->  Building db48
Error: Failed to build db48: command execution failed
Error: See /opt/local/var/macports/logs/_opt_local_var_macports_sources_nue.de.rsync.macports.org_macports_release_tarballs_ports_databases_db48/db48/main.log for details.
Error: Problem while installing db48
Error: rev-upgrade failed: Error rebuilding python27
Error: Follow https://guide.macports.org/#project.tickets to report a bug.

The error is:

:info:build libtool: compile:  /opt/local/bin/clang++-mp-3.9 -stdlib=libc++ -c -I. -I../dist/.. -I/opt/local/include -I/System/Library/Frameworks/JavaVM.framework/Versions/Current/Headers -pipe -Os -stdlib=libc++ -arch x86_64 ../dist/../cxx/cxx_db.cpp  -fno-common -DPIC -o .libs/cxx_db.o
:info:build libtool: compile:  /opt/local/bin/clang++-mp-3.9 -stdlib=libc++ -c -I. -I../dist/.. -I/opt/local/include -I/System/Library/Frameworks/JavaVM.framework/Versions/Current/Headers -pipe -Os -stdlib=libc++ -arch x86_64 ../dist/../cxx/cxx_dbc.cpp  -fno-common -DPIC -o .libs/cxx_dbc.o
:info:build libtool: compile:  /opt/local/bin/clang-mp-3.9 -c -I. -I../dist/.. -I/opt/local/include -I/System/Library/Frameworks/JavaVM.framework/Versions/Current/Headers -pipe -Os -arch x86_64 ../dist/../txn/txn_stat.c -o txn_stat.o >/dev/null 2>&1
:info:build libtool: compile:  /opt/local/bin/clang++-mp-3.9 -stdlib=libc++ -c -I. -I../dist/.. -I/opt/local/include -I/System/Library/Frameworks/JavaVM.framework/Versions/Current/Headers -pipe -Os -stdlib=libc++ -arch x86_64 ../dist/../cxx/cxx_dbt.cpp  -fno-common -DPIC -o .libs/cxx_dbt.o
:info:build ./libtool --mode=compile /opt/local/bin/clang++-mp-3.9 -stdlib=libc++ -c -I. -I../dist/.. -I/opt/local/include -I/System/Library/Frameworks/JavaVM.framework/Versions/Current/Headers -pipe -Os -stdlib=libc++ -arch x86_64 ../dist/../cxx/cxx_env.cpp
:info:build libtool: compile:  /opt/local/bin/clang-mp-3.9 -c -I. -I../dist/.. -I/opt/local/include -I/System/Library/Frameworks/JavaVM.framework/Versions/Current/Headers -pipe -Os -arch x86_64 ../dist/../common/zerofill.c -o zerofill.o >/dev/null 2>&1
:info:build libtool: compile:  /opt/local/bin/clang++-mp-3.9 -stdlib=libc++ -c -I. -I../dist/.. -I/opt/local/include -I/System/Library/Frameworks/JavaVM.framework/Versions/Current/Headers -pipe -Os -stdlib=libc++ -arch x86_64 ../dist/../cxx/cxx_env.cpp  -fno-common -DPIC -o .libs/cxx_env.o
:info:build ./libtool --mode=compile /opt/local/bin/clang++-mp-3.9 -stdlib=libc++ -c -I. -I../dist/.. -I/opt/local/include -I/System/Library/Frameworks/JavaVM.framework/Versions/Current/Headers -pipe -Os -stdlib=libc++ -arch x86_64 ../dist/../cxx/cxx_except.cpp
:info:build libtool: compile:  /opt/local/bin/clang-mp-3.9 -c -I. -I../dist/.. -I/opt/local/include -I/System/Library/Frameworks/JavaVM.framework/Versions/Current/Headers -pipe -Os -arch x86_64 ../dist/../txn/txn_util.c -o txn_util.o >/dev/null 2>&1
:info:build libtool: compile:  /opt/local/bin/clang++-mp-3.9 -stdlib=libc++ -c -I. -I../dist/.. -I/opt/local/include -I/System/Library/Frameworks/JavaVM.framework/Versions/Current/Headers -pipe -Os -stdlib=libc++ -arch x86_64 ../dist/../cxx/cxx_except.cpp  -fno-common -DPIC -o .libs/cxx_except.o
:info:build ./libtool --mode=compile /opt/local/bin/clang++-mp-3.9 -stdlib=libc++ -c -I. -I../dist/.. -I/opt/local/include -I/System/Library/Frameworks/JavaVM.framework/Versions/Current/Headers -pipe -Os -stdlib=libc++ -arch x86_64 ../dist/../cxx/cxx_lock.cpp
:info:build In file included from ../dist/../cxx/cxx_db.cpp:13In file included from ../dist/../cxx/cxx_dbc.cpp:13:
:info:build In file included from ./db_cxx.h:55:
:info:build In file included from ../dist/../cxx/cxx_dbt.cpp:13:
:info:build In file included from ./db_cxx.h:55:
:info:build In file included from /opt/local/libexec/llvm-3.9/bin/../include/c++/v1/iostream:38:
:info:build In file included from /opt/local/libexec/llvm-3.9/bin/../include/c++/v1/ios:216:
:info:build In file included from /opt/local/libexec/llvm-3.9/bin/../include/c++/v1/__locale:15:
:info:build In file included from /opt/local/libexec/llvm-3.9/bin/../include/c++/v1/string:442:
:info:build In file included from /opt/local/libexec/llvm-3.9/bin/../include/c++/v1/algorithm:634:
:info:build In file included from /opt/local/libexec/llvm-3.9/bin/../include/c++/v1/memory:618:
:info:build /opt/local/libexec/llvm-3.9/bin/../include/c++/v1/atomic:1148:13: error: expected unqualified-id
:info:build atomic_init(volatile atomic<_Tp>* __o, _Tp __d) _NOEXCEPT
:info:build             ^
:info:build /opt/local/libexec/llvm-3.9/bin/../include/c++/v1/atomic:1148:13: error: expected ')'
:info:build /opt/local/libexec/llvm-3.9/bin/../include/c++/v1/atomic:1148:1: note: to match this '('
:info:build atomic_init(volatile atomic<_Tp>* __o, _Tp __d) _NOEXCEPT
:info:build ^
:info:build ../dist/../dbinc/atomic.h:73:30: note: expanded from macro 'atomic_init'
:info:build #define atomic_init(p, val)     ((p)->value = (val))
:info:build                                  ^
:info:build In file included from ../dist/../cxx/cxx_dbt.cpp:13:
:info:build In file included from ./db_cxx.h:55:
:info:build In file included from /opt/local/libexec/llvm-3.9/bin/../include/c++/v1/iostream:38:
:info:build In file included from /opt/local/libexec/llvm-3.9/bin/../include/c++/v1/ios:216:
:info:build In file included from /opt/local/libexec/llvm-3.9/bin/../include/c++/v1/__locale:15:
:info:build In file included from /opt/local/libexec/llvm-3.9/bin/../include/c++/v1/string:442:
:info:build In file included from /opt/local/libexec/llvm-3.9/bin/../include/c++/v1/algorithm:634:
:info:build In file included from /opt/local/libexec/llvm-3.9/bin/../include/c++/v1/memory:618:
:info:build /opt/local/libexec/llvm-3.9/bin/../include/c++/v1/atomic:1148:1: error: expected ')'
:info:build atomic_init(volatile atomic<_Tp>* __o, _Tp __d) _NOEXCEPT
:info:build ^
:info:build ../dist/../dbinc/atomic.h:73:33: note: expanded from macro 'atomic_init'
:info:build #define atomic_init(p, val)     ((p)->value = (val))
:info:build                                     ^
:info:build /opt/local/libexec/llvm-3.9/bin/../include/c++/v1/atomic:1148:1: note: to match this '('
:info:build ../dist/../dbinc/atomic.h:73:29: note: expanded from macro 'atomic_init'
:info:build #define atomic_init(p, val)     ((p)->value = (val))
:info:build                                 ^
:info:build :
:info:build In file included from ./db_cxx.h:55:
:info:build In file included from /opt/local/libexec/llvm-3.9/bin/../include/c++/v1/iostream:38:
:info:build In file included from /opt/local/libexec/llvm-3.9/bin/../include/c++/v1/ios:216:
:info:build In file included from /opt/local/libexec/llvm-3.9/bin/../include/c++/v1/__locale:15:
:info:build In file included from /opt/local/libexec/llvm-3.9/bin/../include/c++/v1/string:442:
:info:build In file included from /opt/local/libexec/llvm-3.9/bin/../include/c++/v1/algorithm:634:
:info:build In file included from /opt/local/libexec/llvm-3.9/bin/../include/c++/v1/memory:618:
:info:build /opt/local/libexec/llvm-3.9/bin/../include/c++/v1/atomic:1148:13: error: expected unqualified-id
:info:build atomic_init(volatile atomic<_Tp>* __o, _Tp __d) _NOEXCEPT
:info:build             ^
:info:build /opt/local/libexec/llvm-3.9/bin/../include/c++/v1/atomic:1148:13: error: expected ')'
:info:build /opt/local/libexec/llvm-3.9/bin/../include/c++/v1/atomic:1148:1: note: to match this '('
:info:build atomic_init(volatile atomic<_Tp>* __o, _Tp __d) _NOEXCEPT
:info:build ^
:info:build ../dist/../dbinc/atomic.h:73:30: note: expanded from macro 'atomic_init'
:info:build #define atomic_init(p, val)     ((p)->value = (val))
:info:build                                  ^
:info:build In file included from ../dist/../cxx/cxx_db.cpp:13:
:info:build In file included from ./db_cxx.h:55:
:info:build In file included from /opt/local/libexec/llvm-3.9/bin/../include/c++/v1/iostream:38:
:info:build In file included from /opt/local/libexec/llvm-3.9/bin/../include/c++/v1/ios:216:
:info:build In file included from /opt/local/libexec/llvm-3.9/bin/../include/c++/v1/__locale:15:
:info:build In file included from /opt/local/libexec/llvm-3.9/bin/../include/c++/v1/string:442:
:info:build In file included from /opt/local/libexec/llvm-3.9/bin/../include/c++/v1/algorithm:634:
:info:build In file included from /opt/local/libexec/llvm-3.9/bin/../include/c++/v1/memory:618:
:info:build /opt/local/libexec/llvm-3.9/bin/../include/c++/v1/atomic:1148:1: error: expected ')'
:info:build atomic_init(volatile atomic<_Tp>* __o, _Tp __d) _NOEXCEPT
:info:build ^
:info:build ../dist/../dbinc/atomic.h:73:33: note: expanded from macro 'atomic_init'
:info:build #define atomic_init(p, val)     ((p)->value = (val))
:info:build                                     ^
:info:build /opt/local/libexec/llvm-3.9/bin/../include/c++/v1/atomic:1148:1: note: to match this '('
:info:build ../dist/../dbinc/atomic.h:73:29: note: expanded from macro 'atomic_init'
:info:build #define atomic_init(p, val)     ((p)->value = (val))
:info:build                                 ^
:info:build In file included from /opt/local/libexec/llvm-3.9/bin/../include/c++/v1/iostream:38:
:info:build In file included from /opt/local/libexec/llvm-3.9/bin/../include/c++/v1/ios:216:
:info:build In file included from /opt/local/libexec/llvm-3.9/bin/../include/c++/v1/__locale:15:
:info:build In file included from /opt/local/libexec/llvm-3.9/bin/../include/c++/v1/string:442:
:info:build In file included from /opt/local/libexec/llvm-3.9/bin/../include/c++/v1/algorithm:634:
:info:build In file included from /opt/local/libexec/llvm-3.9/bin/../include/c++/v1/memory:618:
:info:build /opt/local/libexec/llvm-3.9/bin/../include/c++/v1/atomic:1148:13: error: expected unqualified-id
:info:build atomic_init(volatile atomic<_Tp>* __o, _Tp __d) _NOEXCEPT
:info:build             ^
:info:build /opt/local/libexec/llvm-3.9/bin/../include/c++/v1/atomic:1148:13: error: expected ')'
:info:build /opt/local/libexec/llvm-3.9/bin/../include/c++/v1/atomic:1148:1: note: to match this '('
:info:build atomic_init(volatile atomic<_Tp>* __o, _Tp __d) _NOEXCEPT
:info:build ^
:info:build ../dist/../dbinc/atomic.h:73:30: note: expanded from macro 'atomic_init'
:info:build #define atomic_init(p, val)     ((p)->value = (val))
:info:build                                  ^
:info:build In file included from ../dist/../cxx/cxx_dbc.cpp:13:
:info:build In file included from ./db_cxx.h:55:
:info:build In file included from /opt/local/libexec/llvm-3.9/bin/../include/c++/v1/iostream:38:
:info:build In file included from /opt/local/libexec/llvm-3.9/bin/../include/c++/v1/ios:216:
:info:build In file included from /opt/local/libexec/llvm-3.9/bin/../include/c++/v1/__locale:15:
:info:build In file included from /opt/local/libexec/llvm-3.9/bin/../include/c++/v1/string:442:
:info:build In file included from /opt/local/libexec/llvm-3.9/bin/../include/c++/v1/algorithm:634:
:info:build In file included from /opt/local/libexec/llvm-3.9/bin/../include/c++/v1/memory:618:
:info:build /opt/local/libexec/llvm-3.9/bin/../include/c++/v1/atomic:1148:1: error: expected ')'
:info:build atomic_init(volatile atomic<_Tp>* __o, _Tp __d) _NOEXCEPT
:info:build ^
:info:build ../dist/../dbinc/atomic.h:73:33: note: expanded from macro 'atomic_init'
:info:build #define atomic_init(p, val)     ((p)->value = (val))
:info:build                                     ^
:info:build /opt/local/libexec/llvm-3.9/bin/../include/c++/v1/atomic:1148:1: note: to match this '('
:info:build ../dist/../dbinc/atomic.h:73:29: note: expanded from macro 'atomic_init'
:info:build #define atomic_init(p, val)     ((p)->value = (val))
:info:build                                 ^
:info:build In file included from ../dist/../cxx/cxx_db.cpp:13:
:info:build In file included from ./db_cxx.h:55:
:info:build In file included from /opt/local/libexec/llvm-3.9/bin/../include/c++/v1/iostream:38:
:info:build In file included from /opt/local/libexec/llvm-3.9/bin/../include/c++/v1/ios:216:
:info:build In file included from /opt/local/libexec/llvm-3.9/bin/../include/c++/v1/__locale:15:
:info:build In file included from /opt/local/libexec/llvm-3.9/bin/../include/c++/v1/string:442:
:info:build In file included from /opt/local/libexec/llvm-3.9/bin/../include/c++/v1/algorithm:634:
:info:build In file included from /opt/local/libexec/llvm-3.9/bin/../include/c++/v1/memory:618:
:info:build /opt/local/libexec/llvm-3.9/bin/../include/c++/v1/atomic:1717:35: error: unknown type name 'atomic_flag'
:info:build atomic_flag_test_and_set(volatile atomic_flag* __o) _NOEXCEPT
:info:build In file included from ../dist/../cxx/cxx_dbc.cpp:                                  ^
:info:build 13:
:info:build In file included from ./db_cxx.h:55:
:info:build In file included from /opt/local/libexec/llvm-3.9/bin/../include/c++/v1/iostream:38:
:info:build In file included from /opt/local/libexec/llvm-3.9/bin/../include/c++/v1/ios:216:
:info:build In file included from /opt/local/libexec/llvm-3.9/bin/../include/c++/v1/__locale:15:
:info:build In file included from /opt/local/libexec/llvm-3.9/bin/../include/c++/v1/string:442:
:info:build In file included from /opt/local/libexec/llvm-3.9/bin/../include/c++/v1/algorithm:634:
:info:build In file included from /opt/local/libexec/llvm-3.9/bin/../include/c++/v1/memory:618:
:info:build /opt/local/libexec/llvm-3.9/bin/../include/c++/v1/atomic:1717:35: error: unknown type name 'atomic_flag'
:info:build atomic_flag_test_and_set(volatile atomic_flag* __o) _NOEXCEPT
:info:build                                   ^
:info:build In file included from ../dist/../cxx/cxx_env.cpp:13:
:info:build In file included from ./db_cxx.h:55:
:info:build In file included from /opt/local/libexec/llvm-3.9/bin/../include/c++/v1/iostream:38:
:info:build In file included from /opt/local/libexec/llvm-3.9/bin/../include/c++/v1/ios:216:
:info:build In file included from /opt/local/libexec/llvm-3.9/bin/../include/c++/v1/__locale:15:
:info:build In file included from /opt/local/libexec/llvm-3.9/bin/../include/c++/v1/string:442:
:info:build In file included from /opt/local/libexec/llvm-3.9/bin/../include/c++/v1/algorithm:634:
:info:build In file included from /opt/local/libexec/llvm-3.9/bin/../include/c++/v1/memory:618:
:info:build /opt/local/libexec/llvm-3.9/bin/../include/c++/v1/atomic:1148:13: error: expected unqualified-id
:info:build atomic_init(volatile atomic<_Tp>* __o, _Tp __d) _NOEXCEPT
:info:build             ^
:info:build /opt/local/libexec/llvm-3.9/bin/../include/c++/v1/atomic:In file included from ../dist/../cxx/cxx_dbt.cpp:1148:13: 13:
:info:build In file included from error: expected ')'
:info:build /opt/local/libexec/llvm-3.9/bin/../include/c++/v1/atomic:1148:1: note: to match this '('
:info:build atomic_init(volatile atomic<_Tp>* __o, _Tp __d) _NOEXCEPT
:info:build ^
:info:build ../dist/../dbinc/atomic.h:73:30: note: expanded from macro 'atomic_init'
:info:build #define atomic_init(p, val)     ((p)->value = (val))
:info:build                                  ^
:info:build In file included from ../dist/../cxx/cxx_env.cpp:13:
:info:build In file included from ./db_cxx.h:55:
:info:build In file included from /opt/local/libexec/llvm-3.9/bin/../include/c++/v1/iostream:38:
:info:build In file included from /opt/local/libexec/llvm-3.9/bin/../include/c++/v1/ios:216:
:info:build In file included from /opt/local/libexec/llvm-3.9/bin/../include/c++/v1/__locale:15:
:info:build In file included from /opt/local/libexec/llvm-3.9/bin/../include/c++/v1/string:442:
:info:build In file included from /opt/local/libexec/llvm-3.9/bin/../include/c++/v1/algorithm:634:
:info:build In file included from /opt/local/libexec/llvm-3.9/bin/../include/c++/v1/memory:618:
:info:build /opt/local/libexec/llvm-3.9/bin/../include/c++/v1/atomic:1148:1: error: expected ')'
:info:build atomic_init(volatile atomic<_Tp>* __o, _Tp __d) _NOEXCEPT
:info:build ^
:info:build ../dist/../dbinc/atomic.h:73:33: note: expanded from macro 'atomic_init'
:info:build #define atomic_init(p, val)     ((p)->value = (val))
:info:build                                     ^
:info:build /opt/local/libexec/llvm-3.9/bin/../include/c++/v1/atomic:1148:1: note: to match this '('
:info:build ../dist/../dbinc/atomic.h:73:29: note: expanded from macro 'atomic_init'
:info:build #define atomic_init(p, val)     ((p)->value = (val))
:info:build                                 ^
:info:build ./db_cxx.h:55:
:info:build In file included from /opt/local/libexec/llvm-3.9/bin/../include/c++/v1/iostream:38:
:info:build In file included from /opt/local/libexec/llvm-3.9/bin/../include/c++/v1/ios:216:
:info:build In file included from /opt/local/libexec/llvm-3.9/bin/../include/c++/v1/__locale:15:
:info:build In file included from /opt/local/libexec/llvm-3.9/bin/../include/c++/v1/string:442:
:info:build In file included from /opt/local/libexec/llvm-3.9/bin/../include/c++/v1/algorithm:634:
:info:build In file included from /opt/local/libexec/llvm-3.9/bin/../include/c++/v1/memory:618:
:info:build /opt/local/libexec/llvm-3.9/bin/../include/c++/v1/atomic:1717:35: error: unknown type name 'atomic_flag'
:info:build atomic_flag_test_and_set(volatile atomic_flag* __o) _NOEXCEPT
:info:build                                   ^
:info:build /opt/local/libexec/llvm-3.9/bin/../include/c++/v1/atomic:1724:26: error: unknown type name 'atomic_flag'
:info:build atomic_flag_test_and_set(atomic_flag* __o) _NOEXCEPT
:info:build                          ^
:info:build /opt/local/libexec/llvm-3.9/bin/../include/c++/v1/atomic:1724:26: error: unknown type name 'atomic_flag'
:info:build atomic_flag_test_and_set(atomic_flag* __o) _NOEXCEPT
:info:build                          ^
:info:build In file included from ../dist/../cxx/cxx_env.cpp:13:
:info:build In file included from ./db_cxx.h:55:
:info:build In file included from /opt/local/libexec/llvm-3.9/bin/../include/c++/v1/iostream:38:
:info:build In file included from /opt/local/libexec/llvm-3.9/bin/../include/c++/v1/ios:216:
:info:build In file included from /opt/local/libexec/llvm-3.9/bin/../include/c++/v1/__locale:15:
:info:build In file included from /opt/local/libexec/llvm-3.9/bin/../include/c++/v1/string:442:
:info:build In file included from /opt/local/libexec/llvm-3.9/bin/../include/c++/v1/algorithm:634:
:info:build In file included from /opt/local/libexec/llvm-3.9/bin/../include/c++/v1/memory:618:
:info:build /opt/local/libexec/llvm-3.9/bin/../include/c++/v1/atomic:1717:35: error: /opt/local/libexec/llvm-3.9/bin/../include/c++/v1/atomic:1724:26: error: unknown type name 'atomic_flag'
:info:build atomic_flag_test_and_set(atomic_flag* __o) _NOEXCEPT
:info:build                          ^
:info:build /opt/local/libexec/llvm-3.9/bin/../include/c++/v1/atomic:1731:44: error: unknown type name 'atomic_flag'
:info:build atomic_flag_test_and_set_explicit(volatile atomic_flag* __o, memory_order __m) _NOEXCEPT
:info:build                                            ^
:info:build unknown type name 'atomic_flag'
:info:build atomic_flag_test_and_set(volatile atomic_flag* __o) _NOEXCEPT
:info:build                                   ^
:info:build /opt/local/libexec/llvm-3.9/bin/../include/c++/v1/atomic:1731:44: error: unknown type name 'atomic_flag'
:info:build atomic_flag_test_and_set_explicit(volatile atomic_flag* __o, memory_order __m) _NOEXCEPT
:info:build                                            ^
:info:build /opt/local/libexec/llvm-3.9/bin/../include/c++/v1/atomic:1738:35: error: unknown type name 'atomic_flag'
:info:build atomic_flag_test_and_set_explicit(atomic_flag* __o, memory_order __m) _NOEXCEPT
:info:build                                   ^
:info:build /opt/local/libexec/llvm-3.9/bin/../include/c++/v1/atomic:1731:44: error: unknown type name 'atomic_flag'
:info:build atomic_flag_test_and_set_explicit(volatile atomic_flag* __o, memory_order __m) _NOEXCEPT
:info:build                                            ^
:info:build /opt/local/libexec/llvm-3.9/bin/../include/c++/v1/atomic:1724:26: error: unknown type name 'atomic_flag'
:info:build atomic_flag_test_and_set(atomic_flag* __o) _NOEXCEPT
:info:build                          ^
:info:build /opt/local/libexec/llvm-3.9/bin/../include/c++/v1/atomic:1738:35:/opt/local/libexec/llvm-3.9/bin/../include/c++/v1/atomic error: unknown type name 'atomic_flag':1745:
:info:build 28atomic_flag_test_and_set_explicit(atomic_flag* __o, memory_order __m) _NOEXCEPT
:info:build                                   ^
:info:build : error: unknown type name 'atomic_flag'
:info:build atomic_flag_clear(volatile atomic_flag* __o) _NOEXCEPT
:info:build                            ^
:info:build /opt/local/libexec/llvm-3.9/bin/../include/c++/v1/atomic:1738:35: error: unknown type name 'atomic_flag'
:info:build atomic_flag_test_and_set_explicit(atomic_flag* __o, memory_order __m) _NOEXCEPT
:info:build                                   ^
:info:build /opt/local/libexec/llvm-3.9/bin/../include/c++/v1/atomic:1731:44: error: unknown type name 'atomic_flag'
:info:build atomic_flag_test_and_set_explicit(volatile atomic_flag* __o, memory_order __m) _NOEXCEPT
:info:build                                            ^
:info:build /opt/local/libexec/llvm-3.9/bin/../include/c++/v1/atomic:1745:28: error: unknown type name 'atomic_flag'
:info:build atomic_flag_clear(volatile atomic_flag* __o) _NOEXCEPT
:info:build                            ^
:info:build /opt/local/libexec/llvm-3.9/bin/../include/c++/v1/atomic:1752:19: error: unknown type name 'atomic_flag'
:info:build /opt/local/libexec/llvm-3.9/bin/../include/c++/v1/atomic:1745:28: error: unknown type name 'atomic_flag'
:info:build atomic_flag_clear(volatile atomic_flag* __o) _NOEXCEPT
:info:build                            ^
:info:build atomic_flag_clear(atomic_flag* __o) _NOEXCEPT
:info:build                   ^
:info:build /opt/local/libexec/llvm-3.9/bin/../include/c++/v1/atomic:1738:35: error: unknown type name 'atomic_flag'
:info:build atomic_flag_test_and_set_explicit(atomic_flag* __o, memory_order __m) _NOEXCEPT
:info:build                                   ^
:info:build /opt/local/libexec/llvm-3.9/bin/../include/c++/v1/atomic:1752:19: error: unknown type name 'atomic_flag'
:info:build atomic_flag_clear(atomic_flag* __o) _NOEXCEPT
:info:build                   ^
:info:build /opt/local/libexec/llvm-3.9/bin/../include/c++/v1/atomic:1752:19: error: unknown type name 'atomic_flag'
:info:build atomic_flag_clear(atomic_flag* __o) _NOEXCEPT
:info:build                   ^
:info:build /opt/local/libexec/llvm-3.9/bin/../include/c++/v1/atomic:1759:37: error: unknown type name 'atomic_flag'
:info:build atomic_flag_clear_explicit(volatile atomic_flag* __o, memory_order __m) _NOEXCEPT
:info:build                                     ^
:info:build /opt/local/libexec/llvm-3.9/bin/../include/c++/v1/atomic:1745:28: error: unknown type name 'atomic_flag'
:info:build atomic_flag_clear(volatile atomic_flag* __o) _NOEXCEPT
:info:build                            ^
:info:build /opt/local/libexec/llvm-3.9/bin/../include/c++/v1/atomic:1759:37: error: unknown type name 'atomic_flag'
:info:build atomic_flag_clear_explicit(volatile atomic_flag* __o, memory_order __m) _NOEXCEPT
:info:build                                     ^
:info:build libtool: compile:  /opt/local/bin/clang++-mp-3.9 -stdlib=libc++ -c -I. -I../dist/.. -I/opt/local/include -I/System/Library/Frameworks/JavaVM.framework/Versions/Current/Headers -pipe -Os -stdlib=libc++ -arch x86_64 ../dist/../cxx/cxx_lock.cpp  -fno-common -DPIC -o .libs/cxx_lock.o
:info:build /opt/local/libexec/llvm-3.9/bin/../include/c++/v1/atomic:1759:37: error: unknown type name 'atomic_flag'
:info:build atomic_flag_clear_explicit(volatile atomic_flag* __o, memory_order __m) _NOEXCEPT
:info:build                                     ^
:info:build /opt/local/libexec/llvm-3.9/bin/../include/c++/v1/atomic:1766:28: error: unknown type name 'atomic_flag'
:info:build atomic_flag_clear_explicit(atomic_flag* __o, memory_order __m) _NOEXCEPT
:info:build                            ^
:info:build /opt/local/libexec/llvm-3.9/bin/../include/c++/v1/atomic:1752:19: error: unknown type name 'atomic_flag'
:info:build atomic_flag_clear(atomic_flag* __o) _NOEXCEPT
:info:build                   ^
:info:build /opt/local/libexec/llvm-3.9/bin/../include/c++/v1/atomic:1766:28: error: unknown type name 'atomic_flag'
:info:build atomic_flag_clear_explicit(atomic_flag* __o, memory_order __m) _NOEXCEPT
:info:build                            ^
:info:build /opt/local/libexec/llvm-3.9/bin/../include/c++/v1/atomic:1759:37: error: unknown type name 'atomic_flag'
:info:build atomic_flag_clear_explicit(volatile atomic_flag* __o, memory_order __m) _NOEXCEPT
:info:build                                     ^
:info:build /opt/local/libexec/llvm-3.9/bin/../include/c++/v1/atomic:1766:28: error: unknown type name 'atomic_flag'
:info:build atomic_flag_clear_explicit(atomic_flag* __o, memory_order __m) _NOEXCEPT
:info:build                            ^
:info:build /opt/local/libexec/llvm-3.9/bin/../include/c++/v1/atomic:1766:28: error: unknown type name 'atomic_flag'
:info:build atomic_flag_clear_explicit(atomic_flag* __o, memory_order __m) _NOEXCEPT
:info:build                            ^
:info:build ./libtool --mode=compile /opt/local/bin/clang++-mp-3.9 -stdlib=libc++ -c -I. -I../dist/.. -I/opt/local/include -I/System/Library/Frameworks/JavaVM.framework/Versions/Current/Headers -pipe -Os -stdlib=libc++ -arch x86_64 ../dist/../cxx/cxx_logc.cpp
:info:build libtool: compile:  /opt/local/bin/clang++-mp-3.9 -stdlib=libc++ -c -I. -I../dist/.. -I/opt/local/include -I/System/Library/Frameworks/JavaVM.framework/Versions/Current/Headers -pipe -Os -stdlib=libc++ -arch x86_64 ../dist/../cxx/cxx_logc.cpp  -fno-common -DPIC -o .libs/cxx_logc.o
:info:build In file included from ../dist/../cxx/cxx_except.cpp:13:
:info:build In file included from ./db_cxx.h:55:
:info:build In file included from /opt/local/libexec/llvm-3.9/bin/../include/c++/v1/iostream:38:
:info:build In file included from /opt/local/libexec/llvm-3.9/bin/../include/c++/v1/ios:216:
:info:build In file included from /opt/local/libexec/llvm-3.9/bin/../include/c++/v1/__locale:15:
:info:build In file included from /opt/local/libexec/llvm-3.9/bin/../include/c++/v1/string:442:
:info:build In file included from /opt/local/libexec/llvm-3.9/bin/../include/c++/v1/algorithm:634:
:info:build In file included from /opt/local/libexec/llvm-3.9/bin/../include/c++/v1/memory:618:
:info:build /opt/local/libexec/llvm-3.9/bin/../include/c++/v1/atomic:1148:13: error: expected unqualified-id
:info:build atomic_init(volatile atomic<_Tp>* __o, _Tp __d) _NOEXCEPT
:info:build             ^
:info:build /opt/local/libexec/llvm-3.9/bin/../include/c++/v1/atomic:1148:13: error: expected ')'
:info:build /opt/local/libexec/llvm-3.9/bin/../include/c++/v1/atomic:1148:1: note: to match this '('
:info:build atomic_init(volatile atomic<_Tp>* __o, _Tp __d) _NOEXCEPT
:info:build ^
:info:build ../dist/../dbinc/atomic.h:73:30: note: expanded from macro 'atomic_init'
:info:build #define atomic_init(p, val)     ((p)->value = (val))
:info:build                                  ^
:info:build In file included from ../dist/../cxx/cxx_except.cpp:13:
:info:build In file included from ./db_cxx.h:55:
:info:build In file included from /opt/local/libexec/llvm-3.9/bin/../include/c++/v1/iostream:38:
:info:build In file included from /opt/local/libexec/llvm-3.9/bin/../include/c++/v1/ios:216:
:info:build In file included from /opt/local/libexec/llvm-3.9/bin/../include/c++/v1/__locale:15:
:info:build In file included from /opt/local/libexec/llvm-3.9/bin/../include/c++/v1/string:442:
:info:build In file included from /opt/local/libexec/llvm-3.9/bin/../include/c++/v1/algorithm:634:
:info:build In file included from /opt/local/libexec/llvm-3.9/bin/../include/c++/v1/memory:618:
:info:build /opt/local/libexec/llvm-3.9/bin/../include/c++/v1/atomic:1148:1: error: expected ')'
:info:build atomic_init(volatile atomic<_Tp>* __o, _Tp __d) _NOEXCEPT
:info:build ^
:info:build ../dist/../dbinc/atomic.h:73:33: note: expanded from macro 'atomic_init'
:info:build #define atomic_init(p, val)     ((p)->value = (val))
:info:build                                     ^
:info:build /opt/local/libexec/llvm-3.9/bin/../include/c++/v1/atomic:1148:1: note: to match this '('
:info:build ../dist/../dbinc/atomic.h:73:29: note: expanded from macro 'atomic_init'
:info:build #define atomic_init(p, val)     ((p)->value = (val))
:info:build                                 ^
:info:build ./libtool --mode=compile /opt/local/bin/clang++-mp-3.9 -stdlib=libc++ -c -I. -I../dist/.. -I/opt/local/include -I/System/Library/Frameworks/JavaVM.framework/Versions/Current/Headers -pipe -Os -stdlib=libc++ -arch x86_64 ../dist/../cxx/cxx_mpool.cpp
:info:build In file included from ../dist/../cxx/cxx_except.cpp:13:
:info:build In file included from ./db_cxx.h:55:
:info:build In file included from /opt/local/libexec/llvm-3.9/bin/../include/c++/v1/iostream:38:
:info:build In file included from /opt/local/libexec/llvm-3.9/bin/../include/c++/v1/ios:216:
:info:build In file included from /opt/local/libexec/llvm-3.9/bin/../include/c++/v1/__locale:15:
:info:build In file included from /opt/local/libexec/llvm-3.9/bin/../include/c++/v1/string:442:
:info:build In file included from /opt/local/libexec/llvm-3.9/bin/../include/c++/v1/algorithm:634:
:info:build In file included from /opt/local/libexec/llvm-3.9/bin/../include/c++/v1/memory:618:
:info:build /opt/local/libexec/llvm-3.9/bin/../include/c++/v1/atomic:1717:35: error: unknown type name 'atomic_flag'
:info:build atomic_flag_test_and_set(volatile atomic_flag* __o) _NOEXCEPT
:info:build                                   ^
:info:build /opt/local/libexec/llvm-3.9/bin/../include/c++/v1/atomic:1724:26: error: unknown type name 'atomic_flag'
:info:build atomic_flag_test_and_set(atomic_flag* __o) _NOEXCEPT
:info:build                          ^
:info:build /opt/local/libexec/llvm-3.9/bin/../include/c++/v1/atomic:1731:44: error: unknown type name 'atomic_flag'
:info:build atomic_flag_test_and_set_explicit(volatile atomic_flag* __o, memory_order __m) _NOEXCEPT
:info:build                                            ^
:info:build /opt/local/libexec/llvm-3.9/bin/../include/c++/v1/atomic:1738:35: error: unknown type name 'atomic_flag'
:info:build atomic_flag_test_and_set_explicit(atomic_flag* __o, memory_order __m) _NOEXCEPT
:info:build                                   ^
:info:build /opt/local/libexec/llvm-3.9/bin/../include/c++/v1/atomic:1745:28: error: unknown type name 'atomic_flag'
:info:build atomic_flag_clear(volatile atomic_flag* __o) _NOEXCEPT
:info:build                            ^
:info:build /opt/local/libexec/llvm-3.9/bin/../include/c++/v1/atomic:1752:19: error: unknown type name 'atomic_flag'
:info:build atomic_flag_clear(atomic_flag* __o) _NOEXCEPT
:info:build                   ^
:info:build /opt/local/libexec/llvm-3.9/bin/../include/c++/v1/atomic:1759:37: error: unknown type name 'atomic_flag'
:info:build atomic_flag_clear_explicit(volatile atomic_flag* __o, memory_order __m) _NOEXCEPT
:info:build                                     ^
:info:build /opt/local/libexec/llvm-3.9/bin/../include/c++/v1/atomic:1766:28: error: unknown type name 'atomic_flag'
:info:build atomic_flag_clear_explicit(atomic_flag* __o, memory_order __m) _NOEXCEPT
:info:build                            ^
:info:build libtool: compile:  /opt/local/bin/clang++-mp-3.9 -stdlib=libc++ -c -I. -I../dist/.. -I/opt/local/include -I/System/Library/Frameworks/JavaVM.framework/Versions/Current/Headers -pipe -Os -stdlib=libc++ -arch x86_64 ../dist/../cxx/cxx_mpool.cpp  -fno-common -DPIC -o .libs/cxx_mpool.o
:info:build In file included from ../dist/../cxx/cxx_lock.cpp:13:
:info:build In file included from ./db_cxx.h:55:
:info:build In file included from /opt/local/libexec/llvm-3.9/bin/../include/c++/v1/iostream:38:
:info:build In file included from /opt/local/libexec/llvm-3.9/bin/../include/c++/v1/ios:216:
:info:build In file included from /opt/local/libexec/llvm-3.9/bin/../include/c++/v1/__locale:15:
:info:build In file included from /opt/local/libexec/llvm-3.9/bin/../include/c++/v1/string:442:
:info:build In file included from /opt/local/libexec/llvm-3.9/bin/../include/c++/v1/algorithm:634:
:info:build In file included from /opt/local/libexec/llvm-3.9/bin/../include/c++/v1/memory:618:
:info:build /opt/local/libexec/llvm-3.9/bin/../include/c++/v1/atomic:1148:13: error: expected unqualified-id
:info:build atomic_init(volatile atomic<_Tp>* __o, _Tp __d) _NOEXCEPT
:info:build             ^
:info:build /opt/local/libexec/llvm-3.9/bin/../include/c++/v1/atomic:1148:13: error: expected ')'
:info:build /opt/local/libexec/llvm-3.9/bin/../include/c++/v1/atomic:1148:1: note: to match this '('
:info:build atomic_init(volatile atomic<_Tp>* __o, _Tp __d) _NOEXCEPT
:info:build ^
:info:build ../dist/../dbinc/atomic.h:73:30: note: expanded from macro 'atomic_init'
:info:build #define atomic_init(p, val)     ((p)->value = (val))
:info:build                                  ^
:info:build In file included from ../dist/../cxx/cxx_lock.cpp:13:
:info:build In file included from ./db_cxx.h:55:
:info:build In file included from /opt/local/libexec/llvm-3.9/bin/../include/c++/v1/iostream:38:
:info:build In file included from /opt/local/libexec/llvm-3.9/bin/../include/c++/v1/ios:216:
:info:build In file included from /opt/local/libexec/llvm-3.9/bin/../include/c++/v1/__locale:15:
:info:build In file included from /opt/local/libexec/llvm-3.9/bin/../include/c++/v1/string:442:
:info:build In file included from /opt/local/libexec/llvm-3.9/bin/../include/c++/v1/algorithm:634:
:info:build In file included from /opt/local/libexec/llvm-3.9/bin/../include/c++/v1/memory:618:
:info:build /opt/local/libexec/llvm-3.9/bin/../include/c++/v1/atomic:1148:1: error: expected ')'
:info:build atomic_init(volatile atomic<_Tp>* __o, _Tp __d) _NOEXCEPT
:info:build ^
:info:build ../dist/../dbinc/atomic.h:73:33: note: expanded from macro 'atomic_init'
:info:build #define atomic_init(p, val)     ((p)->value = (val))
:info:build                                     ^
:info:build /opt/local/libexec/llvm-3.9/bin/../include/c++/v1/atomic:1148:1: note: to match this '('
:info:build ../dist/../dbinc/atomic.h:73:29: note: expanded from macro 'atomic_init'
:info:build #define atomic_init(p, val)     ((p)->value = (val))
:info:build                                 ^
:info:build In file included from ../dist/../cxx/cxx_lock.cpp:13:
:info:build In file included from ./db_cxx.h:55:
:info:build In file included from /opt/local/libexec/llvm-3.9/bin/../include/c++/v1/iostream:38:
:info:build In file included from /opt/local/libexec/llvm-3.9/bin/../include/c++/v1/ios:216:
:info:build In file included from /opt/local/libexec/llvm-3.9/bin/../include/c++/v1/__locale:15:
:info:build In file included from /opt/local/libexec/llvm-3.9/bin/../include/c++/v1/string:442:
:info:build In file included from /opt/local/libexec/llvm-3.9/bin/../include/c++/v1/algorithm:634:
:info:build In file included from /opt/local/libexec/llvm-3.9/bin/../include/c++/v1/memory:618:
:info:build /opt/local/libexec/llvm-3.9/bin/../include/c++/v1/atomic:1717:35: error: unknown type name 'atomic_flag'
:info:build atomic_flag_test_and_set(volatile atomic_flag* __o) _NOEXCEPT
:info:build                                   ^
:info:build /opt/local/libexec/llvm-3.9/bin/../include/c++/v1/atomic:1724:26: error: unknown type name 'atomic_flag'
:info:build atomic_flag_test_and_set(atomic_flag* __o) _NOEXCEPT
:info:build                          ^
:info:build /opt/local/libexec/llvm-3.9/bin/../include/c++/v1/atomic:1731:44: error: unknown type name 'atomic_flag'
:info:build atomic_flag_test_and_set_explicit(volatile atomic_flag* __o, memory_order __m) _NOEXCEPT
:info:build                                            ^
:info:build /opt/local/libexec/llvm-3.9/bin/../include/c++/v1/atomic:1738:35: error: unknown type name 'atomic_flag'
:info:build atomic_flag_test_and_set_explicit(atomic_flag* __o, memory_order __m) _NOEXCEPT
:info:build                                   ^
:info:build /opt/local/libexec/llvm-3.9/bin/../include/c++/v1/atomic:1745:28: error: unknown type name 'atomic_flag'
:info:build atomic_flag_clear(volatile atomic_flag* __o) _NOEXCEPT
:info:build                            ^
:info:build /opt/local/libexec/llvm-3.9/bin/../include/c++/v1/atomic:1752:19: error: unknown type name 'atomic_flag'
:info:build atomic_flag_clear(atomic_flag* __o) _NOEXCEPT
:info:build                   ^
:info:build /opt/local/libexec/llvm-3.9/bin/../include/c++/v1/atomic:1759:37: error: unknown type name 'atomic_flag'
:info:build atomic_flag_clear_explicit(volatile atomic_flag* __o, memory_order __m) _NOEXCEPT
:info:build                                     ^
:info:build /opt/local/libexec/llvm-3.9/bin/../include/c++/v1/atomic:1766:28: error: unknown type name 'atomic_flag'
:info:build atomic_flag_clear_explicit(atomic_flag* __o, memory_order __m) _NOEXCEPT
:info:build                            ^
:info:build In file included from ../dist/../cxx/cxx_logc.cpp:13:
:info:build In file included from ./db_cxx.h:55:
:info:build In file included from /opt/local/libexec/llvm-3.9/bin/../include/c++/v1/iostream:38:
:info:build In file included from /opt/local/libexec/llvm-3.9/bin/../include/c++/v1/ios:216:
:info:build In file included from /opt/local/libexec/llvm-3.9/bin/../include/c++/v1/__locale:15:
:info:build In file included from /opt/local/libexec/llvm-3.9/bin/../include/c++/v1/string:442:
:info:build In file included from /opt/local/libexec/llvm-3.9/bin/../include/c++/v1/algorithm:634:
:info:build In file included from /opt/local/libexec/llvm-3.9/bin/../include/c++/v1/memory:618:
:info:build /opt/local/libexec/llvm-3.9/bin/../include/c++/v1/atomic:1148:13: error: expected unqualified-id
:info:build atomic_init(volatile atomic<_Tp>* __o, _Tp __d) _NOEXCEPT
:info:build             ^
:info:build /opt/local/libexec/llvm-3.9/bin/../include/c++/v1/atomic:1148:13: error: expected ')'
:info:build /opt/local/libexec/llvm-3.9/bin/../include/c++/v1/atomic:1148:1: note: to match this '('
:info:build atomic_init(volatile atomic<_Tp>* __o, _Tp __d) _NOEXCEPT
:info:build ^
:info:build ../dist/../dbinc/atomic.h:73:30: note: expanded from macro 'atomic_init'
:info:build #define atomic_init(p, val)     ((p)->value = (val))
:info:build                                  ^
:info:build In file included from ../dist/../cxx/cxx_logc.cpp:13:
:info:build In file included from ./db_cxx.h:55:
:info:build In file included from /opt/local/libexec/llvm-3.9/bin/../include/c++/v1/iostream:38:
:info:build In file included from /opt/local/libexec/llvm-3.9/bin/../include/c++/v1/ios:216:
:info:build In file included from /opt/local/libexec/llvm-3.9/bin/../include/c++/v1/__locale:15:
:info:build In file included from /opt/local/libexec/llvm-3.9/bin/../include/c++/v1/string:442:
:info:build In file included from /opt/local/libexec/llvm-3.9/bin/../include/c++/v1/algorithm:634:
:info:build In file included from /opt/local/libexec/llvm-3.9/bin/../include/c++/v1/memory:618:
:info:build /opt/local/libexec/llvm-3.9/bin/../include/c++/v1/atomic:1148:1: error: expected ')'
:info:build atomic_init(volatile atomic<_Tp>* __o, _Tp __d) _NOEXCEPT
:info:build ^
:info:build ../dist/../dbinc/atomic.h:73:33: note: expanded from macro 'atomic_init'
:info:build #define atomic_init(p, val)     ((p)->value = (val))
:info:build                                     ^
:info:build /opt/local/libexec/llvm-3.9/bin/../include/c++/v1/atomic:1148:1: note: to match this '('
:info:build ../dist/../dbinc/atomic.h:73:29: note: expanded from macro 'atomic_init'
:info:build #define atomic_init(p, val)     ((p)->value = (val))
:info:build                                 ^
:info:build In file included from ../dist/../cxx/cxx_logc.cpp:13:
:info:build In file included from ./db_cxx.h:55:
:info:build In file included from /opt/local/libexec/llvm-3.9/bin/../include/c++/v1/iostream:38:
:info:build In file included from /opt/local/libexec/llvm-3.9/bin/../include/c++/v1/ios:216:
:info:build In file included from /opt/local/libexec/llvm-3.9/bin/../include/c++/v1/__locale:15:
:info:build In file included from /opt/local/libexec/llvm-3.9/bin/../include/c++/v1/string:442:
:info:build In file included from /opt/local/libexec/llvm-3.9/bin/../include/c++/v1/algorithm:634:
:info:build In file included from /opt/local/libexec/llvm-3.9/bin/../include/c++/v1/memory:618:
:info:build /opt/local/libexec/llvm-3.9/bin/../include/c++/v1/atomic:1717:35: error: unknown type name 'atomic_flag'
:info:build atomic_flag_test_and_set(volatile atomic_flag* __o) _NOEXCEPT
:info:build                                   ^
:info:build /opt/local/libexec/llvm-3.9/bin/../include/c++/v1/atomic:1724:26: error: unknown type name 'atomic_flag'
:info:build atomic_flag_test_and_set(atomic_flag* __o) _NOEXCEPT
:info:build                          ^
:info:build /opt/local/libexec/llvm-3.9/bin/../include/c++/v1/atomic:1731:44: error: unknown type name 'atomic_flag'
:info:build atomic_flag_test_and_set_explicit(volatile atomic_flag* __o, memory_order __m) _NOEXCEPT
:info:build                                            ^
:info:build /opt/local/libexec/llvm-3.9/bin/../include/c++/v1/atomic:1738:35: error: unknown type name 'atomic_flag'
:info:build atomic_flag_test_and_set_explicit(atomic_flag* __o, memory_order __m) _NOEXCEPT
:info:build                                   ^
:info:build /opt/local/libexec/llvm-3.9/bin/../include/c++/v1/atomic:1745:28: error: unknown type name 'atomic_flag'
:info:build atomic_flag_clear(volatile atomic_flag* __o) _NOEXCEPT
:info:build                            ^
:info:build /opt/local/libexec/llvm-3.9/bin/../include/c++/v1/atomic:1752:19: error: unknown type name 'atomic_flag'
:info:build atomic_flag_clear(atomic_flag* __o) _NOEXCEPT
:info:build                   ^
:info:build /opt/local/libexec/llvm-3.9/bin/../include/c++/v1/atomic:1759:37: error: unknown type name 'atomic_flag'
:info:build atomic_flag_clear_explicit(volatile atomic_flag* __o, memory_order __m) _NOEXCEPT
:info:build                                     ^
:info:build /opt/local/libexec/llvm-3.9/bin/../include/c++/v1/atomic:1766:28: error: unknown type name 'atomic_flag'
:info:build atomic_flag_clear_explicit(atomic_flag* __o, memory_order __m) _NOEXCEPT
:info:build                            ^
:info:build In file included from ../dist/../cxx/cxx_mpool.cpp:13:
:info:build In file included from ./db_cxx.h:55:
:info:build In file included from /opt/local/libexec/llvm-3.9/bin/../include/c++/v1/iostream:38:
:info:build In file included from /opt/local/libexec/llvm-3.9/bin/../include/c++/v1/ios:216:
:info:build In file included from /opt/local/libexec/llvm-3.9/bin/../include/c++/v1/__locale:15:
:info:build In file included from /opt/local/libexec/llvm-3.9/bin/../include/c++/v1/string:442:
:info:build In file included from /opt/local/libexec/llvm-3.9/bin/../include/c++/v1/algorithm:634:
:info:build In file included from /opt/local/libexec/llvm-3.9/bin/../include/c++/v1/memory:618:
:info:build /opt/local/libexec/llvm-3.9/bin/../include/c++/v1/atomic:1148:13: error: expected unqualified-id
:info:build atomic_init(volatile atomic<_Tp>* __o, _Tp __d) _NOEXCEPT
:info:build             ^
:info:build /opt/local/libexec/llvm-3.9/bin/../include/c++/v1/atomic:1148:13: error: expected ')'
:info:build /opt/local/libexec/llvm-3.9/bin/../include/c++/v1/atomic:1148:1: note: to match this '('
:info:build atomic_init(volatile atomic<_Tp>* __o, _Tp __d) _NOEXCEPT
:info:build ^
:info:build ../dist/../dbinc/atomic.h:73:30: note: expanded from macro 'atomic_init'
:info:build #define atomic_init(p, val)     ((p)->value = (val))
:info:build                                  ^
:info:build In file included from ../dist/../cxx/cxx_mpool.cpp:13:
:info:build In file included from ./db_cxx.h:55:
:info:build In file included from /opt/local/libexec/llvm-3.9/bin/../include/c++/v1/iostream:38:
:info:build In file included from /opt/local/libexec/llvm-3.9/bin/../include/c++/v1/ios:216:
:info:build In file included from /opt/local/libexec/llvm-3.9/bin/../include/c++/v1/__locale:15:
:info:build In file included from /opt/local/libexec/llvm-3.9/bin/../include/c++/v1/string:442:
:info:build In file included from /opt/local/libexec/llvm-3.9/bin/../include/c++/v1/algorithm:634:
:info:build In file included from /opt/local/libexec/llvm-3.9/bin/../include/c++/v1/memory:618:
:info:build /opt/local/libexec/llvm-3.9/bin/../include/c++/v1/atomic:1148:1: error: expected ')'
:info:build atomic_init(volatile atomic<_Tp>* __o, _Tp __d) _NOEXCEPT
:info:build ^
:info:build ../dist/../dbinc/atomic.h:73:33: note: expanded from macro 'atomic_init'
:info:build #define atomic_init(p, val)     ((p)->value = (val))
:info:build                                     ^
:info:build /opt/local/libexec/llvm-3.9/bin/../include/c++/v1/atomic:1148:1: note: to match this '('
:info:build ../dist/../dbinc/atomic.h:73:29: note: expanded from macro 'atomic_init'
:info:build #define atomic_init(p, val)     ((p)->value = (val))
:info:build                                 ^
:info:build In file included from ../dist/../cxx/cxx_mpool.cpp:13:
:info:build In file included from ./db_cxx.h:55:
:info:build In file included from /opt/local/libexec/llvm-3.9/bin/../include/c++/v1/iostream:38:
:info:build In file included from /opt/local/libexec/llvm-3.9/bin/../include/c++/v1/ios:216:
:info:build In file included from /opt/local/libexec/llvm-3.9/bin/../include/c++/v1/__locale:15:
:info:build In file included from /opt/local/libexec/llvm-3.9/bin/../include/c++/v1/string:442:
:info:build In file included from /opt/local/libexec/llvm-3.9/bin/../include/c++/v1/algorithm:634:
:info:build In file included from /opt/local/libexec/llvm-3.9/bin/../include/c++/v1/memory:618:
:info:build /opt/local/libexec/llvm-3.9/bin/../include/c++/v1/atomic:1717:35: error: unknown type name 'atomic_flag'
:info:build atomic_flag_test_and_set(volatile atomic_flag* __o) _NOEXCEPT
:info:build                                   ^
:info:build /opt/local/libexec/llvm-3.9/bin/../include/c++/v1/atomic:1724:26: error: unknown type name 'atomic_flag'
:info:build atomic_flag_test_and_set(atomic_flag* __o) _NOEXCEPT
:info:build                          ^
:info:build /opt/local/libexec/llvm-3.9/bin/../include/c++/v1/atomic:1731:44: error: unknown type name 'atomic_flag'
:info:build atomic_flag_test_and_set_explicit(volatile atomic_flag* __o, memory_order __m) _NOEXCEPT
:info:build                                            ^
:info:build /opt/local/libexec/llvm-3.9/bin/../include/c++/v1/atomic:1738:35: error: unknown type name 'atomic_flag'
:info:build atomic_flag_test_and_set_explicit(atomic_flag* __o, memory_order __m) _NOEXCEPT
:info:build                                   ^
:info:build /opt/local/libexec/llvm-3.9/bin/../include/c++/v1/atomic:1745:28: error: unknown type name 'atomic_flag'
:info:build atomic_flag_clear(volatile atomic_flag* __o) _NOEXCEPT
:info:build                            ^
:info:build /opt/local/libexec/llvm-3.9/bin/../include/c++/v1/atomic:1752:19: error: unknown type name 'atomic_flag'
:info:build atomic_flag_clear(atomic_flag* __o) _NOEXCEPT
:info:build                   ^
:info:build /opt/local/libexec/llvm-3.9/bin/../include/c++/v1/atomic:1759:37: error: unknown type name 'atomic_flag'
:info:build atomic_flag_clear_explicit(volatile atomic_flag* __o, memory_order __m) _NOEXCEPT
:info:build                                     ^
:info:build /opt/local/libexec/llvm-3.9/bin/../include/c++/v1/atomic:1766:28: error: unknown type name 'atomic_flag'
:info:build atomic_flag_clear_explicit(atomic_flag* __o, memory_order __m) _NOEXCEPT
:info:build                            ^
:info:build 11 errors generated.
:info:build make: *** [cxx_dbc.lo] Error 1
:info:build make: *** Waiting for unfinished jobs....
:info:build 11 errors generated.
:info:build make: *** [cxx_dbt.lo] Error 1
:info:build 11 errors generated.
:info:build make: *** [cxx_except.lo] Error 1
:info:build 11 errors generated.
:info:build make: *** [cxx_db.lo] Error 1
:info:build 11 errors generated.
:info:build make: *** [cxx_env.lo] Error 1
:info:build 11 errors generated.
:info:build make: *** [cxx_lock.lo] Error 1
:info:build 11 errors generated.
:info:build make: *** [cxx_logc.lo] Error 1
:info:build 11 errors generated.
:info:build make: *** [cxx_mpool.lo] Error 1
:info:build make: Leaving directory `/opt/local/var/macports/build/_opt_local_var_macports_sources_nue.de.rsync.macports.org_macports_release_tarballs_ports_databases_db48/db48/work/db-4.8.30/build_unix'

Attachments (1)

main.log (240.8 KB) - added by ballapete (Peter Dyballa) 3 years ago.

Download all attachments as: .zip

Change History (7)

Changed 3 years ago by ballapete (Peter Dyballa)

Attachment: main.log added

comment:1 Changed 3 years ago by mf2k (Frank Schima)

Cc: jmr@… removed
Owner: set to jmroot
Status: newassigned

comment:2 Changed 3 years ago by jmroot (Joshua Root)

Summary: db @4.8.30_4 does not build again on Snow Leopard, Mac OS X 10.6.8, because "error: expected unqualified-id"db48 @4.8.30_4 compilation failure with clang-3.9 on 10.6.8

So you've apparently configured macports to use clang-3.9. This builds fine with a standard configuration.

comment:3 Changed 3 years ago by kencu (Ken)

Peter has MacPorts set up with LibcxxOnOlderSystems, and the default compiler is now set to clang-3.9 with that configuration. I have the exact same setup, and db48 is installed.... but I can't build it with clang-3.9 just now either. Clang-3.8 also won't build it....

But sure enough, macports-clang-3.7 does build it without any trouble.

I must have built it when my default compiler was set differently.

So - Peter - looks like you can build it with clang-3.7. For the portfile, we'll need to try a couple of other systems, and then blacklist clang-3.8, clang-3.9, and whatever else turns out not to work.

comment:4 in reply to:  3 Changed 3 years ago by ballapete (Peter Dyballa)

Replying to kencu:

Peter has MacPorts set up with LibcxxOnOlderSystems, and the default compiler is now set to clang-3.9 with that configuration. I have the exact same setup, and db48 is installed.... but I can't build it with clang-3.9 just now either. Clang-3.8 also won't build it....

But sure enough, macports-clang-3.7 does build it without any trouble.

Here too db48 built with configure.compiler=macports-clang-3.7.

I must have built db48 last time with LibcxxOnOlderSystems active…

comment:5 Changed 3 years ago by kencu (Ken)

noted this is essentially a duplicate of 53577, but that ticket applies to db60.

comment:6 Changed 3 years ago by kencu (Ken)

Resolution: fixed
Status: assignedclosed
Note: See TracTickets for help on using tickets.