Opened 5 years ago

Closed 5 years ago

Last modified 5 years ago

#54774 closed defect (fixed)

mc @4.8.19: error: no member named 'st_atim' in 'struct stat'

Reported by: H3ik0 Owned by: mkae (Marko Käning)
Priority: Normal Milestone:
Component: ports Version:
Keywords: highsierra Cc: vovinacci (Volodymyr 'vovin' Shcherbinin), v-g-ustinov (Vladimir Ustinov), maehne (Torsten Maehne)
Port: mc

Description

version:1
:debug:main epoch: in tree: 0 installed: 0
:debug:main xz 5.2.3_0 exists in the ports tree
:debug:main xz 5.2.3_0  is the latest installed
:debug:main xz 5.2.3_0  is active
:debug:main Merging existing variants '' into variants
:debug:main new fully merged portvariants: 
:debug:main Changing to port directory: /opt/local/var/macports/sources/rsync.macports.org/macports/release/tarballs/ports/archivers/xz
:debug:main OS darwin/17.0.0 (Mac OS X 10.13) arch i386
:debug:main adding the default universal variant
:debug:main Reading variant descriptions from /opt/local/var/macports/sources/rsync.macports.org/macports/release/tarballs/ports/_resources/port1.0/variant_descriptions.conf
:debug:main Running callback portconfigure::add_automatic_compiler_dependencies
:debug:main Finished running callback portconfigure::add_automatic_compiler_dependencies
:debug:main Running callback portbuild::add_automatic_buildsystem_dependencies
:debug:main Finished running callback portbuild::add_automatic_buildsystem_dependencies
:debug:main No need to upgrade! xz 5.2.3_0 >= xz 5.2.3_0
:debug:main epoch: in tree: 0 installed: 0
:debug:main libiconv 1.15_0 exists in the ports tree
:debug:main libiconv 1.15_0  is the latest installed
:debug:main libiconv 1.15_0  is active
:debug:main Merging existing variants '' into variants
:debug:main new fully merged portvariants: 
:debug:main Changing to port directory: /opt/local/var/macports/sources/rsync.macports.org/macports/release/tarballs/ports/textproc/libiconv
:debug:main OS darwin/17.0.0 (Mac OS X 10.13) arch i386
:debug:main Reading variant descriptions from /opt/local/var/macports/sources/rsync.macports.org/macports/release/tarballs/ports/_resources/port1.0/variant_descriptions.conf
:debug:main Sourcing PortGroup muniversal 1.0 from /opt/local/var/macports/sources/rsync.macports.org/macports/release/tarballs/ports/_resources/port1.0/group/muniversal-1.0.tcl
:debug:main universal variant already exists, so not adding the default one
:debug:main Running callback portconfigure::add_automatic_compiler_dependencies
:debug:main Finished running callback portconfigure::add_automatic_compiler_dependencies
:debug:main Running callback portbuild::add_automatic_buildsystem_dependencies
:debug:main Finished running callback portbuild::add_automatic_buildsystem_dependencies
:debug:main No need to upgrade! libiconv 1.15_0 >= libiconv 1.15_0
:debug:main epoch: in tree: 2 installed: 2
:debug:main gettext 0.19.8.1_0 exists in the ports tree
:debug:main gettext 0.19.8.1_0  is the latest installed
:debug:main gettext 0.19.8.1_0  is active
:debug:main Merging existing variants '' into variants
:debug:main new fully merged portvariants: 
:debug:main Changing to port directory: /opt/local/var/macports/sources/rsync.macports.org/macports/release/tarballs/ports/devel/gettext
:debug:main OS darwin/17.0.0 (Mac OS X 10.13) arch i386
:debug:main Sourcing PortGroup compiler_blacklist_versions 1.0 from /opt/local/var/macports/sources/rsync.macports.org/macports/release/tarballs/ports/_resources/port1.0/group/compiler_blacklist_versions-1.0.tcl
:debug:main Reading variant descriptions from /opt/local/var/macports/sources/rsync.macports.org/macports/release/tarballs/ports/_resources/port1.0/variant_descriptions.conf
:debug:main Sourcing PortGroup muniversal 1.0 from /opt/local/var/macports/sources/rsync.macports.org/macports/release/tarballs/ports/_resources/port1.0/group/muniversal-1.0.tcl
:debug:main compiler clang 802.0.42 not blacklisted because it doesn't match {clang < 211.10.1}
:debug:main universal variant already exists, so not adding the default one
:debug:main Running callback portconfigure::add_automatic_compiler_dependencies
:debug:main Finished running callback portconfigure::add_automatic_compiler_dependencies
:debug:main Running callback portbuild::add_automatic_buildsystem_dependencies
:debug:main Finished running callback portbuild::add_automatic_buildsystem_dependencies
:debug:main No need to upgrade! gettext 0.19.8.1_0 >= gettext 0.19.8.1_0
:debug:main epoch: in tree: 0 installed: 0
:debug:main expat 2.2.4_0 exists in the ports tree
:debug:main expat 2.2.4_0  is the latest installed
:debug:main expat 2.2.4_0  is active
:debug:main Merging existing variants '' into variants
:debug:main new fully merged portvariants: 
:debug:main Changing to port directory: /opt/local/var/macports/sources/rsync.macports.org/macports/release/tarballs/ports/textproc/expat
:debug:main OS darwin/17.0.0 (Mac OS X 10.13) arch i386
:debug:main adding the default universal variant
:debug:main Reading variant descriptions from /opt/local/var/macports/sources/rsync.macports.org/macports/release/tarballs/ports/_resources/port1.0/variant_descriptions.conf
:debug:main Running callback portconfigure::add_automatic_compiler_dependencies
:debug:main Finished running callback portconfigure::add_automatic_compiler_dependencies
:debug:main Running callback portbuild::add_automatic_buildsystem_dependencies
:debug:main Finished running callback portbuild::add_automatic_buildsystem_dependencies
:debug:main No need to upgrade! expat 2.2.4_0 >= expat 2.2.4_0
:debug:main epoch: in tree: 0 installed: 0
:debug:main ncurses 6.0-20170708_0 exists in the ports tree
:debug:main ncurses 6.0-20170708_0  is the latest installed
:debug:main ncurses 6.0-20170708_0  is active
:debug:main Merging existing variants '' into variants
:debug:main new fully merged portvariants: 
:debug:main Changing to port directory: /opt/local/var/macports/sources/rsync.macports.org/macports/release/tarballs/ports/devel/ncurses
:debug:main OS darwin/17.0.0 (Mac OS X 10.13) arch i386
:debug:main adding the default universal variant
:debug:main Reading variant descriptions from /opt/local/var/macports/sources/rsync.macports.org/macports/release/tarballs/ports/_resources/port1.0/variant_descriptions.conf
:debug:main Running callback portconfigure::add_automatic_compiler_dependencies
:debug:main Finished running callback portconfigure::add_automatic_compiler_dependencies
:debug:main Running callback portbuild::add_automatic_buildsystem_dependencies
:debug:main Finished running callback portbuild::add_automatic_buildsystem_dependencies
:debug:main No need to upgrade! ncurses 6.0-20170708_0 >= ncurses 6.0-20170708_0
:debug:main epoch: in tree: 0 installed: 0
:debug:main pkgconfig 0.29.2_0 exists in the ports tree
:debug:main pkgconfig 0.29.2_0  is the latest installed
:debug:main pkgconfig 0.29.2_0  is active
:debug:main Merging existing variants '' into variants
:debug:main new fully merged portvariants: 
:debug:main Changing to port directory: /opt/local/var/macports/sources/rsync.macports.org/macports/release/tarballs/ports/devel/pkgconfig
:debug:main OS darwin/17.0.0 (Mac OS X 10.13) arch i386
:debug:main adding the default universal variant
:debug:main Reading variant descriptions from /opt/local/var/macports/sources/rsync.macports.org/macports/release/tarballs/ports/_resources/port1.0/variant_descriptions.conf
:debug:main Running callback portconfigure::add_automatic_compiler_dependencies
:debug:main Finished running callback portconfigure::add_automatic_compiler_dependencies
:debug:main Running callback portbuild::add_automatic_buildsystem_dependencies
:debug:main Finished running callback portbuild::add_automatic_buildsystem_dependencies
:debug:main No need to upgrade! pkgconfig 0.29.2_0 >= pkgconfig 0.29.2_0
:debug:main epoch: in tree: 0 installed: 0
:debug:main glib2 2.52.3_0 exists in the ports tree
:debug:main glib2 2.52.3_0 +x11 is the latest installed
:debug:main glib2 2.52.3_0 +x11 is active
:debug:main Merging existing variants '+x11' into variants
:debug:main new fully merged portvariants: x11 +
:debug:main Changing to port directory: /opt/local/var/macports/sources/rsync.macports.org/macports/release/tarballs/ports/devel/glib2
:debug:main OS darwin/17.0.0 (Mac OS X 10.13) arch i386
:debug:main Sourcing PortGroup compiler_blacklist_versions 1.0 from /opt/local/var/macports/sources/rsync.macports.org/macports/release/tarballs/ports/_resources/port1.0/group/compiler_blacklist_versions-1.0.tcl
:debug:main compiler clang 802.0.42 not blacklisted because it doesn't match {clang < 600}
:debug:main Reading variant descriptions from /opt/local/var/macports/sources/rsync.macports.org/macports/release/tarballs/ports/_resources/port1.0/variant_descriptions.conf
:debug:main adding the default universal variant
:debug:main Executing variant x11 provides x11
:debug:main Running callback portconfigure::add_automatic_compiler_dependencies
:debug:main Finished running callback portconfigure::add_automatic_compiler_dependencies
:debug:main Running callback portbuild::add_automatic_buildsystem_dependencies
:debug:main Finished running callback portbuild::add_automatic_buildsystem_dependencies
:debug:main No need to upgrade! glib2 2.52.3_0 >= glib2 2.52.3_0
:debug:main epoch: in tree: 0 installed: 0
:debug:main libffi 3.2.1_0 exists in the ports tree
:debug:main libffi 3.2.1_0  is the latest installed
:debug:main libffi 3.2.1_0  is active
:debug:main Merging existing variants '' into variants
:debug:main new fully merged portvariants: 
:debug:main Changing to port directory: /opt/local/var/macports/sources/rsync.macports.org/macports/release/tarballs/ports/devel/libffi
:debug:main OS darwin/17.0.0 (Mac OS X 10.13) arch i386
:debug:main Reading variant descriptions from /opt/local/var/macports/sources/rsync.macports.org/macports/release/tarballs/ports/_resources/port1.0/variant_descriptions.conf
:debug:main Sourcing PortGroup muniversal 1.0 from /opt/local/var/macports/sources/rsync.macports.org/macports/release/tarballs/ports/_resources/port1.0/group/muniversal-1.0.tcl
:debug:main universal variant already exists, so not adding the default one
:debug:main Running callback portconfigure::add_automatic_compiler_dependencies
:debug:main Finished running callback portconfigure::add_automatic_compiler_dependencies
:debug:main Running callback portbuild::add_automatic_buildsystem_dependencies
:debug:main Finished running callback portbuild::add_automatic_buildsystem_dependencies
:debug:main No need to upgrade! libffi 3.2.1_0 >= libffi 3.2.1_0
:debug:main epoch: in tree: 0 installed: 0
:debug:main pcre 8.41_0 exists in the ports tree
:debug:main pcre 8.41_0  is the latest installed
:debug:main pcre 8.41_0  is active
:debug:main Merging existing variants '' into variants
:debug:main new fully merged portvariants: 
:debug:main Changing to port directory: /opt/local/var/macports/sources/rsync.macports.org/macports/release/tarballs/ports/devel/pcre
:debug:main OS darwin/17.0.0 (Mac OS X 10.13) arch i386
:debug:main adding the default universal variant
:debug:main Reading variant descriptions from /opt/local/var/macports/sources/rsync.macports.org/macports/release/tarballs/ports/_resources/port1.0/variant_descriptions.conf
:debug:main Running callback portconfigure::add_automatic_compiler_dependencies
:debug:main Finished running callback portconfigure::add_automatic_compiler_dependencies
:debug:main Running callback portbuild::add_automatic_buildsystem_dependencies
:debug:main Finished running callback portbuild::add_automatic_buildsystem_dependencies
:debug:main No need to upgrade! pcre 8.41_0 >= pcre 8.41_0
:debug:main epoch: in tree: 0 installed: 0
:debug:main bzip2 1.0.6_0 exists in the ports tree
:debug:main bzip2 1.0.6_0  is the latest installed
:debug:main bzip2 1.0.6_0  is active
:debug:main Merging existing variants '' into variants
:debug:main new fully merged portvariants: 
:debug:main Changing to port directory: /opt/local/var/macports/sources/rsync.macports.org/macports/release/tarballs/ports/archivers/bzip2
:debug:main OS darwin/17.0.0 (Mac OS X 10.13) arch i386
:debug:main Reading variant descriptions from /opt/local/var/macports/sources/rsync.macports.org/macports/release/tarballs/ports/_resources/port1.0/variant_descriptions.conf
:debug:main universal variant already exists, so not adding the default one
:debug:main Running callback portconfigure::add_automatic_compiler_dependencies
:debug:main Finished running callback portconfigure::add_automatic_compiler_dependencies
:debug:main Running callback portbuild::add_automatic_buildsystem_dependencies
:debug:main Finished running callback portbuild::add_automatic_buildsystem_dependencies
:debug:main No need to upgrade! bzip2 1.0.6_0 >= bzip2 1.0.6_0
:debug:main epoch: in tree: 20090923 installed: 20090923
:debug:main libedit 20170329-3.1_0 exists in the ports tree
:debug:main libedit 20170329-3.1_0  is the latest installed
:debug:main libedit 20170329-3.1_0  is active
:debug:main Merging existing variants '' into variants
:debug:main new fully merged portvariants: 
:debug:main Changing to port directory: /opt/local/var/macports/sources/rsync.macports.org/macports/release/tarballs/ports/devel/libedit
:debug:main OS darwin/17.0.0 (Mac OS X 10.13) arch i386
:debug:main Reading variant descriptions from /opt/local/var/macports/sources/rsync.macports.org/macports/release/tarballs/ports/_resources/port1.0/variant_descriptions.conf
:debug:main Sourcing PortGroup muniversal 1.0 from /opt/local/var/macports/sources/rsync.macports.org/macports/release/tarballs/ports/_resources/port1.0/group/muniversal-1.0.tcl
:debug:main universal variant already exists, so not adding the default one
:debug:main Running callback portconfigure::add_automatic_compiler_dependencies
:debug:main Finished running callback portconfigure::add_automatic_compiler_dependencies
:debug:main Running callback portbuild::add_automatic_buildsystem_dependencies
:debug:main Finished running callback portbuild::add_automatic_buildsystem_dependencies
:debug:main No need to upgrade! libedit 20170329-3.1_0 >= libedit 20170329-3.1_0
:debug:main epoch: in tree: 0 installed: 0
:debug:main zlib 1.2.11_0 exists in the ports tree
:debug:main zlib 1.2.11_0  is the latest installed
:debug:main zlib 1.2.11_0  is active
:debug:main Merging existing variants '' into variants
:debug:main new fully merged portvariants: 
:debug:main Changing to port directory: /opt/local/var/macports/sources/rsync.macports.org/macports/release/tarballs/ports/archivers/zlib
:debug:main OS darwin/17.0.0 (Mac OS X 10.13) arch i386
:debug:main Sourcing PortGroup xcodeversion 1.0 from /opt/local/var/macports/sources/rsync.macports.org/macports/release/tarballs/ports/_resources/port1.0/group/xcodeversion-1.0.tcl
:debug:main adding the default universal variant
:debug:main Reading variant descriptions from /opt/local/var/macports/sources/rsync.macports.org/macports/release/tarballs/ports/_resources/port1.0/variant_descriptions.conf
:debug:main Running callback portconfigure::add_automatic_compiler_dependencies
:debug:main Finished running callback portconfigure::add_automatic_compiler_dependencies
:debug:main Running callback portbuild::add_automatic_buildsystem_dependencies
:debug:main Finished running callback portbuild::add_automatic_buildsystem_dependencies
:debug:main No need to upgrade! zlib 1.2.11_0 >= zlib 1.2.11_0
:debug:main epoch: in tree: 0 installed: 0
:debug:main slang2 2.2.4_3 exists in the ports tree
:debug:main slang2 2.2.4_3  is the latest installed
:debug:main slang2 2.2.4_3  is active
:debug:main Merging existing variants '' into variants
:debug:main new fully merged portvariants: 
:debug:main Changing to port directory: /opt/local/var/macports/sources/rsync.macports.org/macports/release/tarballs/ports/lang/slang2
:debug:main OS darwin/17.0.0 (Mac OS X 10.13) arch i386
:debug:main adding the default universal variant
:debug:main Reading variant descriptions from /opt/local/var/macports/sources/rsync.macports.org/macports/release/tarballs/ports/_resources/port1.0/variant_descriptions.conf
:debug:main Running callback portconfigure::add_automatic_compiler_dependencies
:debug:main Finished running callback portconfigure::add_automatic_compiler_dependencies
:debug:main Running callback portbuild::add_automatic_buildsystem_dependencies
:debug:main Finished running callback portbuild::add_automatic_buildsystem_dependencies
:debug:main No need to upgrade! slang2 2.2.4_3 >= slang2 2.2.4_3
:debug:main epoch: in tree: 0 installed: 0
:debug:main libpng 1.6.32_0 exists in the ports tree
:debug:main libpng 1.6.32_0  is the latest installed
:debug:main libpng 1.6.32_0  is active
:debug:main Merging existing variants '' into variants
:debug:main new fully merged portvariants: 
:debug:main Changing to port directory: /opt/local/var/macports/sources/rsync.macports.org/macports/release/tarballs/ports/graphics/libpng
:debug:main OS darwin/17.0.0 (Mac OS X 10.13) arch i386
:debug:main adding the default universal variant
:debug:main Reading variant descriptions from /opt/local/var/macports/sources/rsync.macports.org/macports/release/tarballs/ports/_resources/port1.0/variant_descriptions.conf
:debug:main Running callback portconfigure::add_automatic_compiler_dependencies
:debug:main Finished running callback portconfigure::add_automatic_compiler_dependencies
:debug:main Running callback portbuild::add_automatic_buildsystem_dependencies
:debug:main Finished running callback portbuild::add_automatic_buildsystem_dependencies
:debug:main No need to upgrade! libpng 1.6.32_0 >= libpng 1.6.32_0
:msg:main --->  Computing dependencies for mc:info:main .:debug:main mc has no conflicts
:debug:main Searching for dependency: xz
:debug:main Found Dependency: receipt exists for xz
:debug:main Searching for dependency: pkgconfig
:debug:main Found Dependency: receipt exists for pkgconfig
:debug:main Searching for dependency: glib2
:debug:main Found Dependency: receipt exists for glib2
:debug:main Searching for dependency: slang2
:debug:main Found Dependency: receipt exists for slang2
:debug:main Executing org.macports.main (mc)
:debug:main dropping privileges: euid changed to 502, egid changed to 501.
:debug:main Skipping completed org.macports.archivefetch (mc)
:debug:main Privilege de-escalation not attempted as not running as root.
:debug:main Skipping completed org.macports.fetch (mc)
:debug:main Privilege de-escalation not attempted as not running as root.
:debug:main Skipping completed org.macports.checksum (mc)
:debug:main Privilege de-escalation not attempted as not running as root.
:debug:main Skipping completed org.macports.extract (mc)
:debug:main Privilege de-escalation not attempted as not running as root.
:debug:main Skipping completed org.macports.patch (mc)
:debug:main Privilege de-escalation not attempted as not running as root.
:debug:main Skipping completed org.macports.configure (mc)
:debug:main Privilege de-escalation not attempted as not running as root.
:debug:build build phase started at Thu Sep  7 16:19:22 CEST 2017
:notice:build --->  Building mc
:debug:build Executing org.macports.build (mc)
:debug:build Environment: 
:debug:build CC_PRINT_OPTIONS='YES'
:debug:build CC_PRINT_OPTIONS_FILE='/opt/local/var/macports/build/_opt_local_var_macports_sources_rsync.macports.org_macports_release_tarballs_ports_sysutils_mc/mc/work/.CC_PRINT_OPTIONS'
:debug:build CPATH='/opt/local/include'
:debug:build LIBRARY_PATH='/opt/local/lib'
:debug:build MACOSX_DEPLOYMENT_TARGET='10.13'
:info:build Executing:  cd "/opt/local/var/macports/build/_opt_local_var_macports_sources_rsync.macports.org_macports_release_tarballs_ports_sysutils_mc/mc/work/mc-4.8.19" && /usr/bin/make -j4 -w all 
:debug:build system:  cd "/opt/local/var/macports/build/_opt_local_var_macports_sources_rsync.macports.org_macports_release_tarballs_ports_sysutils_mc/mc/work/mc-4.8.19" && /usr/bin/make -j4 -w all 
:info:build make: Entering directory `/opt/local/var/macports/build/_opt_local_var_macports_sources_rsync.macports.org_macports_release_tarballs_ports_sysutils_mc/mc/work/mc-4.8.19'
:info:build /Applications/Xcode.app/Contents/Developer/usr/bin/make  all-recursive
:info:build make[1]: Entering directory `/opt/local/var/macports/build/_opt_local_var_macports_sources_rsync.macports.org_macports_release_tarballs_ports_sysutils_mc/mc/work/mc-4.8.19'
:info:build Making all in intl
:info:build make[2]: Entering directory `/opt/local/var/macports/build/_opt_local_var_macports_sources_rsync.macports.org_macports_release_tarballs_ports_sysutils_mc/mc/work/mc-4.8.19/intl'
:info:build make[2]: Nothing to be done for `all'.
:info:build make[2]: Leaving directory `/opt/local/var/macports/build/_opt_local_var_macports_sources_rsync.macports.org_macports_release_tarballs_ports_sysutils_mc/mc/work/mc-4.8.19/intl'
:info:build Making all in po
:info:build make[2]: Entering directory `/opt/local/var/macports/build/_opt_local_var_macports_sources_rsync.macports.org_macports_release_tarballs_ports_sysutils_mc/mc/work/mc-4.8.19/po'
:info:build make[2]: Leaving directory `/opt/local/var/macports/build/_opt_local_var_macports_sources_rsync.macports.org_macports_release_tarballs_ports_sysutils_mc/mc/work/mc-4.8.19/po'
:info:build Making all in lib
:info:build make[2]: Entering directory `/opt/local/var/macports/build/_opt_local_var_macports_sources_rsync.macports.org_macports_release_tarballs_ports_sysutils_mc/mc/work/mc-4.8.19/lib'
:info:build Making all in event
:info:build make[3]: Entering directory `/opt/local/var/macports/build/_opt_local_var_macports_sources_rsync.macports.org_macports_release_tarballs_ports_sysutils_mc/mc/work/mc-4.8.19/lib/event'
:info:build make[3]: Nothing to be done for `all'.
:info:build make[3]: Leaving directory `/opt/local/var/macports/build/_opt_local_var_macports_sources_rsync.macports.org_macports_release_tarballs_ports_sysutils_mc/mc/work/mc-4.8.19/lib/event'
:info:build Making all in filehighlight
:info:build make[3]: Entering directory `/opt/local/var/macports/build/_opt_local_var_macports_sources_rsync.macports.org_macports_release_tarballs_ports_sysutils_mc/mc/work/mc-4.8.19/lib/filehighlight'
:info:build make[3]: Nothing to be done for `all'.
:info:build make[3]: Leaving directory `/opt/local/var/macports/build/_opt_local_var_macports_sources_rsync.macports.org_macports_release_tarballs_ports_sysutils_mc/mc/work/mc-4.8.19/lib/filehighlight'
:info:build Making all in mcconfig
:info:build make[3]: Entering directory `/opt/local/var/macports/build/_opt_local_var_macports_sources_rsync.macports.org_macports_release_tarballs_ports_sysutils_mc/mc/work/mc-4.8.19/lib/mcconfig'
:info:build make[3]: Nothing to be done for `all'.
:info:build make[3]: Leaving directory `/opt/local/var/macports/build/_opt_local_var_macports_sources_rsync.macports.org_macports_release_tarballs_ports_sysutils_mc/mc/work/mc-4.8.19/lib/mcconfig'
:info:build Making all in search
:info:build make[3]: Entering directory `/opt/local/var/macports/build/_opt_local_var_macports_sources_rsync.macports.org_macports_release_tarballs_ports_sysutils_mc/mc/work/mc-4.8.19/lib/search'
:info:build make[3]: Nothing to be done for `all'.
:info:build make[3]: Leaving directory `/opt/local/var/macports/build/_opt_local_var_macports_sources_rsync.macports.org_macports_release_tarballs_ports_sysutils_mc/mc/work/mc-4.8.19/lib/search'
:info:build Making all in skin
:info:build make[3]: Entering directory `/opt/local/var/macports/build/_opt_local_var_macports_sources_rsync.macports.org_macports_release_tarballs_ports_sysutils_mc/mc/work/mc-4.8.19/lib/skin'
:info:build make[3]: Nothing to be done for `all'.
:info:build make[3]: Leaving directory `/opt/local/var/macports/build/_opt_local_var_macports_sources_rsync.macports.org_macports_release_tarballs_ports_sysutils_mc/mc/work/mc-4.8.19/lib/skin'
:info:build Making all in tty
:info:build make[3]: Entering directory `/opt/local/var/macports/build/_opt_local_var_macports_sources_rsync.macports.org_macports_release_tarballs_ports_sysutils_mc/mc/work/mc-4.8.19/lib/tty'
:info:build make[3]: Nothing to be done for `all'.
:info:build make[3]: Leaving directory `/opt/local/var/macports/build/_opt_local_var_macports_sources_rsync.macports.org_macports_release_tarballs_ports_sysutils_mc/mc/work/mc-4.8.19/lib/tty'
:info:build Making all in vfs
:info:build make[3]: Entering directory `/opt/local/var/macports/build/_opt_local_var_macports_sources_rsync.macports.org_macports_release_tarballs_ports_sysutils_mc/mc/work/mc-4.8.19/lib/vfs'
:info:build make[3]: Nothing to be done for `all'.
:info:build make[3]: Leaving directory `/opt/local/var/macports/build/_opt_local_var_macports_sources_rsync.macports.org_macports_release_tarballs_ports_sysutils_mc/mc/work/mc-4.8.19/lib/vfs'
:info:build Making all in strutil
:info:build make[3]: Entering directory `/opt/local/var/macports/build/_opt_local_var_macports_sources_rsync.macports.org_macports_release_tarballs_ports_sysutils_mc/mc/work/mc-4.8.19/lib/strutil'
:info:build make[3]: Nothing to be done for `all'.
:info:build make[3]: Leaving directory `/opt/local/var/macports/build/_opt_local_var_macports_sources_rsync.macports.org_macports_release_tarballs_ports_sysutils_mc/mc/work/mc-4.8.19/lib/strutil'
:info:build Making all in widget
:info:build make[3]: Entering directory `/opt/local/var/macports/build/_opt_local_var_macports_sources_rsync.macports.org_macports_release_tarballs_ports_sysutils_mc/mc/work/mc-4.8.19/lib/widget'
:info:build make[3]: Nothing to be done for `all'.
:info:build make[3]: Leaving directory `/opt/local/var/macports/build/_opt_local_var_macports_sources_rsync.macports.org_macports_release_tarballs_ports_sysutils_mc/mc/work/mc-4.8.19/lib/widget'
:info:build Making all in .
:info:build make[3]: Entering directory `/opt/local/var/macports/build/_opt_local_var_macports_sources_rsync.macports.org_macports_release_tarballs_ports_sysutils_mc/mc/work/mc-4.8.19/lib'
:info:build make[3]: Nothing to be done for `all-am'.
:info:build make[3]: Leaving directory `/opt/local/var/macports/build/_opt_local_var_macports_sources_rsync.macports.org_macports_release_tarballs_ports_sysutils_mc/mc/work/mc-4.8.19/lib'
:info:build make[2]: Leaving directory `/opt/local/var/macports/build/_opt_local_var_macports_sources_rsync.macports.org_macports_release_tarballs_ports_sysutils_mc/mc/work/mc-4.8.19/lib'
:info:build Making all in src
:info:build make[2]: Entering directory `/opt/local/var/macports/build/_opt_local_var_macports_sources_rsync.macports.org_macports_release_tarballs_ports_sysutils_mc/mc/work/mc-4.8.19/src'
:info:build Making all in filemanager
:info:build make[3]: Entering directory `/opt/local/var/macports/build/_opt_local_var_macports_sources_rsync.macports.org_macports_release_tarballs_ports_sysutils_mc/mc/work/mc-4.8.19/src/filemanager'
:info:build   CC       file.lo
:info:build   CC       mountlist.lo
:info:build   CC       panelize.lo
:info:build   CC       panel.lo
:info:build warning: unknown warning option '-Wformat-signedness' [-Wunknown-warning-option]
:info:build warning: unknown warning option '-Wmaybe-uninitialized'; did you mean '-Wuninitialized'? [-Wunknown-warning-option]
:info:build warning: unknown warning option '-Wmissing-parameter-type' [-Wunknown-warning-option]
:info:build warning: unknown warning option '-Wunused-but-set-variable'; did you mean '-Wunused-const-variable'? [-Wunknown-warning-option]
:info:build warning: unknown warning option '-Wformat-signedness' [-Wunknown-warning-option]
:info:build warning: unknown warning option '-Wmaybe-uninitialized'; did you mean '-Wuninitialized'? [-Wunknown-warning-option]
:info:build warning: unknown warning option '-Wmissing-parameter-type' [-Wunknown-warning-option]
:info:build warning: unknown warning option '-Wunused-but-set-variable'; did you mean '-Wunused-const-variable'? [-Wunknown-warning-option]
:info:build warning: unknown warning option '-Wformat-signedness' [-Wunknown-warning-option]
:info:build warning: unknown warning option '-Wmaybe-uninitialized'; did you mean '-Wuninitialized'? [-Wunknown-warning-option]
:info:build warning: unknown warning option '-Wmissing-parameter-type' [-Wunknown-warning-option]
:info:build warning: unknown warning option '-Wunused-but-set-variable'; did you mean '-Wunused-const-variable'? [-Wunknown-warning-option]
:info:build warning: unknown warning option '-Wformat-signedness' [-Wunknown-warning-option]
:info:build warning: unknown warning option '-Wmaybe-uninitialized'; did you mean '-Wuninitialized'? [-Wunknown-warning-option]
:info:build warning: unknown warning option '-Wmissing-parameter-type' [-Wunknown-warning-option]
:info:build warning: unknown warning option '-Wunused-but-set-variable'; did you mean '-Wunused-const-variable'? [-Wunknown-warning-option]
:info:build mountlist.c:1295:3: warning: unused label 'free_then_fail' [-Wunused-label]
:info:build   free_then_fail:
:info:build   ^~~~~~~~~~~~~~~
:info:build panel.c:1223:68: warning: integer constant not in range of enumerated type 'vfs_path_flag_t' [-Wassign-enum]
:info:build                                VPF_STRIP_HOME | VPF_STRIP_PASSWORD | VPF_HIDE_CHARSET);
:info:build                                                                    ^
:info:build panelize.c:188:92: warning: integer constant not in range of enumerated type 'input_complete_t' [-Wassign-enum]
:info:build                    INPUT_COMPLETE_VARIABLES | INPUT_COMPLETE_USERNAMES | INPUT_COMPLETE_CD |
:info:build                                                                                            ^
:info:build file.c:668:23: error: no member named 'st_atim' in 'struct stat'
:info:build     (*times)[0] = sb->st_atim;
:info:build                   ~~  ^
:info:build file.c:669:23: error: no member named 'st_mtim' in 'struct stat'
:info:build     (*times)[1] = sb->st_mtim;
:info:build                   ~~  ^
:info:build panel.c:2574:35: warning: integer constant not in range of enumerated type 'panel_select_flags_t' [-Wassign-enum]
:info:build     panels_options.select_flags = 0;
:info:build                                   ^
:info:build panel.c:4033:22: warning: integer constant not in range of enumerated type 'panel_update_flags_t' [-Wassign-enum]
:info:build             flags &= ~UP_RELOAD;
:info:build                      ^
:info:build panel.c:4276:19: warning: integer constant not in range of enumerated type 'widget_options_t' [-Wassign-enum]
:info:build     w->options |= WOP_SELECTABLE | WOP_TOP_SELECT;
:info:build                   ^
:info:build 4 warnings and 2 errors generated.
:info:build make[3]: *** [file.lo] Error 1
:info:build make[3]: *** Waiting for unfinished jobs....
:info:build 5 warnings generated.
:info:build 5 warnings generated.
:info:build 8 warnings generated.
:info:build make[3]: Leaving directory `/opt/local/var/macports/build/_opt_local_var_macports_sources_rsync.macports.org_macports_release_tarballs_ports_sysutils_mc/mc/work/mc-4.8.19/src/filemanager'
:info:build make[2]: *** [all-recursive] Error 1
:info:build make[2]: Leaving directory `/opt/local/var/macports/build/_opt_local_var_macports_sources_rsync.macports.org_macports_release_tarballs_ports_sysutils_mc/mc/work/mc-4.8.19/src'
:info:build make[1]: *** [all-recursive] Error 1
:info:build make[1]: Leaving directory `/opt/local/var/macports/build/_opt_local_var_macports_sources_rsync.macports.org_macports_release_tarballs_ports_sysutils_mc/mc/work/mc-4.8.19'
:info:build make: *** [all] Error 2
:info:build make: Leaving directory `/opt/local/var/macports/build/_opt_local_var_macports_sources_rsync.macports.org_macports_release_tarballs_ports_sysutils_mc/mc/work/mc-4.8.19'
:info:build Command failed:  cd "/opt/local/var/macports/build/_opt_local_var_macports_sources_rsync.macports.org_macports_release_tarballs_ports_sysutils_mc/mc/work/mc-4.8.19" && /usr/bin/make -j4 -w all 
:info:build Exit code: 2
:error:build Failed to build mc: command execution failed
:debug:build Error code: CHILDSTATUS 99748 2
:debug:build Backtrace: command execution failed
:debug:build     while executing
:debug:build "system {*}$notty {*}$nice $fullcmdstring"
:debug:build     invoked from within
:debug:build "command_exec build"
:debug:build     (procedure "portbuild::build_main" line 8)
:debug:build     invoked from within
:debug:build "$procedure $targetname"
:error:build See /opt/local/var/macports/logs/_opt_local_var_macports_sources_rsync.macports.org_macports_release_tarballs_ports_sysutils_mc/mc/main.log for details.
version:1
:debug:main epoch: in tree: 0 installed: 0
:debug:main xz 5.2.3_0 exists in the ports tree
:debug:main xz 5.2.3_0  is the latest installed
:debug:main xz 5.2.3_0  is active
:debug:main Merging existing variants '' into variants
:debug:main new fully merged portvariants: 
:debug:main Changing to port directory: /opt/local/var/macports/sources/rsync.macports.org/macports/release/tarballs/ports/archivers/xz
:debug:main OS darwin/17.0.0 (Mac OS X 10.13) arch i386
:debug:main adding the default universal variant
:debug:main Reading variant descriptions from /opt/local/var/macports/sources/rsync.macports.org/macports/release/tarballs/ports/_resources/port1.0/variant_descriptions.conf
:debug:main Running callback portconfigure::add_automatic_compiler_dependencies
:debug:main Finished running callback portconfigure::add_automatic_compiler_dependencies
:debug:main Running callback portbuild::add_automatic_buildsystem_dependencies
:debug:main Finished running callback portbuild::add_automatic_buildsystem_dependencies
:debug:main No need to upgrade! xz 5.2.3_0 >= xz 5.2.3_0
:debug:main epoch: in tree: 0 installed: 0
:debug:main libiconv 1.15_0 exists in the ports tree
:debug:main libiconv 1.15_0  is the latest installed
:debug:main libiconv 1.15_0  is active
:debug:main Merging existing variants '' into variants
:debug:main new fully merged portvariants: 
:debug:main Changing to port directory: /opt/local/var/macports/sources/rsync.macports.org/macports/release/tarballs/ports/textproc/libiconv
:debug:main OS darwin/17.0.0 (Mac OS X 10.13) arch i386
:debug:main Reading variant descriptions from /opt/local/var/macports/sources/rsync.macports.org/macports/release/tarballs/ports/_resources/port1.0/variant_descriptions.conf
:debug:main Sourcing PortGroup muniversal 1.0 from /opt/local/var/macports/sources/rsync.macports.org/macports/release/tarballs/ports/_resources/port1.0/group/muniversal-1.0.tcl
:debug:main universal variant already exists, so not adding the default one
:debug:main Running callback portconfigure::add_automatic_compiler_dependencies
:debug:main Finished running callback portconfigure::add_automatic_compiler_dependencies
:debug:main Running callback portbuild::add_automatic_buildsystem_dependencies
:debug:main Finished running callback portbuild::add_automatic_buildsystem_dependencies
:debug:main No need to upgrade! libiconv 1.15_0 >= libiconv 1.15_0
:debug:main epoch: in tree: 2 installed: 2
:debug:main gettext 0.19.8.1_0 exists in the ports tree
:debug:main gettext 0.19.8.1_0  is the latest installed
:debug:main gettext 0.19.8.1_0  is active
:debug:main Merging existing variants '' into variants
:debug:main new fully merged portvariants: 
:debug:main Changing to port directory: /opt/local/var/macports/sources/rsync.macports.org/macports/release/tarballs/ports/devel/gettext
:debug:main OS darwin/17.0.0 (Mac OS X 10.13) arch i386
:debug:main Sourcing PortGroup compiler_blacklist_versions 1.0 from /opt/local/var/macports/sources/rsync.macports.org/macports/release/tarballs/ports/_resources/port1.0/group/compiler_blacklist_versions-1.0.tcl
:debug:main Reading variant descriptions from /opt/local/var/macports/sources/rsync.macports.org/macports/release/tarballs/ports/_resources/port1.0/variant_descriptions.conf
:debug:main Sourcing PortGroup muniversal 1.0 from /opt/local/var/macports/sources/rsync.macports.org/macports/release/tarballs/ports/_resources/port1.0/group/muniversal-1.0.tcl
:debug:main compiler clang 802.0.42 not blacklisted because it doesn't match {clang < 211.10.1}
:debug:main universal variant already exists, so not adding the default one
:debug:main Running callback portconfigure::add_automatic_compiler_dependencies
:debug:main Finished running callback portconfigure::add_automatic_compiler_dependencies
:debug:main Running callback portbuild::add_automatic_buildsystem_dependencies
:debug:main Finished running callback portbuild::add_automatic_buildsystem_dependencies
:debug:main No need to upgrade! gettext 0.19.8.1_0 >= gettext 0.19.8.1_0
:debug:main epoch: in tree: 0 installed: 0
:debug:main expat 2.2.4_0 exists in the ports tree
:debug:main expat 2.2.4_0  is the latest installed
:debug:main expat 2.2.4_0  is active
:debug:main Merging existing variants '' into variants
:debug:main new fully merged portvariants: 
:debug:main Changing to port directory: /opt/local/var/macports/sources/rsync.macports.org/macports/release/tarballs/ports/textproc/expat
:debug:main OS darwin/17.0.0 (Mac OS X 10.13) arch i386
:debug:main adding the default universal variant
:debug:main Reading variant descriptions from /opt/local/var/macports/sources/rsync.macports.org/macports/release/tarballs/ports/_resources/port1.0/variant_descriptions.conf
:debug:main Running callback portconfigure::add_automatic_compiler_dependencies
:debug:main Finished running callback portconfigure::add_automatic_compiler_dependencies
:debug:main Running callback portbuild::add_automatic_buildsystem_dependencies
:debug:main Finished running callback portbuild::add_automatic_buildsystem_dependencies
:debug:main No need to upgrade! expat 2.2.4_0 >= expat 2.2.4_0
:debug:main epoch: in tree: 0 installed: 0
:debug:main ncurses 6.0-20170708_0 exists in the ports tree
:debug:main ncurses 6.0-20170708_0  is the latest installed
:debug:main ncurses 6.0-20170708_0  is active
:debug:main Merging existing variants '' into variants
:debug:main new fully merged portvariants: 
:debug:main Changing to port directory: /opt/local/var/macports/sources/rsync.macports.org/macports/release/tarballs/ports/devel/ncurses
:debug:main OS darwin/17.0.0 (Mac OS X 10.13) arch i386
:debug:main adding the default universal variant
:debug:main Reading variant descriptions from /opt/local/var/macports/sources/rsync.macports.org/macports/release/tarballs/ports/_resources/port1.0/variant_descriptions.conf
:debug:main Running callback portconfigure::add_automatic_compiler_dependencies
:debug:main Finished running callback portconfigure::add_automatic_compiler_dependencies
:debug:main Running callback portbuild::add_automatic_buildsystem_dependencies
:debug:main Finished running callback portbuild::add_automatic_buildsystem_dependencies
:debug:main No need to upgrade! ncurses 6.0-20170708_0 >= ncurses 6.0-20170708_0
:debug:main epoch: in tree: 0 installed: 0
:debug:main pkgconfig 0.29.2_0 exists in the ports tree
:debug:main pkgconfig 0.29.2_0  is the latest installed
:debug:main pkgconfig 0.29.2_0  is active
:debug:main Merging existing variants '' into variants
:debug:main new fully merged portvariants: 
:debug:main Changing to port directory: /opt/local/var/macports/sources/rsync.macports.org/macports/release/tarballs/ports/devel/pkgconfig
:debug:main OS darwin/17.0.0 (Mac OS X 10.13) arch i386
:debug:main adding the default universal variant
:debug:main Reading variant descriptions from /opt/local/var/macports/sources/rsync.macports.org/macports/release/tarballs/ports/_resources/port1.0/variant_descriptions.conf
:debug:main Running callback portconfigure::add_automatic_compiler_dependencies
:debug:main Finished running callback portconfigure::add_automatic_compiler_dependencies
:debug:main Running callback portbuild::add_automatic_buildsystem_dependencies
:debug:main Finished running callback portbuild::add_automatic_buildsystem_dependencies
:debug:main No need to upgrade! pkgconfig 0.29.2_0 >= pkgconfig 0.29.2_0
:debug:main epoch: in tree: 0 installed: 0
:debug:main glib2 2.52.3_0 exists in the ports tree
:debug:main glib2 2.52.3_0 +x11 is the latest installed
:debug:main glib2 2.52.3_0 +x11 is active
:debug:main Merging existing variants '+x11' into variants
:debug:main new fully merged portvariants: x11 +
:debug:main Changing to port directory: /opt/local/var/macports/sources/rsync.macports.org/macports/release/tarballs/ports/devel/glib2
:debug:main OS darwin/17.0.0 (Mac OS X 10.13) arch i386
:debug:main Sourcing PortGroup compiler_blacklist_versions 1.0 from /opt/local/var/macports/sources/rsync.macports.org/macports/release/tarballs/ports/_resources/port1.0/group/compiler_blacklist_versions-1.0.tcl
:debug:main compiler clang 802.0.42 not blacklisted because it doesn't match {clang < 600}
:debug:main Reading variant descriptions from /opt/local/var/macports/sources/rsync.macports.org/macports/release/tarballs/ports/_resources/port1.0/variant_descriptions.conf
:debug:main adding the default universal variant
:debug:main Executing variant x11 provides x11
:debug:main Running callback portconfigure::add_automatic_compiler_dependencies
:debug:main Finished running callback portconfigure::add_automatic_compiler_dependencies
:debug:main Running callback portbuild::add_automatic_buildsystem_dependencies
:debug:main Finished running callback portbuild::add_automatic_buildsystem_dependencies
:debug:main No need to upgrade! glib2 2.52.3_0 >= glib2 2.52.3_0
:debug:main epoch: in tree: 0 installed: 0
:debug:main libffi 3.2.1_0 exists in the ports tree
:debug:main libffi 3.2.1_0  is the latest installed
:debug:main libffi 3.2.1_0  is active
:debug:main Merging existing variants '' into variants
:debug:main new fully merged portvariants: 
:debug:main Changing to port directory: /opt/local/var/macports/sources/rsync.macports.org/macports/release/tarballs/ports/devel/libffi
:debug:main OS darwin/17.0.0 (Mac OS X 10.13) arch i386
:debug:main Reading variant descriptions from /opt/local/var/macports/sources/rsync.macports.org/macports/release/tarballs/ports/_resources/port1.0/variant_descriptions.conf
:debug:main Sourcing PortGroup muniversal 1.0 from /opt/local/var/macports/sources/rsync.macports.org/macports/release/tarballs/ports/_resources/port1.0/group/muniversal-1.0.tcl
:debug:main universal variant already exists, so not adding the default one
:debug:main Running callback portconfigure::add_automatic_compiler_dependencies
:debug:main Finished running callback portconfigure::add_automatic_compiler_dependencies
:debug:main Running callback portbuild::add_automatic_buildsystem_dependencies
:debug:main Finished running callback portbuild::add_automatic_buildsystem_dependencies
:debug:main No need to upgrade! libffi 3.2.1_0 >= libffi 3.2.1_0
:debug:main epoch: in tree: 0 installed: 0
:debug:main pcre 8.41_0 exists in the ports tree
:debug:main pcre 8.41_0  is the latest installed
:debug:main pcre 8.41_0  is active
:debug:main Merging existing variants '' into variants
:debug:main new fully merged portvariants: 
:debug:main Changing to port directory: /opt/local/var/macports/sources/rsync.macports.org/macports/release/tarballs/ports/devel/pcre
:debug:main OS darwin/17.0.0 (Mac OS X 10.13) arch i386
:debug:main adding the default universal variant
:debug:main Reading variant descriptions from /opt/local/var/macports/sources/rsync.macports.org/macports/release/tarballs/ports/_resources/port1.0/variant_descriptions.conf
:debug:main Running callback portconfigure::add_automatic_compiler_dependencies
:debug:main Finished running callback portconfigure::add_automatic_compiler_dependencies
:debug:main Running callback portbuild::add_automatic_buildsystem_dependencies
:debug:main Finished running callback portbuild::add_automatic_buildsystem_dependencies
:debug:main No need to upgrade! pcre 8.41_0 >= pcre 8.41_0
:debug:main epoch: in tree: 0 installed: 0
:debug:main bzip2 1.0.6_0 exists in the ports tree
:debug:main bzip2 1.0.6_0  is the latest installed
:debug:main bzip2 1.0.6_0  is active
:debug:main Merging existing variants '' into variants
:debug:main new fully merged portvariants: 
:debug:main Changing to port directory: /opt/local/var/macports/sources/rsync.macports.org/macports/release/tarballs/ports/archivers/bzip2
:debug:main OS darwin/17.0.0 (Mac OS X 10.13) arch i386
:debug:main Reading variant descriptions from /opt/local/var/macports/sources/rsync.macports.org/macports/release/tarballs/ports/_resources/port1.0/variant_descriptions.conf
:debug:main universal variant already exists, so not adding the default one
:debug:main Running callback portconfigure::add_automatic_compiler_dependencies
:debug:main Finished running callback portconfigure::add_automatic_compiler_dependencies
:debug:main Running callback portbuild::add_automatic_buildsystem_dependencies
:debug:main Finished running callback portbuild::add_automatic_buildsystem_dependencies
:debug:main No need to upgrade! bzip2 1.0.6_0 >= bzip2 1.0.6_0
:debug:main epoch: in tree: 20090923 installed: 20090923
:debug:main libedit 20170329-3.1_0 exists in the ports tree
:debug:main libedit 20170329-3.1_0  is the latest installed
:debug:main libedit 20170329-3.1_0  is active
:debug:main Merging existing variants '' into variants
:debug:main new fully merged portvariants: 
:debug:main Changing to port directory: /opt/local/var/macports/sources/rsync.macports.org/macports/release/tarballs/ports/devel/libedit
:debug:main OS darwin/17.0.0 (Mac OS X 10.13) arch i386
:debug:main Reading variant descriptions from /opt/local/var/macports/sources/rsync.macports.org/macports/release/tarballs/ports/_resources/port1.0/variant_descriptions.conf
:debug:main Sourcing PortGroup muniversal 1.0 from /opt/local/var/macports/sources/rsync.macports.org/macports/release/tarballs/ports/_resources/port1.0/group/muniversal-1.0.tcl
:debug:main universal variant already exists, so not adding the default one
:debug:main Running callback portconfigure::add_automatic_compiler_dependencies
:debug:main Finished running callback portconfigure::add_automatic_compiler_dependencies
:debug:main Running callback portbuild::add_automatic_buildsystem_dependencies
:debug:main Finished running callback portbuild::add_automatic_buildsystem_dependencies
:debug:main No need to upgrade! libedit 20170329-3.1_0 >= libedit 20170329-3.1_0
:debug:main epoch: in tree: 0 installed: 0
:debug:main zlib 1.2.11_0 exists in the ports tree
:debug:main zlib 1.2.11_0  is the latest installed
:debug:main zlib 1.2.11_0  is active
:debug:main Merging existing variants '' into variants
:debug:main new fully merged portvariants: 
:debug:main Changing to port directory: /opt/local/var/macports/sources/rsync.macports.org/macports/release/tarballs/ports/archivers/zlib
:debug:main OS darwin/17.0.0 (Mac OS X 10.13) arch i386
:debug:main Sourcing PortGroup xcodeversion 1.0 from /opt/local/var/macports/sources/rsync.macports.org/macports/release/tarballs/ports/_resources/port1.0/group/xcodeversion-1.0.tcl
:debug:main adding the default universal variant
:debug:main Reading variant descriptions from /opt/local/var/macports/sources/rsync.macports.org/macports/release/tarballs/ports/_resources/port1.0/variant_descriptions.conf
:debug:main Running callback portconfigure::add_automatic_compiler_dependencies
:debug:main Finished running callback portconfigure::add_automatic_compiler_dependencies
:debug:main Running callback portbuild::add_automatic_buildsystem_dependencies
:debug:main Finished running callback portbuild::add_automatic_buildsystem_dependencies
:debug:main No need to upgrade! zlib 1.2.11_0 >= zlib 1.2.11_0
:debug:main epoch: in tree: 0 installed: 0
:debug:main slang2 2.2.4_3 exists in the ports tree
:debug:main slang2 2.2.4_3  is the latest installed
:debug:main slang2 2.2.4_3  is active
:debug:main Merging existing variants '' into variants
:debug:main new fully merged portvariants: 
:debug:main Changing to port directory: /opt/local/var/macports/sources/rsync.macports.org/macports/release/tarballs/ports/lang/slang2
:debug:main OS darwin/17.0.0 (Mac OS X 10.13) arch i386
:debug:main adding the default universal variant
:debug:main Reading variant descriptions from /opt/local/var/macports/sources/rsync.macports.org/macports/release/tarballs/ports/_resources/port1.0/variant_descriptions.conf
:debug:main Running callback portconfigure::add_automatic_compiler_dependencies
:debug:main Finished running callback portconfigure::add_automatic_compiler_dependencies
:debug:main Running callback portbuild::add_automatic_buildsystem_dependencies
:debug:main Finished running callback portbuild::add_automatic_buildsystem_dependencies
:debug:main No need to upgrade! slang2 2.2.4_3 >= slang2 2.2.4_3
:debug:main epoch: in tree: 0 installed: 0
:debug:main libpng 1.6.32_0 exists in the ports tree
:debug:main libpng 1.6.32_0  is the latest installed
:debug:main libpng 1.6.32_0  is active
:debug:main Merging existing variants '' into variants
:debug:main new fully merged portvariants: 
:debug:main Changing to port directory: /opt/local/var/macports/sources/rsync.macports.org/macports/release/tarballs/ports/graphics/libpng
:debug:main OS darwin/17.0.0 (Mac OS X 10.13) arch i386
:debug:main adding the default universal variant
:debug:main Reading variant descriptions from /opt/local/var/macports/sources/rsync.macports.org/macports/release/tarballs/ports/_resources/port1.0/variant_descriptions.conf
:debug:main Running callback portconfigure::add_automatic_compiler_dependencies
:debug:main Finished running callback portconfigure::add_automatic_compiler_dependencies
:debug:main Running callback portbuild::add_automatic_buildsystem_dependencies
:debug:main Finished running callback portbuild::add_automatic_buildsystem_dependencies
:debug:main No need to upgrade! libpng 1.6.32_0 >= libpng 1.6.32_0
:msg:main --->  Computing dependencies for mc:info:main .:debug:main mc has no conflicts
:debug:main Searching for dependency: xz
:debug:main Found Dependency: receipt exists for xz
:debug:main Searching for dependency: pkgconfig
:debug:main Found Dependency: receipt exists for pkgconfig
:debug:main Searching for dependency: glib2
:debug:main Found Dependency: receipt exists for glib2
:debug:main Searching for dependency: slang2
:debug:main Found Dependency: receipt exists for slang2
:debug:main Executing org.macports.main (mc)
:debug:main dropping privileges: euid changed to 502, egid changed to 501.
:debug:main Skipping completed org.macports.archivefetch (mc)
:debug:main Privilege de-escalation not attempted as not running as root.
:debug:main Skipping completed org.macports.fetch (mc)
:debug:main Privilege de-escalation not attempted as not running as root.
:debug:main Skipping completed org.macports.checksum (mc)
:debug:main Privilege de-escalation not attempted as not running as root.
:debug:main Skipping completed org.macports.extract (mc)
:debug:main Privilege de-escalation not attempted as not running as root.
:debug:main Skipping completed org.macports.patch (mc)
:debug:main Privilege de-escalation not attempted as not running as root.
:debug:main Skipping completed org.macports.configure (mc)
:debug:main Privilege de-escalation not attempted as not running as root.
:debug:build build phase started at Thu Sep  7 16:21:51 CEST 2017
:notice:build --->  Building mc
:debug:build Executing org.macports.build (mc)
:debug:build Environment: 
:debug:build CC_PRINT_OPTIONS='YES'
:debug:build CC_PRINT_OPTIONS_FILE='/opt/local/var/macports/build/_opt_local_var_macports_sources_rsync.macports.org_macports_release_tarballs_ports_sysutils_mc/mc/work/.CC_PRINT_OPTIONS'
:debug:build CPATH='/opt/local/include'
:debug:build LIBRARY_PATH='/opt/local/lib'
:debug:build MACOSX_DEPLOYMENT_TARGET='10.13'
:info:build Executing:  cd "/opt/local/var/macports/build/_opt_local_var_macports_sources_rsync.macports.org_macports_release_tarballs_ports_sysutils_mc/mc/work/mc-4.8.19" && /usr/bin/make -j4 -w all 
:debug:build system:  cd "/opt/local/var/macports/build/_opt_local_var_macports_sources_rsync.macports.org_macports_release_tarballs_ports_sysutils_mc/mc/work/mc-4.8.19" && /usr/bin/make -j4 -w all 
:info:build make: Entering directory `/opt/local/var/macports/build/_opt_local_var_macports_sources_rsync.macports.org_macports_release_tarballs_ports_sysutils_mc/mc/work/mc-4.8.19'
:info:build /Applications/Xcode.app/Contents/Developer/usr/bin/make  all-recursive
:info:build make[1]: Entering directory `/opt/local/var/macports/build/_opt_local_var_macports_sources_rsync.macports.org_macports_release_tarballs_ports_sysutils_mc/mc/work/mc-4.8.19'
:info:build Making all in intl
:info:build make[2]: Entering directory `/opt/local/var/macports/build/_opt_local_var_macports_sources_rsync.macports.org_macports_release_tarballs_ports_sysutils_mc/mc/work/mc-4.8.19/intl'
:info:build make[2]: Nothing to be done for `all'.
:info:build make[2]: Leaving directory `/opt/local/var/macports/build/_opt_local_var_macports_sources_rsync.macports.org_macports_release_tarballs_ports_sysutils_mc/mc/work/mc-4.8.19/intl'
:info:build Making all in po
:info:build make[2]: Entering directory `/opt/local/var/macports/build/_opt_local_var_macports_sources_rsync.macports.org_macports_release_tarballs_ports_sysutils_mc/mc/work/mc-4.8.19/po'
:info:build make[2]: Leaving directory `/opt/local/var/macports/build/_opt_local_var_macports_sources_rsync.macports.org_macports_release_tarballs_ports_sysutils_mc/mc/work/mc-4.8.19/po'
:info:build Making all in lib
:info:build make[2]: Entering directory `/opt/local/var/macports/build/_opt_local_var_macports_sources_rsync.macports.org_macports_release_tarballs_ports_sysutils_mc/mc/work/mc-4.8.19/lib'
:info:build Making all in event
:info:build make[3]: Entering directory `/opt/local/var/macports/build/_opt_local_var_macports_sources_rsync.macports.org_macports_release_tarballs_ports_sysutils_mc/mc/work/mc-4.8.19/lib/event'
:info:build make[3]: Nothing to be done for `all'.
:info:build make[3]: Leaving directory `/opt/local/var/macports/build/_opt_local_var_macports_sources_rsync.macports.org_macports_release_tarballs_ports_sysutils_mc/mc/work/mc-4.8.19/lib/event'
:info:build Making all in filehighlight
:info:build make[3]: Entering directory `/opt/local/var/macports/build/_opt_local_var_macports_sources_rsync.macports.org_macports_release_tarballs_ports_sysutils_mc/mc/work/mc-4.8.19/lib/filehighlight'
:info:build make[3]: Nothing to be done for `all'.
:info:build make[3]: Leaving directory `/opt/local/var/macports/build/_opt_local_var_macports_sources_rsync.macports.org_macports_release_tarballs_ports_sysutils_mc/mc/work/mc-4.8.19/lib/filehighlight'
:info:build Making all in mcconfig
:info:build make[3]: Entering directory `/opt/local/var/macports/build/_opt_local_var_macports_sources_rsync.macports.org_macports_release_tarballs_ports_sysutils_mc/mc/work/mc-4.8.19/lib/mcconfig'
:info:build make[3]: Nothing to be done for `all'.
:info:build make[3]: Leaving directory `/opt/local/var/macports/build/_opt_local_var_macports_sources_rsync.macports.org_macports_release_tarballs_ports_sysutils_mc/mc/work/mc-4.8.19/lib/mcconfig'
:info:build Making all in search
:info:build make[3]: Entering directory `/opt/local/var/macports/build/_opt_local_var_macports_sources_rsync.macports.org_macports_release_tarballs_ports_sysutils_mc/mc/work/mc-4.8.19/lib/search'
:info:build make[3]: Nothing to be done for `all'.
:info:build make[3]: Leaving directory `/opt/local/var/macports/build/_opt_local_var_macports_sources_rsync.macports.org_macports_release_tarballs_ports_sysutils_mc/mc/work/mc-4.8.19/lib/search'
:info:build Making all in skin
:info:build make[3]: Entering directory `/opt/local/var/macports/build/_opt_local_var_macports_sources_rsync.macports.org_macports_release_tarballs_ports_sysutils_mc/mc/work/mc-4.8.19/lib/skin'
:info:build make[3]: Nothing to be done for `all'.
:info:build make[3]: Leaving directory `/opt/local/var/macports/build/_opt_local_var_macports_sources_rsync.macports.org_macports_release_tarballs_ports_sysutils_mc/mc/work/mc-4.8.19/lib/skin'
:info:build Making all in tty
:info:build make[3]: Entering directory `/opt/local/var/macports/build/_opt_local_var_macports_sources_rsync.macports.org_macports_release_tarballs_ports_sysutils_mc/mc/work/mc-4.8.19/lib/tty'
:info:build make[3]: Nothing to be done for `all'.
:info:build make[3]: Leaving directory `/opt/local/var/macports/build/_opt_local_var_macports_sources_rsync.macports.org_macports_release_tarballs_ports_sysutils_mc/mc/work/mc-4.8.19/lib/tty'
:info:build Making all in vfs
:info:build make[3]: Entering directory `/opt/local/var/macports/build/_opt_local_var_macports_sources_rsync.macports.org_macports_release_tarballs_ports_sysutils_mc/mc/work/mc-4.8.19/lib/vfs'
:info:build make[3]: Nothing to be done for `all'.
:info:build make[3]: Leaving directory `/opt/local/var/macports/build/_opt_local_var_macports_sources_rsync.macports.org_macports_release_tarballs_ports_sysutils_mc/mc/work/mc-4.8.19/lib/vfs'
:info:build Making all in strutil
:info:build make[3]: Entering directory `/opt/local/var/macports/build/_opt_local_var_macports_sources_rsync.macports.org_macports_release_tarballs_ports_sysutils_mc/mc/work/mc-4.8.19/lib/strutil'
:info:build make[3]: Nothing to be done for `all'.
:info:build make[3]: Leaving directory `/opt/local/var/macports/build/_opt_local_var_macports_sources_rsync.macports.org_macports_release_tarballs_ports_sysutils_mc/mc/work/mc-4.8.19/lib/strutil'
:info:build Making all in widget
:info:build make[3]: Entering directory `/opt/local/var/macports/build/_opt_local_var_macports_sources_rsync.macports.org_macports_release_tarballs_ports_sysutils_mc/mc/work/mc-4.8.19/lib/widget'
:info:build make[3]: Nothing to be done for `all'.
:info:build make[3]: Leaving directory `/opt/local/var/macports/build/_opt_local_var_macports_sources_rsync.macports.org_macports_release_tarballs_ports_sysutils_mc/mc/work/mc-4.8.19/lib/widget'
:info:build Making all in .
:info:build make[3]: Entering directory `/opt/local/var/macports/build/_opt_local_var_macports_sources_rsync.macports.org_macports_release_tarballs_ports_sysutils_mc/mc/work/mc-4.8.19/lib'
:info:build make[3]: Nothing to be done for `all-am'.
:info:build make[3]: Leaving directory `/opt/local/var/macports/build/_opt_local_var_macports_sources_rsync.macports.org_macports_release_tarballs_ports_sysutils_mc/mc/work/mc-4.8.19/lib'
:info:build make[2]: Leaving directory `/opt/local/var/macports/build/_opt_local_var_macports_sources_rsync.macports.org_macports_release_tarballs_ports_sysutils_mc/mc/work/mc-4.8.19/lib'
:info:build Making all in src
:info:build make[2]: Entering directory `/opt/local/var/macports/build/_opt_local_var_macports_sources_rsync.macports.org_macports_release_tarballs_ports_sysutils_mc/mc/work/mc-4.8.19/src'
:info:build Making all in filemanager
:info:build make[3]: Entering directory `/opt/local/var/macports/build/_opt_local_var_macports_sources_rsync.macports.org_macports_release_tarballs_ports_sysutils_mc/mc/work/mc-4.8.19/src/filemanager'
:info:build   CC       file.lo
:info:build   CC       tree.lo
:info:build   CC       treestore.lo
:info:build   CC       usermenu.lo
:info:build warning: unknown warning option '-Wformat-signedness' [-Wunknown-warning-option]
:info:build warning: unknown warning option '-Wmaybe-uninitialized'; did you mean '-Wuninitialized'? [-Wunknown-warning-option]
:info:build warning: unknown warning option '-Wformat-signedness' [-Wunknown-warning-option]
:info:build warning: unknown warning option '-Wmissing-parameter-type' [-Wunknown-warning-option]
:info:build warning: unknown warning option '-Wmaybe-uninitialized'; did you mean '-Wuninitialized'? [-Wunknown-warning-option]
:info:build warning: unknown warning option '-Wmissing-parameter-type' [-Wunknown-warning-option]
:info:build warning: unknown warning option '-Wunused-but-set-variable'; did you mean '-Wunused-const-variable'? [-Wunknown-warning-option]
:info:build warning: unknown warning option '-Wunused-but-set-variable'; did you mean '-Wunused-const-variable'? [-Wunknown-warning-option]
:info:build warning: unknown warning option '-Wformat-signedness' [-Wunknown-warning-option]
:info:build warning: unknown warning option '-Wmaybe-uninitialized'; did you mean '-Wuninitialized'? [-Wunknown-warning-option]
:info:build warning: unknown warning option '-Wmissing-parameter-type' [-Wunknown-warning-option]
:info:build warning: unknown warning option '-Wunused-but-set-variable'; did you mean '-Wunused-const-variable'? [-Wunknown-warning-option]
:info:build warning: unknown warning option '-Wformat-signedness' [-Wunknown-warning-option]
:info:build warning: unknown warning option '-Wmaybe-uninitialized'; did you mean '-Wuninitialized'? [-Wunknown-warning-option]
:info:build warning: unknown warning option '-Wmissing-parameter-type' [-Wunknown-warning-option]
:info:build warning: unknown warning option '-Wunused-but-set-variable'; did you mean '-Wunused-const-variable'? [-Wunknown-warning-option]
:info:build usermenu.c:477:87: warning: integer constant not in range of enumerated type 'input_complete_t' [-Wassign-enum]
:info:build                                   INPUT_COMPLETE_HOSTNAMES | INPUT_COMPLETE_VARIABLES |
:info:build                                                                                       ^
:info:build file.c:668:23: error: no member named 'st_atim' in 'struct stat'
:info:build     (*times)[0] = sb->st_atim;
:info:build                   ~~  ^
:info:build file.c:669:23: error: no member named 'st_mtim' in 'struct stat'
:info:build     (*times)[1] = sb->st_mtim;
:info:build                   ~~  ^
:info:build tree.c:718:58: warning: integer constant not in range of enumerated type 'input_complete_t' [-Wassign-enum]
:info:build                                 INPUT_COMPLETE_FILENAMES | INPUT_COMPLETE_CD);
:info:build                                                          ^
:info:build tree.c:757:55: warning: integer constant not in range of enumerated type 'input_complete_t' [-Wassign-enum]
:info:build                              INPUT_COMPLETE_FILENAMES | INPUT_COMPLETE_CD);
:info:build                                                       ^
:info:build tree.c:1287:19: warning: integer constant not in range of enumerated type 'widget_options_t' [-Wassign-enum]
:info:build     w->options |= WOP_SELECTABLE | WOP_TOP_SELECT;
:info:build                   ^
:info:build 4 warnings and 2 errors generated.
:info:build make[3]: *** [file.lo] Error 1
:info:build make[3]: *** Waiting for unfinished jobs....
:info:build 4 warnings generated.
:info:build 5 warnings generated.
:info:build 7 warnings generated.
:info:build make[3]: Leaving directory `/opt/local/var/macports/build/_opt_local_var_macports_sources_rsync.macports.org_macports_release_tarballs_ports_sysutils_mc/mc/work/mc-4.8.19/src/filemanager'
:info:build make[2]: *** [all-recursive] Error 1
:info:build make[2]: Leaving directory `/opt/local/var/macports/build/_opt_local_var_macports_sources_rsync.macports.org_macports_release_tarballs_ports_sysutils_mc/mc/work/mc-4.8.19/src'
:info:build make[1]: *** [all-recursive] Error 1
:info:build make[1]: Leaving directory `/opt/local/var/macports/build/_opt_local_var_macports_sources_rsync.macports.org_macports_release_tarballs_ports_sysutils_mc/mc/work/mc-4.8.19'
:info:build make: *** [all] Error 2
:info:build make: Leaving directory `/opt/local/var/macports/build/_opt_local_var_macports_sources_rsync.macports.org_macports_release_tarballs_ports_sysutils_mc/mc/work/mc-4.8.19'
:info:build Command failed:  cd "/opt/local/var/macports/build/_opt_local_var_macports_sources_rsync.macports.org_macports_release_tarballs_ports_sysutils_mc/mc/work/mc-4.8.19" && /usr/bin/make -j4 -w all 
:info:build Exit code: 2
:error:build Failed to build mc: command execution failed
:debug:build Error code: CHILDSTATUS 647 2
:debug:build Backtrace: command execution failed
:debug:build     while executing
:debug:build "system {*}$notty {*}$nice $fullcmdstring"
:debug:build     invoked from within
:debug:build "command_exec build"
:debug:build     (procedure "portbuild::build_main" line 8)
:debug:build     invoked from within
:debug:build "$procedure $targetname"
:error:build See /opt/local/var/macports/logs/_opt_local_var_macports_sources_rsync.macports.org_macports_release_tarballs_ports_sysutils_mc/mc/main.log for details.

Change History (18)

comment:1 Changed 5 years ago by mf2k (Frank Schima)

Keywords: highsierra added
Owner: set to mkae
Status: newassigned

In the future, please Cc the port maintainers (port info --maintainers mc), if any.

comment:2 Changed 5 years ago by vovinacci (Volodymyr 'vovin' Shcherbinin)

I've found the source of the problem and now it compiles, however I'm not really sure if this is the good way to fix it. It seems that 10.13 uses st_mtimespec instead of st_mtim

So, simplest patch would be like this

--- src/filemanager/file.c	2017-09-22 15:47:42.000000000 +0300
+++ src/filemanager/file.c.orig	2017-09-22 15:47:16.000000000 +0300
@@ -665,8 +665,8 @@
 get_times (const struct stat *sb, mc_timesbuf_t * times)
 {
 #ifdef HAVE_UTIMENSAT
-    (*times)[0] = sb->st_atimespec;
-    (*times)[1] = sb->st_mtimespec;
+    (*times)[0] = sb->st_atim;
+    (*times)[1] = sb->st_mtim;
 #else
     times->actime = sb->st_atime;
     times->modtime = sb->st_mtime;

HAVE_UTIMENSAT is checked in ./configure, lines 19424-19433

for ac_func in utimensat
do :
  ac_fn_c_check_func "$LINENO" "utimensat" "ac_cv_func_utimensat"
if test "x$ac_cv_func_utimensat" = xyes; then :
  cat >>confdefs.h <<_ACEOF
#define HAVE_UTIMENSAT 1
_ACEOF

fi
done

What would be the best way to fix without breaking builds for old versions?

Last edited 5 years ago by vovinacci (Volodymyr 'vovin' Shcherbinin) (previous) (diff)

comment:3 Changed 5 years ago by vovinacci (Volodymyr 'vovin' Shcherbinin)

Cc: vovinacci added

comment:4 in reply to:  2 Changed 5 years ago by raimue (Rainer Müller)

You could use a patch that is only applied on this version of macOS. That would work like this:

if {[vercmp ${macosx_version} 10.13] >= 0} {
    patchfiles-append    patch-utimensat.diff
}

comment:5 Changed 5 years ago by rskallies

This works too.

if {[vercmp ${macosx_version} 10.13] >= 0} {
    configure.env-append    ac_cv_func_utimensat=no
}

comment:6 Changed 5 years ago by ryandesign (Ryan Schmidt)

Cc: v-g-ustinov added
Summary: Build mc fails on High Sierra (10)mc @4.8.19: error: no member named 'st_atim' in 'struct stat'

Has duplicate #54931.

comment:7 Changed 5 years ago by vovinacci (Volodymyr 'vovin' Shcherbinin)

comment:8 Changed 5 years ago by maehne (Torsten Maehne)

Cc: maehne added

comment:9 Changed 5 years ago by ryandesign (Ryan Schmidt)

Here is the upstream pull request where this issue is being discussed. We should probably wait to use whatever fix they come up with.

comment:10 in reply to:  9 Changed 5 years ago by ryandesign (Ryan Schmidt)

Replying to ryandesign:

We should probably wait to use whatever fix they come up with.

By which I mean, not the solution in MacPorts PR 840, and not the solution currently in MC PR 130.

comment:11 Changed 5 years ago by strike65 (Volker Thieme)

Hi!

Is there any new information? I am still not able to build mc under macOS High Sierra.

comment:12 Changed 5 years ago by kencu (Ken)

If you want this built today, add something like:

configure.env-append ac_cv_func_utimensat=no

to the portfile and you should be in business, while you are waiting for the final fix for this to be completed.

Last edited 5 years ago by kencu (Ken) (previous) (diff)

comment:13 Changed 5 years ago by v-g-ustinov (Vladimir Ustinov)

In a moment like this I really miss my old Linux laptop. Stupid mistakes like this takes hours to fix. Here it takes weeks :)

Suggestions like "if this doesn't work - compile it by yourself" is very Slackware-like style. Hope Apple will switch to it one day :)

comment:14 Changed 5 years ago by kencu (Ken)

You will find that, in general, MacPorts ports are very robust. They tend to be well thought out, carefully tested, and in most cases, they only include the final, accepted fix that the upstream authors want. That is why the ports all work so well, in general, almost all 20,000 of them, and often all the way back to MacOSX Tiger. That is amazing.

There is a price for that kind of thoroughness, however. MacPorts is stricter about it's fixes. Quick one-offs are completely frowned upon, generally for good reason. The final fixes take longer.

So if you're breaking new ground, like a new OS version, there will be delays like this. If you can, it helps a great deal to understand what a local repository is <https://guide.macports.org/chunked/development.local-repositories.html>, how to make one and use it, and how to do quick one-off fixes for yourself like this. Most of these fixes can be found with 5 or at most 10 minutes of Googling, and adding a small patch or an environment variable define to a Portfile is trivial once you do one or two.

Last edited 5 years ago by kencu (Ken) (previous) (diff)

comment:15 Changed 5 years ago by raimue (Rainer Müller)

The reason for the stall here is that upstream has not come up with a solution, so we could only apply a local patch. The patch that is currently proposed in PR840 would solve the compile error and allows to install mc. However, it removes access to the nanosecond resolution of timestamps which is a new feature of High Sierra. This is a tradeoff that has to be made and I do not know how that affects mc. As the port has a maintainer, I would expect Marko to decide how to proceed and whether to merge this as-is.

comment:16 Changed 5 years ago by vovinacci (Volodymyr 'vovin' Shcherbinin)

Proposed PR is working for me from the submission date like a charm. Shall we merge it or shall I close it to avoid stale PRs?

comment:18 Changed 5 years ago by kencu (Ken)

Resolution: fixed
Status: assignedclosed
Note: See TracTickets for help on using tickets.