Opened 3 years ago

Closed 8 months ago

Last modified 8 months ago

#54836 closed defect (wontfix)

defect: clang-3.7 fails to build on Snow Leopard, Mac OS X 10.6.8, in openmp variant

Reported by: ballapete (Peter Dyballa) Owned by: jeremyhu (Jeremy Huddleston Sequoia)
Priority: Normal Milestone:
Component: ports Version: 2.4.1
Keywords: snowleopard Cc: larryv@…, potmj
Port: clang-3.7

Description

llvm[3]: Copying runtime library macho_embedded/soft_static to build dir
cp /opt/local/var/macports/build/_opt_local_var_macports_sources_nue.de.rsync.macports.org_macports_release_tarballs_ports_lang_llvm-3.7/clang-3.7/work/build/tools/clang/runtime/compiler-rt/clang_macho_embedded/hard_pic/libcompiler_rt.a /opt/local/var/macports/build/_opt_local_var_macports_sources_nue.de.rsync.macports.org_macports_release_tarballs_ports_lang_llvm-3.7/clang-3.7/work/build/Release+Debug/lib/clang/3.7.1/lib/macho_embedded/libclang_rt.hard_pic.a
cp /opt/local/var/macports/build/_opt_local_var_macports_sources_nue.de.rsync.macports.org_macports_release_tarballs_ports_lang_llvm-3.7/clang-3.7/work/build/tools/clang/runtime/compiler-rt/clang_macho_embedded/soft_static/libcompiler_rt.a /opt/local/var/macports/build/_opt_local_var_macports_sources_nue.de.rsync.macports.org_macports_release_tarballs_ports_lang_llvm-3.7/clang-3.7/work/build/Release+Debug/lib/clang/3.7.1/lib/macho_embedded/libclang_rt.soft_static.a
cp /opt/local/var/macports/build/_opt_local_var_macports_sources_nue.de.rsync.macports.org_macports_release_tarballs_ports_lang_llvm-3.7/clang-3.7/work/build/tools/clang/runtime/compiler-rt/clang_macho_embedded/hard_static/libcompiler_rt.a /opt/local/var/macports/build/_opt_local_var_macports_sources_nue.de.rsync.macports.org_macports_release_tarballs_ports_lang_llvm-3.7/clang-3.7/work/build/Release+Debug/lib/clang/3.7.1/lib/macho_embedded/libclang_rt.hard_static.a
cp: /opt/local/var/macports/build/_opt_local_var_macports_sources_nue.de.rsync.macports.org_macports_release_tarballs_ports_lang_llvm-3.7/clang-3.7/work/build/tools/clang/runtime/compiler-rt/clang_darwin/10.4/libcompiler_rt.a: No such file or directory
make[3]: *** [/opt/local/var/macports/build/_opt_local_var_macports_sources_nue.de.rsync.macports.org_macports_release_tarballs_ports_lang_llvm-3.7/clang-3.7/work/build/Release+Debug/lib/clang/3.7.1/lib/darwin/libclang_rt.10.4.a] Error 1
make[3]: *** Waiting for unfinished jobs....
cp: /opt/local/var/macports/build/_opt_local_var_macports_sources_nue.de.rsync.macports.org_macports_release_tarballs_ports_lang_llvm-3.7/clang-3.7/work/build/tools/clang/runtime/compiler-rt/clang_macho_embedded/hard_pic/libcompiler_rt.a: No such file or directory
cp /opt/local/var/macports/build/_opt_local_var_macports_sources_nue.de.rsync.macports.org_macports_release_tarballs_ports_lang_llvm-3.7/clang-3.7/work/build/tools/clang/runtime/compiler-rt/clang_darwin/profile_osx/libcompiler_rt.a /opt/local/var/macports/build/_opt_local_var_macports_sources_nue.de.rsync.macports.org_macports_release_tarballs_ports_lang_llvm-3.7/clang-3.7/work/build/Release+Debug/lib/clang/3.7.1/lib/darwin/libclang_rt.profile_osx.a
cp: /opt/local/var/macports/build/_opt_local_var_macports_sources_nue.de.rsync.macports.org_macports_release_tarballs_ports_lang_llvm-3.7/clang-3.7/work/build/tools/clang/runtime/compiler-rt/clang_macho_embedded/soft_static/libcompiler_rt.a: No such file or directory
make[3]: *** [/opt/local/var/macports/build/_opt_local_var_macports_sources_nue.de.rsync.macports.org_macports_release_tarballs_ports_lang_llvm-3.7/clang-3.7/work/build/Release+Debug/lib/clang/3.7.1/lib/macho_embedded/libclang_rt.soft_static.a] Error 1
make[3]: *** [/opt/local/var/macports/build/_opt_local_var_macports_sources_nue.de.rsync.macports.org_macports_release_tarballs_ports_lang_llvm-3.7/clang-3.7/work/build/Release+Debug/lib/clang/3.7.1/lib/macho_embedded/libclang_rt.hard_pic.a] Error 1
cp /opt/local/var/macports/build/_opt_local_var_macports_sources_nue.de.rsync.macports.org_macports_release_tarballs_ports_lang_llvm-3.7/clang-3.7/work/build/tools/clang/runtime/compiler-rt/clang_darwin/cc_kext/libcompiler_rt.a /opt/local/var/macports/build/_opt_local_var_macports_sources_nue.de.rsync.macports.org_macports_release_tarballs_ports_lang_llvm-3.7/clang-3.7/work/build/Release+Debug/lib/clang/3.7.1/lib/darwin/libclang_rt.cc_kext.a
cp /opt/local/var/macports/build/_opt_local_var_macports_sources_nue.de.rsync.macports.org_macports_release_tarballs_ports_lang_llvm-3.7/clang-3.7/work/build/tools/clang/runtime/compiler-rt/clang_darwin/osx/libcompiler_rt.a /opt/local/var/macports/build/_opt_local_var_macports_sources_nue.de.rsync.macports.org_macports_release_tarballs_ports_lang_llvm-3.7/clang-3.7/work/build/Release+Debug/lib/clang/3.7.1/lib/darwin/libclang_rt.osx.a
cp: /opt/local/var/macports/build/_opt_local_var_macports_sources_nue.de.rsync.macports.org_macports_release_tarballs_ports_lang_llvm-3.7/clang-3.7/work/build/tools/clang/runtime/compiler-rt/clang_macho_embedded/hard_static/libcompiler_rt.a: No such file or directory
make[3]: *** [/opt/local/var/macports/build/_opt_local_var_macports_sources_nue.de.rsync.macports.org_macports_release_tarballs_ports_lang_llvm-3.7/clang-3.7/work/build/Release+Debug/lib/clang/3.7.1/lib/macho_embedded/libclang_rt.hard_static.a] Error 1
cp: cp /opt/local/var/macports/build/_opt_local_var_macports_sources_nue.de.rsync.macports.org_macports_release_tarballs_ports_lang_llvm-3.7/clang-3.7/work/build/tools/clang/runtime/compiler-rt/clang_darwin/eprintf/libcompiler_rt.a /opt/local/var/macports/build/_opt_local_var_macports_sources_nue.de.rsync.macports.org_macports_release_tarballs_ports_lang_llvm-3.7/clang-3.7/work/build/Release+Debug/lib/clang/3.7.1/lib/darwin/libclang_rt.eprintf.a
/opt/local/var/macports/build/_opt_local_var_macports_sources_nue.de.rsync.macports.org_macports_release_tarballs_ports_lang_llvm-3.7/clang-3.7/work/build/tools/clang/runtime/compiler-rt/clang_darwin/profile_osx/libcompiler_rt.a: No such file or directory
make[3]: *** [/opt/local/var/macports/build/_opt_local_var_macports_sources_nue.de.rsync.macports.org_macports_release_tarballs_ports_lang_llvm-3.7/clang-3.7/work/build/Release+Debug/lib/clang/3.7.1/lib/darwin/libclang_rt.profile_osx.a] Error 1
cp: /opt/local/var/macports/build/_opt_local_var_macports_sources_nue.de.rsync.macports.org_macports_release_tarballs_ports_lang_llvm-3.7/clang-3.7/work/build/tools/clang/runtime/compiler-rt/clang_darwin/cc_kext/libcompiler_rt.a: No such file or directory
make[3]: *** [/opt/local/var/macports/build/_opt_local_var_macports_sources_nue.de.rsync.macports.org_macports_release_tarballs_ports_lang_llvm-3.7/clang-3.7/work/build/Release+Debug/lib/clang/3.7.1/lib/darwin/libclang_rt.cc_kext.a] Error 1
cp: /opt/local/var/macports/build/_opt_local_var_macports_sources_nue.de.rsync.macports.org_macports_release_tarballs_ports_lang_llvm-3.7/clang-3.7/work/build/tools/clang/runtime/compiler-rt/clang_darwin/osx/libcompiler_rt.a: No such file or directory
make[3]: *** [/opt/local/var/macports/build/_opt_local_var_macports_sources_nue.de.rsync.macports.org_macports_release_tarballs_ports_lang_llvm-3.7/clang-3.7/work/build/Release+Debug/lib/clang/3.7.1/lib/darwin/libclang_rt.osx.a] Error 1
cp: /opt/local/var/macports/build/_opt_local_var_macports_sources_nue.de.rsync.macports.org_macports_release_tarballs_ports_lang_llvm-3.7/clang-3.7/work/build/tools/clang/runtime/compiler-rt/clang_darwin/eprintf/libcompiler_rt.a: No such file or directory
make[3]: *** [/opt/local/var/macports/build/_opt_local_var_macports_sources_nue.de.rsync.macports.org_macports_release_tarballs_ports_lang_llvm-3.7/clang-3.7/work/build/Release+Debug/lib/clang/3.7.1/lib/darwin/libclang_rt.eprintf.a] Error 1
rm /opt/local/var/macports/build/_opt_local_var_macports_sources_nue.de.rsync.macports.org_macports_release_tarballs_ports_lang_llvm-3.7/clang-3.7/work/build/Release+Debug/lib/clang/3.7.1/lib/macho_embedded/.dir /opt/local/var/macports/build/_opt_local_var_macports_sources_nue.de.rsync.macports.org_macports_release_tarballs_ports_lang_llvm-3.7/clang-3.7/work/build/Release+Debug/lib/clang/3.7.1/lib/darwin/.dir
make[3]: Leaving directory `/opt/local/var/macports/build/_opt_local_var_macports_sources_nue.de.rsync.macports.org_macports_release_tarballs_ports_lang_llvm-3.7/clang-3.7/work/build/tools/clang/runtime/compiler-rt'

Actually the path leads only to:

l /opt/local/var/macports/build/_opt_local_var_macports_sources_nue.de.rsync.macports.org_macports_release_tarballs_ports_lang_llvm-3.7/clang-3.7/work/build/tools/clang/runtime/compiler-rt/
total 24
-rw-r--r--  1 macports  admin  10392 14 Sep 14:06 Makefile

Attachments (1)

main.log (7.0 MB) - added by ballapete (Peter Dyballa) 3 years ago.

Change History (4)

Changed 3 years ago by ballapete (Peter Dyballa)

Attachment: main.log added

comment:1 Changed 3 years ago by mf2k (Frank Schima)

Cc: jeremyhu@… removed
Owner: set to jeremyhu
Status: newassigned

comment:2 Changed 2 years ago by potmj

Cc: potmj added

comment:3 Changed 8 months ago by kencu (Ken)

Resolution: wontfix
Status: assignedclosed

the issue here seems to be that during the cmake test compiles to sort out the clang rt architectures to build, all the tests fail for some reason and so no arches are left to build. Therefore, there is no library produced, therefore it is not found.

This is not something we'll be fixing, building clang-3.7 with an openmp variant on 10.6.8 using clang-3.9 to build it. Will close, therefore.

We do have openmp clangs working on 10.6.8 from clang-5.0 and up; clang 3.4 and clang 3.7 are for bootstrapping only at this time.

:info:build warning: clang_darwin.mk: dropping arch 'i386' from lib 'eprintf' (clang does not support it)
:info:build warning: clang_darwin.mk: dropping arch 'ppc' from lib '10.4' (clang does not support it)
:info:build warning: clang_darwin.mk: dropping arch 'i386' from lib '10.4' (clang does not support it)
:info:build warning: clang_darwin.mk: dropping arch 'x86_64' from lib '10.4' (clang does not support it)
:info:build warning: clang_darwin.mk: dropping arch 'ppc' from lib 'osx' (clang does not support it)
:info:build warning: clang_darwin.mk: dropping arch 'i386' from lib 'osx' (clang does not support it)
:info:build warning: clang_darwin.mk: dropping arch 'x86_64' from lib 'osx' (clang does not support it)
:info:build warning: clang_darwin.mk: dropping arch 'ppc' from lib 'cc_kext' (clang does not support it)
:info:build warning: clang_darwin.mk: dropping arch 'i386' from lib 'cc_kext' (clang does not support it)
:info:build warning: clang_darwin.mk: dropping arch 'x86_64' from lib 'cc_kext' (clang does not support it)
:info:build warning: clang_darwin.mk: dropping arch 'ppc' from lib 'profile_osx' (clang does not support it)
:info:build warning: clang_darwin.mk: dropping arch 'i386' from lib 'profile_osx' (clang does not support it)
:info:build warning: clang_darwin.mk: dropping arch 'x86_64' from lib 'profile_osx' (clang does not support it)
:info:build warning: clang_darwin.mk: dropping arch 'i386' from lib 'asan_osx_dynamic' (clang does not support it)
:info:build warning: clang_darwin.mk: dropping arch 'x86_64' from lib 'asan_osx_dynamic' (clang does not support it)
:info:build warning: clang_darwin.mk: dropping arch 'i386' from lib 'ubsan_osx_dynamic' (clang does not support it)
:info:build warning: clang_darwin.mk: dropping arch 'x86_64' from lib 'ubsan_osx_dynamic' (clang does not support it)
Last edited 8 months ago by kencu (Ken) (previous) (diff)
Note: See TracTickets for help on using tickets.