Opened 2 years ago

Closed 2 years ago

#57182 closed defect (fixed)

texlive-bin @2018.47642+x11: rebuild error

Reported by: aeronova Owned by: drkp (Dan Ports)
Priority: Normal Milestone:
Component: ports Version: 2.5.3
Keywords: Cc: hapaguy (Brian Kurt Fujikawa), diochnos, dershow, dgonyier (Dwaine Gonyier), captainproton1971 (Captain Proton), ksze (Kal Sze), olupton (Olli Lupton)
Port: texlive-bin

Description

I tried to rebuild texlive to fix the following problem:

dyld: Library not loaded: /opt/local/lib/libpoppler.79.dylib
  Referenced from: /opt/local/bin/pdflatex
  Reason: image not found
Abort trap: 6

The error says

--->  Building texlive-bin
Error: Failed to build texlive-bin: command execution failed
Error: See /opt/local/var/macports/logs/_opt_local_var_macports_sources_rsync.macports.org_macports_release_tarballs_ports_tex_texlive-bin/texlive-bin/main.log for details.
Error: rev-upgrade failed: Error rebuilding texlive-bin
Error: Follow https://guide.macports.org/#project.tickets to report a bug.

The last part of the log file is

:info:build /usr/bin/clang -DHAVE_CONFIG_H -I. -I./w2c  -I/opt/local/var/macports/build/_opt_local_var_macports_sources_rsync.macports.org_macports_release_tarballs_ports_tex_texlive-bin/texlive-bin/work/texlive-source-2018.47642-stripped/texk -I/opt/local/var/macports/build/_opt_local_var_macports_sources_rsync.macports.org_macports_release_tarballs_ports_tex_texlive-bin/texlive-bin/work/texlive-source-2018.47642-stripped/texk  -I/opt/local/include/libpng16 -DPOPPLER_VERSION=\"0.69.0\" -I/opt/local/include/poppler -I./libmd5 -DpdfTeX -I./luatexdir -I./luatexdir/unilib -I./luatexdir/luafontloader/fontforge/inc -DLUA_FF_LIB=1 -I./luatexdir/luafontloader/fontforge/fontforge -DSYNCTEX_ENGINE_H='<synctex-luatex.h>' -I./synctexdir -I/opt/local/var/macports/build/_opt_local_var_macports_sources_rsync.macports.org_macports_release_tarballs_ports_tex_texlive-bin/texlive-bin/work/texlive-source-2018.47642-stripped/libs/lua52/include -DLUA_COMPAT_MODULE -DLUAI_HASHLIMIT=6 -DLUA_USE_POSIX -DLUA_USE_DLOPEN -isystem/opt/local/include -Wimplicit -Wreturn-type -Wdeclaration-after-statement -Wno-unknown-pragmas -pipe -Os -arch x86_64 -MT libluatex_a-luafont.o -MD -MP -MF .deps/libluatex_a-luafont.Tpo -c -o libluatex_a-luafont.o `test -f 'luafont.c' || echo './'`luafont.c
:info:build mv -f luatexdir/lua/.deps/libluatex_a-lnewtokenlib.Tpo luatexdir/lua/.deps/libluatex_a-lnewtokenlib.Po
:info:build /usr/bin/clang -DHAVE_CONFIG_H -I. -I./w2c  -I/opt/local/var/macports/build/_opt_local_var_macports_sources_rsync.macports.org_macports_release_tarballs_ports_tex_texlive-bin/texlive-bin/work/texlive-source-2018.47642-stripped/texk -I/opt/local/var/macports/build/_opt_local_var_macports_sources_rsync.macports.org_macports_release_tarballs_ports_tex_texlive-bin/texlive-bin/work/texlive-source-2018.47642-stripped/texk  -I/opt/local/include/libpng16 -DPOPPLER_VERSION=\"0.69.0\" -I/opt/local/include/poppler -I./libmd5 -DpdfTeX -I./luatexdir -I./luatexdir/unilib -I./luatexdir/luafontloader/fontforge/inc -DLUA_FF_LIB=1 -I./luatexdir/luafontloader/fontforge/fontforge -DSYNCTEX_ENGINE_H='<synctex-luatex.h>' -I./synctexdir -I/opt/local/var/macports/build/_opt_local_var_macports_sources_rsync.macports.org_macports_release_tarballs_ports_tex_texlive-bin/texlive-bin/work/texlive-source-2018.47642-stripped/libs/lua52/include -DLUA_COMPAT_MODULE -DLUAI_HASHLIMIT=6 -DLUA_USE_POSIX -DLUA_USE_DLOPEN -isystem/opt/local/include -Wimplicit -Wreturn-type -Wdeclaration-after-statement -Wno-unknown-pragmas -pipe -Os -arch x86_64 -MT libluatex_a-mapfile.o -MD -MP -MF .deps/libluatex_a-mapfile.Tpo -c -o libluatex_a-mapfile.o `test -f 'mapfile.c' || echo './'`mapfile.c
:info:build 2 errors generated.
:info:build mv -f .deps/libluatex_a-dofont.Tpo .deps/libluatex_a-dofont.Po
:info:build make[5]: *** [luatexdir/lua/libluatex_a-lepdflib.o] Error 1
:info:build make[5]: *** Waiting for unfinished jobs....
:info:build mv -f .deps/libluatex_a-dvigen.Tpo .deps/libluatex_a-dvigen.Po
:info:build mv -f synctexdir/.deps/libluatex_a-synctex.Tpo synctexdir/.deps/libluatex_a-synctex.Po
:info:build mv -f .deps/libluatex_a-mapfile.Tpo .deps/libluatex_a-mapfile.Po
:info:build mv -f luatexdir/lua/.deps/libluatex_a-ltexlib.Tpo luatexdir/lua/.deps/libluatex_a-ltexlib.Po
:info:build mv -f .deps/libluatex_a-luafont.Tpo .deps/libluatex_a-luafont.Po
:info:build mv -f luatexdir/lua/.deps/libluatex_a-lnodelib.Tpo luatexdir/lua/.deps/libluatex_a-lnodelib.Po
:info:build make[5]: Leaving directory `/opt/local/var/macports/build/_opt_local_var_macports_sources_rsync.macports.org_macports_release_tarballs_ports_tex_texlive-bin/texlive-bin/work/texlive-source-2018.47642-stripped/texk/web2c'
:info:build make[4]: *** [all-recursive] Error 1
:info:build make[4]: Leaving directory `/opt/local/var/macports/build/_opt_local_var_macports_sources_rsync.macports.org_macports_release_tarballs_ports_tex_texlive-bin/texlive-bin/work/texlive-source-2018.47642-stripped/texk/web2c'
:info:build make[3]: *** [all] Error 2
:info:build make[3]: Leaving directory `/opt/local/var/macports/build/_opt_local_var_macports_sources_rsync.macports.org_macports_release_tarballs_ports_tex_texlive-bin/texlive-bin/work/texlive-source-2018.47642-stripped/texk/web2c'
:info:build make[2]: *** [recurse] Error 1
:info:build make[2]: Leaving directory `/opt/local/var/macports/build/_opt_local_var_macports_sources_rsync.macports.org_macports_release_tarballs_ports_tex_texlive-bin/texlive-bin/work/texlive-source-2018.47642-stripped/texk'
:info:build make[1]: *** [all-recursive] Error 1
:info:build make[1]: Leaving directory `/opt/local/var/macports/build/_opt_local_var_macports_sources_rsync.macports.org_macports_release_tarballs_ports_tex_texlive-bin/texlive-bin/work/texlive-source-2018.47642-stripped/texk'
:info:build make: *** [all-recursive] Error 1
:info:build make: Leaving directory `/opt/local/var/macports/build/_opt_local_var_macports_sources_rsync.macports.org_macports_release_tarballs_ports_tex_texlive-bin/texlive-bin/work/texlive-source-2018.47642-stripped'
:info:build Command failed:  cd "/opt/local/var/macports/build/_opt_local_var_macports_sources_rsync.macports.org_macports_release_tarballs_ports_tex_texlive-bin/texlive-bin/work/texlive-source-2018.47642-stripped" && /usr/bin/make -j8 -w all
:info:build Exit code: 2
:error:build Failed to build texlive-bin: command execution failed
:debug:build Error code: CHILDSTATUS 58230 2
:debug:build Backtrace: command execution failed
:debug:build     while executing
:debug:build "system {*}$notty {*}$nice $fullcmdstring"
:debug:build     invoked from within
:debug:build "command_exec build"
:debug:build     (procedure "portbuild::build_main" line 8)
:debug:build     invoked from within
:debug:build "$procedure $targetname"
:error:build See /opt/local/var/macports/logs/_opt_local_var_macports_sources_rsync.macports.org_macports_release_tarballs_ports_tex_texlive-bin/texlive-bin/main.log for details.

Attachments (1)

main.log (1.6 MB) - added by aeronova 2 years ago.

Download all attachments as: .zip

Change History (12)

comment:1 Changed 2 years ago by hapaguy (Brian Kurt Fujikawa)

Cc: hapaguy added

comment:2 Changed 2 years ago by diochnos

Cc: diochnos added

comment:3 Changed 2 years ago by jmroot (Joshua Root)

Owner: set to drkp
Status: newassigned

comment:4 Changed 2 years ago by jmroot (Joshua Root)

Please attach the complete log; the snippet you've quoted doesn't contain the actual error.

comment:5 Changed 2 years ago by dershow

Cc: dershow added

comment:6 Changed 2 years ago by mf2k (Frank Schima)

Keywords: texlive-bin poppler removed

comment:7 Changed 2 years ago by dgonyier (Dwaine Gonyier)

Cc: dgonyier added

comment:8 Changed 2 years ago by captainproton1971 (Captain Proton)

Cc: captainproton1971 added

Changed 2 years ago by aeronova

Attachment: main.log added

comment:9 Changed 2 years ago by ksze (Kal Sze)

Cc: ksze added

comment:10 Changed 2 years ago by olupton (Olli Lupton)

Cc: olupton added

comment:11 Changed 2 years ago by drkp (Dan Ports)

Resolution: fixed
Status: assignedclosed

This was fixed in ecfb594.

Note: See TracTickets for help on using tickets.