Opened 3 weeks ago

Last modified 3 weeks ago

#62547 new defect

py27-pygtksourceview fail to build on macOS 11.2.3 Big Sur

Reported by: gagarine (Simon) Owned by:
Priority: Normal Milestone:
Component: ports Version: 2.6.4
Keywords: Cc: kencu (Ken)
Port: py27-pygtksourceview

Description (last modified by gagarine (Simon))

I tried to install https://ports.macports.org/port/cherrytree/ but it fails when building py27-pygtksourceview dependency.

End of the log:

$ cat /opt/local/var/macports/logs/_opt_local_var_macports_sources_rsync.macports.org_macports_release_tarballs_ports_python_py27-pygtksourceview/py27-pygtksourceview/main.log
version:1
:debug:sysinfo macOS 11.2 (darwin/20.3.0) arch i386
:debug:sysinfo MacPorts 2.6.4
:debug:sysinfo Xcode none
:debug:sysinfo SDK 11.2
:debug:sysinfo MACOSX_DEPLOYMENT_TARGET: 11.2
:debug:clean Attempting ln -sf /opt/local/var/macports/build/_opt_local_var_macports_sources_rsync.macports.org_macports_release_tarballs_ports_python_py27-pygtksourceview/py27-pygtksourceview/work /opt/local/var/macports/sources/rsync.macports.org/macports/release/tarballs/ports/python/py27-pygtksourceview/work
:debug:clean dropping privileges: euid changed to 503, egid changed to 502.
:debug:main Executing org.macports.main (py27-pygtksourceview)
:debug:main Privilege de-escalation not attempted as not running as root.
:debug:archivefetch archivefetch phase started at Wed Mar 24 21:08:17 CET 2021
:msg:archivefetch --->  Fetching archive for py27-pygtksourceview
:debug:archivefetch Executing org.macports.archivefetch (py27-pygtksourceview)
:debug:archivefetch euid/egid changed to: 0/0
:debug:archivefetch chowned /opt/local/var/macports/incoming to macports
:debug:archivefetch euid/egid changed to: 503/502
:info:archivefetch --->  py27-pygtksourceview-2.10.1_4.darwin_20.x86_64.tbz2 doesn't seem to exist in /opt/local/var/macports/incoming/verified
:msg:archivefetch --->  Attempting to fetch py27-pygtksourceview-2.10.1_4.darwin_20.x86_64.tbz2 from https://packages.macports.org/py27-pygtksourceview
:debug:archivefetch Fetching archive failed: The requested URL returned error: 404 Not Found
:msg:archivefetch --->  Attempting to fetch py27-pygtksourceview-2.10.1_4.darwin_20.x86_64.tbz2 from https://lil.fr.packages.macports.org/py27-pygtksourceview
:debug:archivefetch Fetching archive failed: The requested URL returned error: 404 Not Found
:msg:archivefetch --->  Attempting to fetch py27-pygtksourceview-2.10.1_4.darwin_20.x86_64.tbz2 from http://fco.it.packages.macports.org/py27-pygtksourceview
:debug:archivefetch Fetching archive failed: The requested URL returned error: 404 Not Found
:debug:archivefetch Privilege de-escalation not attempted as not running as root.
:debug:fetch fetch phase started at Wed Mar 24 21:08:20 CET 2021
:notice:fetch --->  Fetching distfiles for py27-pygtksourceview
:debug:fetch elevating privileges for fetch: euid changed to 0, egid changed to 0.
:debug:fetch dropping privileges: euid changed to 503, egid changed to 502.
:debug:fetch Executing org.macports.fetch (py27-pygtksourceview)
:info:fetch --->  pygtksourceview-2.10.1.tar.gz does not exist in /opt/local/var/macports/distfiles/py27-pygtksourceview
:notice:fetch --->  Attempting to fetch pygtksourceview-2.10.1.tar.gz from https://distfiles.macports.org/py27-pygtksourceview
:debug:fetch Privilege de-escalation not attempted as not running as root.
:debug:checksum checksum phase started at Wed Mar 24 21:08:25 CET 2021
:notice:checksum --->  Verifying checksums for py27-pygtksourceview
:debug:checksum Executing org.macports.checksum (py27-pygtksourceview)
:info:checksum --->  Checksumming pygtksourceview-2.10.1.tar.gz
:debug:checksum Calculated (md5) is 7a4dd87a515374637e1acf0b340eaa92
:debug:checksum Correct (md5) checksum for pygtksourceview-2.10.1.tar.gz
:debug:checksum Calculated (sha1) is fe4d3ce889427d5a5ae418415fc18f36b9b02524
:debug:checksum Correct (sha1) checksum for pygtksourceview-2.10.1.tar.gz
:debug:checksum Calculated (rmd160) is 867b6986beec48538bf4aa8af8a566578d16085c
:debug:checksum Correct (rmd160) checksum for pygtksourceview-2.10.1.tar.gz
:debug:checksum Privilege de-escalation not attempted as not running as root.
:debug:extract extract phase started at Wed Mar 24 21:08:25 CET 2021
:notice:extract --->  Extracting py27-pygtksourceview
:debug:extract Executing org.macports.extract (py27-pygtksourceview)
:info:extract --->  Extracting pygtksourceview-2.10.1.tar.gz
:debug:extract setting option extract.args to '/opt/local/var/macports/distfiles/py27-pygtksourceview/pygtksourceview-2.10.1.tar.gz'
:debug:extract Environment: 
:debug:extract CC_PRINT_OPTIONS='YES'
:debug:extract CC_PRINT_OPTIONS_FILE='/opt/local/var/macports/build/_opt_local_var_macports_sources_rsync.macports.org_macports_release_tarballs_ports_python_py27-pygtksourceview/py27-pygtksourceview/work/.CC_PRINT_OPTIONS'
:debug:extract CPATH='/opt/local/include'
:debug:extract DEVELOPER_DIR='/Library/Developer/CommandLineTools'
:debug:extract LIBRARY_PATH='/opt/local/lib'
:debug:extract MACOSX_DEPLOYMENT_TARGET='11.2'
:debug:extract SDKROOT='/Library/Developer/CommandLineTools/SDKs/MacOSX.sdk'
:info:extract Executing:  cd "/opt/local/var/macports/build/_opt_local_var_macports_sources_rsync.macports.org_macports_release_tarballs_ports_python_py27-pygtksourceview/py27-pygtksourceview/work" && /usr/bin/gzip -dc '/opt/local/var/macports/distfiles/py27-pygtksourceview/pygtksourceview-2.10.1.tar.gz' | /usr/bin/tar -xf - 
:debug:extract system:  cd "/opt/local/var/macports/build/_opt_local_var_macports_sources_rsync.macports.org_macports_release_tarballs_ports_python_py27-pygtksourceview/py27-pygtksourceview/work" && /usr/bin/gzip -dc '/opt/local/var/macports/distfiles/py27-pygtksourceview/pygtksourceview-2.10.1.tar.gz' | /usr/bin/tar -xf - 
:debug:extract euid/egid changed to: 0/0
:debug:extract chowned /opt/local/var/macports/build/_opt_local_var_macports_sources_rsync.macports.org_macports_release_tarballs_ports_python_py27-pygtksourceview/py27-pygtksourceview/work to macports
:debug:extract euid/egid changed to: 503/502
:debug:extract Privilege de-escalation not attempted as not running as root.
:debug:patch patch phase started at Wed Mar 24 21:08:25 CET 2021
:debug:patch Executing org.macports.patch (py27-pygtksourceview)
:debug:patch Privilege de-escalation not attempted as not running as root.
:debug:configure configure phase started at Wed Mar 24 21:08:25 CET 2021
:notice:configure --->  Configuring py27-pygtksourceview
:debug:configure Preferred compilers: clang macports-clang-9.0 macports-clang-11 macports-clang-10
:debug:configure Using compiler 'Xcode Clang'
:debug:configure Executing org.macports.configure (py27-pygtksourceview)
:debug:configure Environment: 
:debug:configure CC='/usr/bin/clang'
:debug:configure CC_PRINT_OPTIONS='YES'
:debug:configure CC_PRINT_OPTIONS_FILE='/opt/local/var/macports/build/_opt_local_var_macports_sources_rsync.macports.org_macports_release_tarballs_ports_python_py27-pygtksourceview/py27-pygtksourceview/work/.CC_PRINT_OPTIONS'
:debug:configure CFLAGS='-pipe -Os -isysroot/Library/Developer/CommandLineTools/SDKs/MacOSX.sdk -arch x86_64'
:debug:configure CPATH='/opt/local/include'
:debug:configure CPPFLAGS='-I/opt/local/include -isysroot/Library/Developer/CommandLineTools/SDKs/MacOSX.sdk'
:debug:configure CXX='/usr/bin/clang++'
:debug:configure CXXFLAGS='-pipe -Os -stdlib=libc++ -isysroot/Library/Developer/CommandLineTools/SDKs/MacOSX.sdk -arch x86_64'
:debug:configure DEVELOPER_DIR='/Library/Developer/CommandLineTools'
:debug:configure F90FLAGS='-pipe -Os -m64'
:debug:configure FCFLAGS='-pipe -Os -m64'
:debug:configure FFLAGS='-pipe -Os -m64'
:debug:configure INSTALL='/usr/bin/install -c'
:debug:configure LDFLAGS='-L/opt/local/lib -Wl,-headerpad_max_install_names -Wl,-syslibroot,/Library/Developer/CommandLineTools/SDKs/MacOSX.sdk -arch x86_64'
:debug:configure LIBRARY_PATH='/opt/local/lib'
:debug:configure MACOSX_DEPLOYMENT_TARGET='11.2'
:debug:configure OBJC='/usr/bin/clang'
:debug:configure OBJCFLAGS='-pipe -Os -isysroot/Library/Developer/CommandLineTools/SDKs/MacOSX.sdk -arch x86_64'
:debug:configure OBJCXX='/usr/bin/clang++'
:debug:configure OBJCXXFLAGS='-pipe -Os -stdlib=libc++ -isysroot/Library/Developer/CommandLineTools/SDKs/MacOSX.sdk -arch x86_64'
:debug:configure PKG_CONFIG_PATH='/opt/local/Library/Frameworks/Python.framework/Versions/2.7/lib/pkgconfig:/opt/local/lib/pkgconfig'
:debug:configure PYTHON='/opt/local/bin/python2.7'
:debug:configure SDKROOT='/Library/Developer/CommandLineTools/SDKs/MacOSX.sdk'
:info:configure Executing:  cd "/opt/local/var/macports/build/_opt_local_var_macports_sources_rsync.macports.org_macports_release_tarballs_ports_python_py27-pygtksourceview/py27-pygtksourceview/work/pygtksourceview-2.10.1" && ./configure --prefix=/opt/local/Library/Frameworks/Python.framework/Versions/2.7 --includedir=/opt/local/Library/Frameworks/Python.framework/Versions/2.7/include/python2.7 
:debug:configure system:  cd "/opt/local/var/macports/build/_opt_local_var_macports_sources_rsync.macports.org_macports_release_tarballs_ports_python_py27-pygtksourceview/py27-pygtksourceview/work/pygtksourceview-2.10.1" && ./configure --prefix=/opt/local/Library/Frameworks/Python.framework/Versions/2.7 --includedir=/opt/local/Library/Frameworks/Python.framework/Versions/2.7/include/python2.7 
:info:configure checking for a BSD-compatible install... /usr/bin/install -c
:info:configure checking whether build environment is sane... yes
:info:configure checking for a thread-safe mkdir -p... ./install-sh -c -d
:info:configure checking for gawk... no
:info:configure checking for mawk... no
:info:configure checking for nawk... no
:info:configure checking for awk... awk
:info:configure checking whether make sets $(MAKE)... yes
:info:configure checking build system type... x86_64-apple-darwin20.3.0
:info:configure checking host system type... x86_64-apple-darwin20.3.0
:info:configure checking for some Win32 platform... no
:info:configure checking for native Win32... no
:info:configure checking for style of include used by make... GNU
:info:configure checking for gcc... /usr/bin/clang
:info:configure checking whether the C compiler works... yes
:info:configure checking for C compiler default output file name... a.out
:info:configure checking for suffix of executables... 
:info:configure checking whether we are cross compiling... no
:info:configure checking for suffix of object files... o
:info:configure checking whether we are using the GNU C compiler... yes
:info:configure checking whether /usr/bin/clang accepts -g... yes
:info:configure checking for /usr/bin/clang option to accept ISO C89... none needed
:info:configure checking dependency style of /usr/bin/clang... gcc3
:info:configure checking for a sed that does not truncate output... /opt/local/bin/gsed
:info:configure checking for grep that handles long lines and -e... /usr/bin/grep
:info:configure checking for egrep... /usr/bin/grep -E
:info:configure checking for fgrep... /usr/bin/grep -F
:info:configure checking for ld used by /usr/bin/clang... /Library/Developer/CommandLineTools/usr/bin/ld
:info:configure checking if the linker (/Library/Developer/CommandLineTools/usr/bin/ld) is GNU ld... no
:info:configure checking for BSD- or MS-compatible name lister (nm)... /usr/bin/nm -B
:info:configure checking the name lister (/usr/bin/nm -B) interface... BSD nm
:info:configure checking whether ln -s works... yes
:info:configure checking the maximum length of command line arguments... 786432
:info:configure checking whether the shell understands some XSI constructs... yes
:info:configure checking whether the shell understands "+="... yes
:info:configure checking for /Library/Developer/CommandLineTools/usr/bin/ld option to reload object files... -r
:info:configure checking for objdump... objdump
:info:configure checking how to recognize dependent libraries... pass_all
:info:configure checking for ar... ar
:info:configure checking for strip... strip
:info:configure checking for ranlib... ranlib
:info:configure checking command to parse /usr/bin/nm -B output from /usr/bin/clang object... ok
:info:configure checking for dsymutil... dsymutil
:info:configure checking for nmedit... nmedit
:info:configure checking for lipo... lipo
:info:configure checking for otool... otool
:info:configure checking for otool64... no
:info:configure checking for -single_module linker flag... yes
:info:configure checking for -exported_symbols_list linker flag... yes
:info:configure checking how to run the C preprocessor... /usr/bin/clang -E
:info:configure checking for ANSI C header files... yes
:info:configure checking for sys/types.h... yes
:info:configure checking for sys/stat.h... yes
:info:configure checking for stdlib.h... yes
:info:configure checking for string.h... yes
:info:configure checking for memory.h... yes
:info:configure checking for strings.h... yes
:info:configure checking for inttypes.h... yes
:info:configure checking for stdint.h... yes
:info:configure checking for unistd.h... yes
:info:configure checking for dlfcn.h... yes
:info:configure checking for objdir... .libs
:info:configure checking if /usr/bin/clang supports -fno-rtti -fno-exceptions... yes
:info:configure checking for /usr/bin/clang option to produce PIC... -fno-common -DPIC
:info:configure checking if /usr/bin/clang PIC flag -fno-common -DPIC works... yes
:info:configure checking if /usr/bin/clang static flag -static works... no
:info:configure checking if /usr/bin/clang supports -c -o file.o... yes
:info:configure checking if /usr/bin/clang supports -c -o file.o... (cached) yes
:info:configure checking whether the /usr/bin/clang linker (/Library/Developer/CommandLineTools/usr/bin/ld) supports shared libraries... yes
:info:configure checking dynamic linker characteristics... darwin20.3.0 dyld
:info:configure checking how to hardcode library paths into programs... immediate
:info:configure checking whether stripping libraries is possible... yes
:info:configure checking if libtool supports shared libraries... yes
:info:configure checking whether to build shared libraries... yes
:info:configure checking whether to build static libraries... no
:info:configure configure: creating ./config.lt
:info:configure config.lt: creating libtool
:info:configure checking whether /opt/local/bin/python2.7 version >= 2.2... yes
:info:configure checking for /opt/local/bin/python2.7 version... 2.7
:info:configure checking for /opt/local/bin/python2.7 platform... darwin
:info:configure checking for /opt/local/bin/python2.7 script directory... ${prefix}/lib/python2.7/site-packages
:info:configure checking for /opt/local/bin/python2.7 extension module directory... ${exec_prefix}/lib/python2.7/site-packages
:info:configure checking for headers required to compile python extensions... found
:info:configure checking for pkg-config... /opt/local/bin/pkg-config
:info:configure checking pkg-config is at least version 0.9.0... yes
:info:configure checking for PYGOBJECT... yes
:info:configure checking for xsltproc... /opt/local/bin/xsltproc
:info:configure checking for PYGTKSOURCEVIEW... yes
:info:configure checking for pygtk codegen... /opt/local/Library/Frameworks/Python.framework/Versions/2.7/share/pygobject/2.0/codegen
:info:configure yes
:info:configure checking whether /usr/bin/clang understands -Wall... yes
:info:configure checking whether /usr/bin/clang understands -fno-strict-aliasing... yes
:info:configure checking for gtkdoc-check... no
:info:configure checking for gtkdoc-rebase... no
:info:configure checking for gtkdoc-mkpdf... no
:info:configure checking whether to build gtk-doc documentation... no
:info:configure configure: creating ./config.status
:info:configure config.status: creating Makefile
:info:configure config.status: creating pygtksourceview-2.0.pc
:info:configure config.status: creating test/Makefile
:info:configure config.status: creating docs/Makefile
:info:configure config.status: creating docs/reference/entities.docbook
:info:configure config.status: creating config.h
:info:configure config.status: executing depfiles commands
:info:configure config.status: executing libtool commands
:debug:configure Privilege de-escalation not attempted as not running as root.
:debug:build build phase started at Wed Mar 24 21:08:43 CET 2021
:notice:build --->  Building py27-pygtksourceview
:debug:build Executing org.macports.build (py27-pygtksourceview)
:debug:build Environment: 
:debug:build CC_PRINT_OPTIONS='YES'
:debug:build CC_PRINT_OPTIONS_FILE='/opt/local/var/macports/build/_opt_local_var_macports_sources_rsync.macports.org_macports_release_tarballs_ports_python_py27-pygtksourceview/py27-pygtksourceview/work/.CC_PRINT_OPTIONS'
:debug:build CPATH='/opt/local/include'
:debug:build DEVELOPER_DIR='/Library/Developer/CommandLineTools'
:debug:build LIBRARY_PATH='/opt/local/lib'
:debug:build MACOSX_DEPLOYMENT_TARGET='11.2'
:debug:build SDKROOT='/Library/Developer/CommandLineTools/SDKs/MacOSX.sdk'
:info:build Executing:  cd "/opt/local/var/macports/build/_opt_local_var_macports_sources_rsync.macports.org_macports_release_tarballs_ports_python_py27-pygtksourceview/py27-pygtksourceview/work/pygtksourceview-2.10.1" && /usr/bin/make -j4 -w all 
:debug:build system:  cd "/opt/local/var/macports/build/_opt_local_var_macports_sources_rsync.macports.org_macports_release_tarballs_ports_python_py27-pygtksourceview/py27-pygtksourceview/work/pygtksourceview-2.10.1" && /usr/bin/make -j4 -w all 
:info:build make: Entering directory `/opt/local/var/macports/build/_opt_local_var_macports_sources_rsync.macports.org_macports_release_tarballs_ports_python_py27-pygtksourceview/py27-pygtksourceview/work/pygtksourceview-2.10.1'
:info:build /Library/Developer/CommandLineTools/usr/bin/make  all-recursive
:info:build make[1]: Entering directory `/opt/local/var/macports/build/_opt_local_var_macports_sources_rsync.macports.org_macports_release_tarballs_ports_python_py27-pygtksourceview/py27-pygtksourceview/work/pygtksourceview-2.10.1'
:info:build Making all in test
:info:build make[2]: Entering directory `/opt/local/var/macports/build/_opt_local_var_macports_sources_rsync.macports.org_macports_release_tarballs_ports_python_py27-pygtksourceview/py27-pygtksourceview/work/pygtksourceview-2.10.1/test'
:info:build make[2]: Nothing to be done for `all'.
:info:build make[2]: Leaving directory `/opt/local/var/macports/build/_opt_local_var_macports_sources_rsync.macports.org_macports_release_tarballs_ports_python_py27-pygtksourceview/py27-pygtksourceview/work/pygtksourceview-2.10.1/test'
:info:build Making all in docs
:info:build make[2]: Entering directory `/opt/local/var/macports/build/_opt_local_var_macports_sources_rsync.macports.org_macports_release_tarballs_ports_python_py27-pygtksourceview/py27-pygtksourceview/work/pygtksourceview-2.10.1/docs'
:info:build /opt/local/bin/python2.7 -c 'import datetime; print datetime.date.today()' > reference/builddate.xml
:info:build xsltproc --nonet --xinclude -o ../docs/html/ \
:info:build 		 --path ../docs/reference:./reference \
:info:build 		 --stringparam gtkdoc.bookname "pygtksourceview2" \
:info:build 		 --stringparam gtkdoc.version . \
:info:build 		 /opt/local/Library/Frameworks/Python.framework/Versions/2.7/share/pygobject/xsl/ref-html-style.xsl ./reference/gtksourceview2-ref.xml
:info:build I/O error : Attempt to load network entity http://www.oasis-open.org/docbook/xml/4.1.2/docbookx.dtd
:info:build ./reference/gtksourceview2-ref.xml:7: warning: failed to load external entity "http://www.oasis-open.org/docbook/xml/4.1.2/docbookx.dtd"
:info:build ]>
:info:build   ^
:info:build I/O error : Attempt to load network entity http://www.oasis-open.org/docbook/xml/4.1.2/docbookx.dtd
:info:build reference/gtksourceview2-gtksourceview.xml:3: warning: failed to load external entity "http://www.oasis-open.org/docbook/xml/4.1.2/docbookx.dtd"
:info:build     "http://www.oasis-open.org/docbook/xml/4.1.2/docbookx.dtd">
:info:build                                                                ^
:info:build reference/gtksourceview2-gtksourceview.xml:428: parser error : Entity 'nbsp' not defined
:info:build           <term><parameter role="keyword">buffer</parameter>&nbsp;:</term>
:info:build                                                                   ^
:info:build reference/gtksourceview2-gtksourceview.xml:433: parser error : Entity 'nbsp' not defined
:info:build           <term><emphasis>Returns</emphasis>&nbsp;:</term>
:info:build                                                   ^
:info:build reference/gtksourceview2-gtksourceview.xml:466: parser error : Entity 'nbsp' not defined
:info:build           <term><emphasis>Returns</emphasis>&nbsp;:</term>
:info:build                                                   ^
:info:build reference/gtksourceview2-gtksourceview.xml:488: parser error : Entity 'nbsp' not defined
:info:build           <term><emphasis>Returns</emphasis>&nbsp;:</term>
:info:build                                                   ^
:info:build reference/gtksourceview2-gtksourceview.xml:510: parser error : Entity 'nbsp' not defined
:info:build           <term><emphasis>Returns</emphasis>&nbsp;:</term>
:info:build                                                   ^
:info:build reference/gtksourceview2-gtksourceview.xml:535: parser error : Entity 'nbsp' not defined
:info:build           <term><emphasis>Returns</emphasis>&nbsp;:</term>
:info:build                                                   ^
:info:build reference/gtksourceview2-gtksourceview.xml:557: parser error : Entity 'nbsp' not defined
:info:build           <term><emphasis>Returns</emphasis>&nbsp;:</term>
:info:build                                                   ^
:info:build reference/gtksourceview2-gtksourceview.xml:580: parser error : Entity 'nbsp' not defined
:info:build           <term><emphasis>Returns</emphasis>&nbsp;:</term>
:info:build                                                   ^
:info:build reference/gtksourceview2-gtksourceview.xml:603: parser error : Entity 'nbsp' not defined
:info:build           <term><emphasis>Returns</emphasis>&nbsp;:</term>
:info:build                                                   ^
:info:build reference/gtksourceview2-gtksourceview.xml:626: parser error : Entity 'nbsp' not defined
:info:build           <term><parameter role="keyword">category</parameter>&nbsp;:</term>
:info:build                                                                     ^
:info:build reference/gtksourceview2-gtksourceview.xml:630: parser error : Entity 'nbsp' not defined
:info:build           <term><emphasis>Returns</emphasis>&nbsp;:</term>
:info:build                                                   ^
:info:build reference/gtksourceview2-gtksourceview.xml:652: parser error : Entity 'nbsp' not defined
:info:build           <term><parameter role="keyword">category</parameter>&nbsp;:</term>
:info:build                                                                     ^
:info:build reference/gtksourceview2-gtksourceview.xml:656: parser error : Entity 'nbsp' not defined
:info:build           <term><emphasis>Returns</emphasis>&nbsp;:</term>
:info:build                                                   ^
:info:build reference/gtksourceview2-gtksourceview.xml:678: parser error : Entity 'nbsp' not defined
:info:build           <term><parameter role="keyword">category</parameter>&nbsp;:</term>
:info:build                                                                     ^
:info:build reference/gtksourceview2-gtksourceview.xml:682: parser error : Entity 'nbsp' not defined
:info:build           <term><emphasis>Returns</emphasis>&nbsp;:</term>
:info:build                                                   ^
:info:build reference/gtksourceview2-gtksourceview.xml:704: parser error : Entity 'nbsp' not defined
:info:build           <term><emphasis>Returns</emphasis>&nbsp;:</term>
:info:build                                                   ^
:info:build reference/gtksourceview2-gtksourceview.xml:725: parser error : Entity 'nbsp' not defined
:info:build           <term><emphasis>Returns</emphasis>&nbsp;:</term>
:info:build                                                   ^
:info:build reference/gtksourceview2-gtksourceview.xml:747: parser error : Entity 'nbsp' not defined
:info:build           <term><emphasis>Returns</emphasis>&nbsp;:</term>
:info:build                                                   ^
:info:build reference/gtksourceview2-gtksourceview.xml:769: parser error : Entity 'nbsp' not defined
:info:build           <term><emphasis>Returns</emphasis>&nbsp;:</term>
:info:build                                                   ^
:info:build reference/gtksourceview2-gtksourceview.xml:791: parser error : Entity 'nbsp' not defined
:info:build           <term><emphasis>Returns</emphasis>&nbsp;:</term>
:info:build                                                   ^
:info:build reference/gtksourceview2-gtksourceview.xml:815: parser error : Entity 'nbsp' not defined
:info:build           <term><emphasis>Returns</emphasis>&nbsp;:</term>
:info:build                                                   ^
:info:build reference/gtksourceview2-gtksourceview.xml:836: parser error : Entity 'nbsp' not defined
:info:build           <term><parameter role="keyword">enabled</parameter>&nbsp;:</term>
:info:build                                                                    ^
:info:build reference/gtksourceview2-gtksourceview.xml:856: parser error : Entity 'nbsp' not defined
:info:build           <term><parameter role="keyword">flags</parameter>&nbsp;:</term>
:info:build                                                                  ^
:info:build reference/gtksourceview2-gtksourceview.xml:879: parser error : Entity 'nbsp' not defined
:info:build           <term><parameter role="keyword">show</parameter>&nbsp;:</term>
:info:build                                                                 ^
:info:build reference/gtksourceview2-gtksourceview.xml:900: parser error : Entity 'nbsp' not defined
:info:build           <term><parameter role="keyword">enabled</parameter>&nbsp;:</term>
:info:build                                                                    ^
:info:build reference/gtksourceview2-gtksourceview.xml:923: parser error : Entity 'nbsp' not defined
:info:build           <term><parameter role="keyword">width</parameter>&nbsp;:</term>
:info:build                                                                  ^
:info:build reference/gtksourceview2-gtksourceview.xml:945: parser error : Entity 'nbsp' not defined
:info:build           <term><parameter role="keyword">enabled</parameter>&nbsp;:</term>
:info:build                                                                    ^
:info:build reference/gtksourceview2-gtksourceview.xml:967: parser error : Entity 'nbsp' not defined
:info:build           <term><parameter role="keyword">category</parameter>&nbsp;:</term>
:info:build                                                                     ^
:info:build reference/gtksourceview2-gtksourceview.xml:971: parser error : Entity 'nbsp' not defined
:info:build           <term><parameter role="keyword">color</parameter>&nbsp;:</term>
:info:build                                                                  ^
:info:build reference/gtksourceview2-gtksourceview.xml:995: parser error : Entity 'nbsp' not defined
:info:build           <term><parameter role="keyword">category</parameter>&nbsp;:</term>
:info:build                                                                     ^
:info:build reference/gtksourceview2-gtksourceview.xml:999: parser error : Entity 'nbsp' not defined
:info:build           <term><parameter role="keyword">name</parameter>&nbsp;:</term>
:info:build                                                                 ^
:info:build reference/gtksourceview2-gtksourceview.xml:1023: parser error : Entity 'nbsp' not defined
:info:build           <term><parameter role="keyword">category</parameter>&nbsp;:</term>
:info:build                                                                     ^
:info:build reference/gtksourceview2-gtksourceview.xml:1027: parser error : Entity 'nbsp' not defined
:info:build           <term><parameter role="keyword">pixbuf</parameter>&nbsp;:</term>
:info:build                                                                   ^
:info:build reference/gtksourceview2-gtksourceview.xml:1052: parser error : Entity 'nbsp' not defined
:info:build           <term><parameter role="keyword">category</parameter>&nbsp;:</term>
:info:build                                                                     ^
:info:build reference/gtksourceview2-gtksourceview.xml:1056: parser error : Entity 'nbsp' not defined
:info:build           <term><parameter role="keyword">simpara</parameter>&nbsp;:</term>
:info:build                                                                    ^
:info:build reference/gtksourceview2-gtksourceview.xml:1080: parser error : Entity 'nbsp' not defined
:info:build           <term><parameter role="keyword">category</parameter>&nbsp;:</term>
:info:build                                                                     ^
:info:build reference/gtksourceview2-gtksourceview.xml:1084: parser error : Entity 'nbsp' not defined
:info:build           <term><parameter role="keyword">pixbuf</parameter>&nbsp;:</term>
:info:build                                                                   ^
:info:build reference/gtksourceview2-gtksourceview.xml:1109: parser error : Entity 'nbsp' not defined
:info:build           <term><parameter role="keyword">category</parameter>&nbsp;:</term>
:info:build                                                                     ^
:info:build reference/gtksourceview2-gtksourceview.xml:1113: parser error : Entity 'nbsp' not defined
:info:build           <term><parameter role="keyword">priority</parameter>&nbsp;:</term>
:info:build                                                                     ^
:info:build reference/gtksourceview2-gtksourceview.xml:1137: parser error : Entity 'nbsp' not defined
:info:build           <term><parameter role="keyword">category</parameter>&nbsp;:</term>
:info:build                                                                     ^
:info:build reference/gtksourceview2-gtksourceview.xml:1141: parser error : Entity 'nbsp' not defined
:info:build           <term><parameter role="keyword">func</parameter>&nbsp;:</term>
:info:build                                                                 ^
:info:build reference/gtksourceview2-gtksourceview.xml:1146: parser error : Entity 'nbsp' not defined
:info:build           <term><parameter role="keyword">user_data</parameter>&nbsp;:</term>
:info:build                                                                      ^
:info:build reference/gtksourceview2-gtksourceview.xml:1181: parser error : Entity 'nbsp' not defined
:info:build           <term><parameter role="keyword">category</parameter>&nbsp;:</term>
:info:build                                                                     ^
:info:build reference/gtksourceview2-gtksourceview.xml:1185: parser error : Entity 'nbsp' not defined
:info:build           <term><parameter role="keyword">marker</parameter>&nbsp;:</term>
:info:build                                                                   ^
:info:build reference/gtksourceview2-gtksourceview.xml:1190: parser error : Entity 'nbsp' not defined
:info:build           <term><parameter role="keyword">user_data</parameter>&nbsp;:</term>
:info:build                                                                      ^
:info:build reference/gtksourceview2-gtksourceview.xml:1220: parser error : Entity 'nbsp' not defined
:info:build           <term><parameter role="keyword">pos</parameter>&nbsp;:</term>
:info:build                                                                ^
:info:build reference/gtksourceview2-gtksourceview.xml:1241: parser error : Entity 'nbsp' not defined
:info:build           <term><parameter role="keyword">show</parameter>&nbsp;:</term>
:info:build                                                                 ^
:info:build reference/gtksourceview2-gtksourceview.xml:1263: parser error : Entity 'nbsp' not defined
:info:build           <term><parameter role="keyword">show</parameter>&nbsp;:</term>
:info:build                                                                 ^
:info:build reference/gtksourceview2-gtksourceview.xml:1285: parser error : Entity 'nbsp' not defined
:info:build           <term><parameter role="keyword">show</parameter>&nbsp;:</term>
:info:build                                                                 ^
:info:build reference/gtksourceview2-gtksourceview.xml:1307: parser error : Entity 'nbsp' not defined
:info:build           <term><parameter role="keyword">smart_he</parameter>&nbsp;:</term>
:info:build                                                                     ^
:info:build reference/gtksourceview2-gtksourceview.xml:1328: parser error : Entity 'nbsp' not defined
:info:build           <term><parameter role="keyword">width</parameter>&nbsp;:</term>
:info:build                                                                  ^
:info:build reference/gtksourceview2-gtksourceview.xml:1364: parser error : Entity 'nbsp' not defined
:info:build 	  <term><parameter>sourceview</parameter>&nbsp;:</term>
:info:build 	                                               ^
:info:build reference/gtksourceview2-gtksourceview.xml:1369: parser error : Entity 'nbsp' not defined
:info:build 	  <term><parameter>iter</parameter>&nbsp;:</term>
:info:build 	                                         ^
:info:build reference/gtksourceview2-gtksourceview.xml:1375: parser error : Entity 'nbsp' not defined
:info:build 	  <term><parameter>event</parameter>&nbsp;:</term>
:info:build 	                                          ^
:info:build reference/gtksourceview2-gtksourceview.xml:1381: parser error : Entity 'nbsp' not defined
:info:build 	  <term><parameter>user_param1</parameter>&nbsp;:</term>
:info:build 	                                                ^
:info:build reference/gtksourceview2-gtksourceview.xml:1388: parser error : Entity 'nbsp' not defined
:info:build 	  <term><parameter>...</parameter>&nbsp;:</term>
:info:build 	                                        ^
:info:build reference/gtksourceview2-gtksourceview.xml:1413: parser error : Entity 'nbsp' not defined
:info:build 	  <term><parameter>sourceview</parameter>&nbsp;:</term>
:info:build 	                                               ^
:info:build reference/gtksourceview2-gtksourceview.xml:1418: parser error : Entity 'nbsp' not defined
:info:build 	  <term><parameter>user_param1</parameter>&nbsp;:</term>
:info:build 	                                                ^
:info:build reference/gtksourceview2-gtksourceview.xml:1425: parser error : Entity 'nbsp' not defined
:info:build 	  <term><parameter>...</parameter>&nbsp;:</term>
:info:build 	                                        ^
:info:build reference/gtksourceview2-gtksourceview.xml:1447: parser error : Entity 'nbsp' not defined
:info:build 	  <term><parameter>sourceview</parameter>&nbsp;:</term>
:info:build 	                                               ^
:info:build reference/gtksourceview2-gtksourceview.xml:1452: parser error : Entity 'nbsp' not defined
:info:build 	  <term><parameter>user_param1</parameter>&nbsp;:</term>
:info:build 	                                                ^
:info:build reference/gtksourceview2-gtksourceview.xml:1459: parser error : Entity 'nbsp' not defined
:info:build 	  <term><parameter>...</parameter>&nbsp;:</term>
:info:build 	                                        ^
:info:build I/O error : Attempt to load network entity http://www.oasis-open.org/docbook/xml/4.1.2/docbookx.dtd
:info:build reference/gtksourceview2-gtksourcebuffer.xml:2: warning: failed to load external entity "http://www.oasis-open.org/docbook/xml/4.1.2/docbookx.dtd"
:info:build cBook XML V4.1.2//EN" "http://www.oasis-open.org/docbook/xml/4.1.2/docbookx.dtd"
:info:build                                                                                ^
:info:build reference/gtksourceview2-gtksourcebuffer.xml:314: parser error : Entity 'nbsp' not defined
:info:build 	    <term><parameter role="keyword">table</parameter>&nbsp;:</term>
:info:build 	                                                           ^
:info:build reference/gtksourceview2-gtksourcebuffer.xml:319: parser error : Entity 'nbsp' not defined
:info:build 	    <term><parameter role="keyword">language</parameter>&nbsp;:</term>
:info:build 	                                                              ^
:info:build reference/gtksourceview2-gtksourcebuffer.xml:325: parser error : Entity 'nbsp' not defined
:info:build 	    <term><emphasis>Returns</emphasis>&nbsp;:</term>
:info:build 	                                            ^
:info:build reference/gtksourceview2-gtksourcebuffer.xml:352: parser error : Entity 'nbsp' not defined
:info:build         <term><parameter role="keyword">iter</parameter>&nbsp;:</term>
:info:build                                                               ^
:info:build reference/gtksourceview2-gtksourcebuffer.xml:356: parser error : Entity 'nbsp' not defined
:info:build         <term><parameter role="keyword">category</parameter>&nbsp;:</term>
:info:build                                                                   ^
:info:build reference/gtksourceview2-gtksourcebuffer.xml:360: parser error : Entity 'nbsp' not defined
:info:build         <term><emphasis>Returns</emphasis>&nbsp;:</term>
:info:build                                                 ^
:info:build reference/gtksourceview2-gtksourcebuffer.xml:399: parser error : Entity 'nbsp' not defined
:info:build 	      <term><emphasis>Returns</emphasis>&nbsp;:</term>
:info:build 	                                              ^
:info:build reference/gtksourceview2-gtksourcebuffer.xml:417: parser error : Entity 'nbsp' not defined
:info:build 	      <term><emphasis>Returns</emphasis>&nbsp;:</term>
:info:build 	                                              ^
:info:build reference/gtksourceview2-gtksourcebuffer.xml:436: parser error : Entity 'nbsp' not defined
:info:build         <term><parameter role="keyword">name</parameter>&nbsp;:</term>
:info:build                                                               ^
:info:build reference/gtksourceview2-gtksourcebuffer.xml:440: parser error : Entity 'nbsp' not defined
:info:build         <term><parameter role="keyword">category</parameter>&nbsp;:</term>
:info:build                                                                   ^
:info:build reference/gtksourceview2-gtksourcebuffer.xml:444: parser error : Entity 'nbsp' not defined
:info:build         <term><parameter role="keyword">where</parameter>&nbsp;:</term>
:info:build                                                                ^
:info:build reference/gtksourceview2-gtksourcebuffer.xml:448: parser error : Entity 'nbsp' not defined
:info:build         <term><emphasis>Returns</emphasis>&nbsp;:</term>
:info:build                                                 ^
:info:build reference/gtksourceview2-gtksourcebuffer.xml:501: parser error : Entity 'nbsp' not defined
:info:build         <term><parameter role="keyword">start</parameter>&nbsp;:</term>
:info:build                                                                ^
:info:build reference/gtksourceview2-gtksourcebuffer.xml:505: parser error : Entity 'nbsp' not defined
:info:build         <term><parameter role="keyword">end</parameter>&nbsp;:</term>
:info:build                                                              ^
:info:build reference/gtksourceview2-gtksourcebuffer.xml:525: parser error : Entity 'nbsp' not defined
:info:build         <term><parameter role="keyword">iter</parameter>&nbsp;:</term>
:info:build                                                               ^
:info:build reference/gtksourceview2-gtksourcebuffer.xml:529: parser error : Entity 'nbsp' not defined
:info:build         <term><parameter role="keyword">category</parameter>&nbsp;:</term>
:info:build                                                                   ^
:info:build reference/gtksourceview2-gtksourcebuffer.xml:533: parser error : Entity 'nbsp' not defined
:info:build         <term><emphasis>Returns</emphasis>&nbsp;:</term>
:info:build                                                 ^
:info:build reference/gtksourceview2-gtksourcebuffer.xml:554: parser error : Entity 'nbsp' not defined
:info:build 	      <term><emphasis>Returns</emphasis>&nbsp;:</term>
:info:build 	                                              ^
:info:build reference/gtksourceview2-gtksourcebuffer.xml:574: parser error : Entity 'nbsp' not defined
:info:build 	      <term><emphasis>Returns</emphasis>&nbsp;:</term>
:info:build 	                                              ^
:info:build reference/gtksourceview2-gtksourcebuffer.xml:593: parser error : Entity 'nbsp' not defined
:info:build 	      <term><emphasis>Returns</emphasis>&nbsp;:</term>
:info:build 	                                              ^
:info:build reference/gtksourceview2-gtksourcebuffer.xml:616: parser error : Entity 'nbsp' not defined
:info:build       <varlistentry><term><parameter role="keyword">iter</parameter>&nbsp;:</ter
:info:build                                                                           ^
:info:build reference/gtksourceview2-gtksourcebuffer.xml:619: parser error : Entity 'nbsp' not defined
:info:build       <varlistentry><term><parameter role="keyword">category</parameter>&nbsp;:<
:info:build                                                                               ^
:info:build reference/gtksourceview2-gtksourcebuffer.xml:622: parser error : Entity 'nbsp' not defined
:info:build       <varlistentry><term><emphasis>Returns</emphasis>&nbsp;:</term>
:info:build                                                             ^
:info:build reference/gtksourceview2-gtksourcebuffer.xml:642: parser error : Entity 'nbsp' not defined
:info:build       <varlistentry><term><parameter role="keyword">iter</parameter>&nbsp;:</ter
:info:build                                                                           ^
:info:build reference/gtksourceview2-gtksourcebuffer.xml:645: parser error : Entity 'nbsp' not defined
:info:build       <varlistentry><term><parameter role="keyword">category</parameter>&nbsp;:<
:info:build                                                                               ^
:info:build reference/gtksourceview2-gtksourcebuffer.xml:648: parser error : Entity 'nbsp' not defined
:info:build       <varlistentry><term><emphasis>Returns</emphasis>&nbsp;:</term>
:info:build                                                             ^
:info:build reference/gtksourceview2-gtksourcebuffer.xml:668: parser error : Entity 'nbsp' not defined
:info:build 	      <term><emphasis>Returns</emphasis>&nbsp;:</term>
:info:build 	                                              ^
:info:build reference/gtksourceview2-gtksourcebuffer.xml:687: parser error : Entity 'nbsp' not defined
:info:build         <varlistentry><term><emphasis>Returns</emphasis>&nbsp;:</term>
:info:build                                                               ^
:info:build reference/gtksourceview2-gtksourcebuffer.xml:723: parser error : Entity 'nbsp' not defined
:info:build         <term><parameter role="keyword">start</parameter>&nbsp;:</term>
:info:build                                                                ^
:info:build reference/gtksourceview2-gtksourcebuffer.xml:727: parser error : Entity 'nbsp' not defined
:info:build         <term><parameter role="keyword">end</parameter>&nbsp;:</term>
:info:build                                                              ^
:info:build reference/gtksourceview2-gtksourcebuffer.xml:731: parser error : Entity 'nbsp' not defined
:info:build         <term><parameter role="keyword">category</parameter>&nbsp;:</term>
:info:build                                                                   ^
:info:build reference/gtksourceview2-gtksourcebuffer.xml:752: parser error : Entity 'nbsp' not defined
:info:build 	  <term><parameter role="keyword">highlight</parameter>&nbsp;:</term>
:info:build 	                                                             ^
:info:build reference/gtksourceview2-gtksourcebuffer.xml:774: parser error : Entity 'nbsp' not defined
:info:build 	      <term><parameter role="keyword">highlight</parameter>&nbsp;:</term>
:info:build 	                                                                 ^
:info:build reference/gtksourceview2-gtksourcebuffer.xml:800: parser error : Entity 'nbsp' not defined
:info:build 	  <term><parameter role="keyword">language</parameter>&nbsp;:</term>
:info:build 	                                                            ^
:info:build reference/gtksourceview2-gtksourcebuffer.xml:825: parser error : Entity 'nbsp' not defined
:info:build 	      <term><parameter role="keyword">max_undo_levels</parameter>&nbsp;:</term>
:info:build 	                                                                       ^
:info:build reference/gtksourceview2-gtksourcebuffer.xml:855: parser error : Entity 'nbsp' not defined
:info:build 	      <term><parameter role="keyword">scheme</parameter>&nbsp;:</term>
:info:build 	                                                              ^
:info:build reference/gtksourceview2-gtksourcebuffer.xml:904: parser error : Entity 'nbsp' not defined
:info:build 	      <term><parameter>sourcebuffer</parameter>&nbsp;:</term>
:info:build 	                                                     ^
:info:build reference/gtksourceview2-gtksourcebuffer.xml:908: parser error : Entity 'nbsp' not defined
:info:build 	      <term><parameter>start</parameter>&nbsp;:</term>
:info:build 	                                              ^
:info:build reference/gtksourceview2-gtksourcebuffer.xml:913: parser error : Entity 'nbsp' not defined
:info:build 	      <term><parameter>end</parameter>&nbsp;:</term>
:info:build 	                                            ^
:info:build reference/gtksourceview2-gtksourcebuffer.xml:918: parser error : Entity 'nbsp' not defined
:info:build 	      <term><parameter>user_param1</parameter>&nbsp;:</term>
:info:build 	                                                    ^
:info:build reference/gtksourceview2-gtksourcebuffer.xml:923: parser error : Entity 'nbsp' not defined
:info:build 	      <term><parameter>...</parameter>&nbsp;:</term>
:info:build 	                                            ^
:info:build reference/gtksourceview2-gtksourcebuffer.xml:949: parser error : Entity 'nbsp' not defined
:info:build 	      <term><parameter>sourcebuffer</parameter>&nbsp;:</term>
:info:build 	                                                     ^
:info:build reference/gtksourceview2-gtksourcebuffer.xml:953: parser error : Entity 'nbsp' not defined
:info:build 	      <term><parameter>arg1</parameter>&nbsp;:</term>
:info:build 	                                             ^
:info:build reference/gtksourceview2-gtksourcebuffer.xml:958: parser error : Entity 'nbsp' not defined
:info:build 	      <term><parameter>user_param1</parameter>&nbsp;:</term>
:info:build 	                                                    ^
:info:build reference/gtksourceview2-gtksourcebuffer.xml:963: parser error : Entity 'nbsp' not defined
:info:build 	      <term><parameter>...</parameter>&nbsp;:</term>
:info:build 	                                            ^
:info:build reference/gtksourceview2-gtksourcebuffer.xml:993: parser error : Entity 'nbsp' not defined
:info:build 		<term><emphasis>iter</emphasis>&nbsp;:</term>
:info:build 		                                     ^
:info:build reference/gtksourceview2-gtksourcebuffer.xml:999: parser error : Entity 'nbsp' not defined
:info:build 		<term><emphasis>str</emphasis>&nbsp;:</term>
:info:build 		                                    ^
:info:build reference/gtksourceview2-gtksourcebuffer.xml:1005: parser error : Entity 'nbsp' not defined
:info:build 		<term><emphasis>flags</emphasis>&nbsp;:</term>
:info:build 		                                      ^
:info:build reference/gtksourceview2-gtksourcebuffer.xml:1011: parser error : Entity 'nbsp' not defined
:info:build 		<term><emphasis>limit</emphasis>&nbsp;:</term>
:info:build 		                                      ^
:info:build reference/gtksourceview2-gtksourcebuffer.xml:1017: parser error : Entity 'nbsp' not defined
:info:build         <term><emphasis>Returns</emphasis>&nbsp;:</term>
:info:build                                                 ^
:info:build reference/gtksourceview2-gtksourcebuffer.xml:1043: parser error : Entity 'nbsp' not defined
:info:build 		<term><emphasis>iter</emphasis>&nbsp;:</term>
:info:build 		                                     ^
:info:build reference/gtksourceview2-gtksourcebuffer.xml:1049: parser error : Entity 'nbsp' not defined
:info:build 		<term><emphasis>str</emphasis>&nbsp;:</term>
:info:build 		                                    ^
:info:build reference/gtksourceview2-gtksourcebuffer.xml:1055: parser error : Entity 'nbsp' not defined
:info:build 		<term><emphasis>flags</emphasis>&nbsp;:</term>
:info:build 		                                      ^
:info:build reference/gtksourceview2-gtksourcebuffer.xml:1061: parser error : Entity 'nbsp' not defined
:info:build 		<term><emphasis>limit</emphasis>&nbsp;:</term>
:info:build 		                                      ^
:info:build reference/gtksourceview2-gtksourcebuffer.xml:1067: parser error : Entity 'nbsp' not defined
:info:build         <term><emphasis>Returns</emphasis>&nbsp;:</term>
:info:build                                                 ^
:info:build I/O error : Attempt to load network entity http://www.oasis-open.org/docbook/xml/4.1.2/docbookx.dtd
:info:build reference/gtksourceview2-gtksourcegutter.xml:2: warning: failed to load external entity "http://www.oasis-open.org/docbook/xml/4.1.2/docbookx.dtd"
:info:build cBook XML V4.1.2//EN" "http://www.oasis-open.org/docbook/xml/4.1.2/docbookx.dtd"
:info:build                                                                                ^
:info:build reference/gtksourceview2-gtksourcegutter.xml:209: parser error : Entity 'nbsp' not defined
:info:build           <term><emphasis>Returns</emphasis>&nbsp;:</term>
:info:build                                                   ^
:info:build reference/gtksourceview2-gtksourcegutter.xml:233: parser error : Entity 'nbsp' not defined
:info:build         <term><parameter role="keyword">renderer</parameter>&nbsp;:</term>
:info:build                                                                   ^
:info:build reference/gtksourceview2-gtksourcegutter.xml:238: parser error : Entity 'nbsp' not defined
:info:build         <term><parameter role="keyword">position</parameter>&nbsp;:</term>
:info:build                                                                   ^
:info:build reference/gtksourceview2-gtksourcegutter.xml:275: parser error : Entity 'nbsp' not defined
:info:build         <term><parameter role="keyword">renderer</parameter>&nbsp;:</term>
:info:build                                                                   ^
:info:build reference/gtksourceview2-gtksourcegutter.xml:296: parser error : Entity 'nbsp' not defined
:info:build         <term><parameter role="keyword">renderer</parameter>&nbsp;:</term>
:info:build                                                                   ^
:info:build reference/gtksourceview2-gtksourcegutter.xml:301: parser error : Entity 'nbsp' not defined
:info:build         <term><parameter role="keyword">position</parameter>&nbsp;:</term>
:info:build                                                                   ^
:info:build reference/gtksourceview2-gtksourcegutter.xml:323: parser error : Entity 'nbsp' not defined
:info:build         <term><parameter role="keyword">renderer</parameter>&nbsp;:</term>
:info:build                                                                   ^
:info:build reference/gtksourceview2-gtksourcegutter.xml:328: parser error : Entity 'nbsp' not defined
:info:build         <term><parameter role="keyword">func</parameter>&nbsp;:</term>
:info:build                                                               ^
:info:build reference/gtksourceview2-gtksourcegutter.xml:333: parser error : Entity 'nbsp' not defined
:info:build         <term><parameter role="keyword">func_data</parameter>&nbsp;:</term>
:info:build                                                                    ^
:info:build reference/gtksourceview2-gtksourcegutter.xml:365: parser error : Entity 'nbsp' not defined
:info:build         <term><parameter role="keyword">renderer</parameter>&nbsp;:</term>
:info:build                                                                   ^
:info:build reference/gtksourceview2-gtksourcegutter.xml:370: parser error : Entity 'nbsp' not defined
:info:build         <term><parameter role="keyword">func</parameter>&nbsp;:</term>
:info:build                                                               ^
:info:build reference/gtksourceview2-gtksourcegutter.xml:375: parser error : Entity 'nbsp' not defined
:info:build         <term><parameter role="keyword">func_data</parameter>&nbsp;:</term>
:info:build                                                                    ^
:info:build reference/gtksourceview2-gtksourcegutter.xml:419: parser error : Entity 'nbsp' not defined
:info:build 	  <term><parameter>gutter</parameter>&nbsp;:</term>
:info:build 	                                           ^
:info:build reference/gtksourceview2-gtksourcegutter.xml:424: parser error : Entity 'nbsp' not defined
:info:build 	  <term><parameter>renderer</parameter>&nbsp;:</term>
:info:build 	                                             ^
:info:build reference/gtksourceview2-gtksourcegutter.xml:429: parser error : Entity 'nbsp' not defined
:info:build 	  <term><parameter>iter</parameter>&nbsp;:</term>
:info:build 	                                         ^
:info:build reference/gtksourceview2-gtksourcegutter.xml:434: parser error : Entity 'nbsp' not defined
:info:build 	  <term><parameter>event</parameter>&nbsp;:</term>
:info:build 	                                          ^
:info:build reference/gtksourceview2-gtksourcegutter.xml:439: parser error : Entity 'nbsp' not defined
:info:build 	  <term><parameter>user_param1</parameter>&nbsp;:</term>
:info:build 	                                                ^
:info:build reference/gtksourceview2-gtksourcegutter.xml:445: parser error : Entity 'nbsp' not defined
:info:build 	  <term><parameter>...</parameter>&nbsp;:</term>
:info:build 	                                        ^
:info:build reference/gtksourceview2-gtksourcegutter.xml:473: parser error : Entity 'nbsp' not defined
:info:build 	  <term><parameter>gutter</parameter>&nbsp;:</term>
:info:build 	                                           ^
:info:build reference/gtksourceview2-gtksourcegutter.xml:478: parser error : Entity 'nbsp' not defined
:info:build 	  <term><parameter>renderer</parameter>&nbsp;:</term>
:info:build 	                                             ^
:info:build reference/gtksourceview2-gtksourcegutter.xml:483: parser error : Entity 'nbsp' not defined
:info:build 	  <term><parameter>iter</parameter>&nbsp;:</term>
:info:build 	                                         ^
:info:build reference/gtksourceview2-gtksourcegutter.xml:488: parser error : Entity 'nbsp' not defined
:info:build 	  <term><parameter>tooltip</parameter>&nbsp;:</term>
:info:build 	                                            ^
:info:build reference/gtksourceview2-gtksourcegutter.xml:493: parser error : Entity 'nbsp' not defined
:info:build 	  <term><parameter>user_param1</parameter>&nbsp;:</term>
:info:build 	                                                ^
:info:build reference/gtksourceview2-gtksourcegutter.xml:499: parser error : Entity 'nbsp' not defined
:info:build 	  <term><parameter>...</parameter>&nbsp;:</term>
:info:build 	                                        ^
:info:build I/O error : Attempt to load network entity http://www.oasis-open.org/docbook/xml/4.1.2/docbookx.dtd
:info:build reference/gtksourceview2-gtksourcelanguage.xml:2: warning: failed to load external entity "http://www.oasis-open.org/docbook/xml/4.1.2/docbookx.dtd"
:info:build cBook XML V4.1.2//EN" "http://www.oasis-open.org/docbook/xml/4.1.2/docbookx.dtd"
:info:build                                                                                ^
:info:build reference/gtksourceview2-gtksourcelanguage.xml:108: parser error : Entity 'nbsp' not defined
:info:build         <term><emphasis>Returns</emphasis>&nbsp;:</term>
:info:build                                                 ^
:info:build reference/gtksourceview2-gtksourcelanguage.xml:131: parser error : Entity 'nbsp' not defined
:info:build         <term><emphasis>Returns</emphasis>&nbsp;:</term>
:info:build                                                 ^
:info:build reference/gtksourceview2-gtksourcelanguage.xml:152: parser error : Entity 'nbsp' not defined
:info:build         <term><emphasis>Returns</emphasis>&nbsp;:</term>
:info:build                                                 ^
:info:build reference/gtksourceview2-gtksourcelanguage.xml:172: parser error : Entity 'nbsp' not defined
:info:build         <term><parameter role="keyword">name</parameter>&nbsp;:</term>
:info:build                                                               ^
:info:build reference/gtksourceview2-gtksourcelanguage.xml:176: parser error : Entity 'nbsp' not defined
:info:build         <term><emphasis>Returns</emphasis>&nbsp;:</term>
:info:build                                                 ^
:info:build reference/gtksourceview2-gtksourcelanguage.xml:197: parser error : Entity 'nbsp' not defined
:info:build         <term><emphasis>Returns</emphasis>&nbsp;:</term>
:info:build                                                 ^
:info:build reference/gtksourceview2-gtksourcelanguage.xml:218: parser error : Entity 'nbsp' not defined
:info:build         <term><emphasis>Returns</emphasis>&nbsp;:</term>
:info:build                                                 ^
:info:build reference/gtksourceview2-gtksourcelanguage.xml:237: parser error : Entity 'nbsp' not defined
:info:build         <term><emphasis>Returns</emphasis>&nbsp;:</term>
:info:build                                                 ^
:info:build reference/gtksourceview2-gtksourcelanguage.xml:257: parser error : Entity 'nbsp' not defined
:info:build         <term><emphasis>Returns</emphasis>&nbsp;:</term>
:info:build                                                 ^
:info:build reference/gtksourceview2-gtksourcelanguage.xml:278: parser error : Entity 'nbsp' not defined
:info:build         <term><parameter role="keyword">style_id</parameter>&nbsp;:</term>
:info:build                                                                   ^
:info:build reference/gtksourceview2-gtksourcelanguage.xml:282: parser error : Entity 'nbsp' not defined
:info:build         <term><emphasis>Returns</emphasis>&nbsp;:</term>
:info:build                                                 ^
:info:build I/O error : Attempt to load network entity http://www.oasis-open.org/docbook/xml/4.1.2/docbookx.dtd
:info:build reference/gtksourceview2-gtksourcelanguagesmanager.xml:2: warning: failed to load external entity "http://www.oasis-open.org/docbook/xml/4.1.2/docbookx.dtd"
:info:build cBook XML V4.1.2//EN" "http://www.oasis-open.org/docbook/xml/4.1.2/docbookx.dtd"
:info:build                                                                                ^
:info:build reference/gtksourceview2-gtksourcelanguagesmanager.xml:135: parser error : Entity 'nbsp' not defined
:info:build       <term><emphasis>Returns</emphasis>&nbsp;:</term>
:info:build                                               ^
:info:build reference/gtksourceview2-gtksourcelanguagesmanager.xml:161: parser error : Entity 'nbsp' not defined
:info:build         <term><emphasis>id</emphasis>&nbsp;:</term>
:info:build                                            ^
:info:build reference/gtksourceview2-gtksourcelanguagesmanager.xml:165: parser error : Entity 'nbsp' not defined
:info:build         <term><emphasis>Returns</emphasis>&nbsp;:</term>
:info:build                                                 ^
:info:build reference/gtksourceview2-gtksourcelanguagesmanager.xml:188: parser error : Entity 'nbsp' not defined
:info:build         <term><emphasis>Returns</emphasis>&nbsp;:</term>
:info:build                                                 ^
:info:build reference/gtksourceview2-gtksourcelanguagesmanager.xml:209: parser error : Entity 'nbsp' not defined
:info:build         <term><emphasis>Returns</emphasis>&nbsp;:</term>
:info:build                                                 ^
:info:build reference/gtksourceview2-gtksourcelanguagesmanager.xml:230: parser error : Entity 'nbsp' not defined
:info:build         <term><emphasis>filename</emphasis>&nbsp;:</term>
:info:build                                                  ^
:info:build reference/gtksourceview2-gtksourcelanguagesmanager.xml:235: parser error : Entity 'nbsp' not defined
:info:build         <term><emphasis>content_type</emphasis>&nbsp;:</term>
:info:build                                                      ^
:info:build reference/gtksourceview2-gtksourcelanguagesmanager.xml:240: parser error : Entity 'nbsp' not defined
:info:build         <term><emphasis>Returns</emphasis>&nbsp;:</term>
:info:build                                                 ^
:info:build reference/gtksourceview2-gtksourcelanguagesmanager.xml:264: parser error : Entity 'nbsp' not defined
:info:build         <term><emphasis>dirs</emphasis>&nbsp;:</term>
:info:build                                              ^
:info:build reference/gtksourceview2-gtksourcelanguagesmanager.xml:294: parser error : Entity 'nbsp' not defined
:info:build         <term><emphasis>Returns</emphasis>&nbsp;:</term>
:info:build                                                 ^
:info:build I/O error : Attempt to load network entity http://www.oasis-open.org/docbook/xml/4.1.2/docbookx.dtd
:info:build reference/gtksourceview2-gtksourcemark.xml:2: warning: failed to load external entity "http://www.oasis-open.org/docbook/xml/4.1.2/docbookx.dtd"
:info:build cBook XML V4.1.2//EN" "http://www.oasis-open.org/docbook/xml/4.1.2/docbookx.dtd"
:info:build                                                                                ^
:info:build reference/gtksourceview2-gtksourcemark.xml:126: parser error : Entity 'nbsp' not defined
:info:build           <term><parameter role="keyword">name</parameter>&nbsp;:</term>
:info:build                                                                 ^
:info:build reference/gtksourceview2-gtksourcemark.xml:131: parser error : Entity 'nbsp' not defined
:info:build           <term><parameter role="keyword">category</parameter>&nbsp;:</term>
:info:build                                                                     ^
:info:build reference/gtksourceview2-gtksourcemark.xml:138: parser error : Entity 'nbsp' not defined
:info:build           <term><emphasis>Returns</emphasis>&nbsp;:</term>
:info:build                                                   ^
:info:build reference/gtksourceview2-gtksourcemark.xml:172: parser error : Entity 'nbsp' not defined
:info:build 	      <term><emphasis>Returns</emphasis>&nbsp;:</term>
:info:build 	                                              ^
:info:build reference/gtksourceview2-gtksourcemark.xml:192: parser error : Entity 'nbsp' not defined
:info:build         <term><parameter role="keyword">category</parameter>&nbsp;:</term>
:info:build                                                                   ^
:info:build reference/gtksourceview2-gtksourcemark.xml:196: parser error : Entity 'nbsp' not defined
:info:build 	      <term><emphasis>Returns</emphasis>&nbsp;:</term>
:info:build 	                                              ^
:info:build reference/gtksourceview2-gtksourcemark.xml:220: parser error : Entity 'nbsp' not defined
:info:build         <term><parameter role="keyword">category</parameter>&nbsp;:</term>
:info:build                                                                   ^
:info:build reference/gtksourceview2-gtksourcemark.xml:224: parser error : Entity 'nbsp' not defined
:info:build 	      <term><emphasis>Returns</emphasis>&nbsp;:</term>
:info:build 	                                              ^
:info:build I/O error : Attempt to load network entity http://www.oasis-open.org/docbook/xml/4.1.2/docbookx.dtd
:info:build reference/gtksourceview2-gtksourceprintcompositor.xml:3: warning: failed to load external entity "http://www.oasis-open.org/docbook/xml/4.1.2/docbookx.dtd"
:info:build     "http://www.oasis-open.org/docbook/xml/4.1.2/docbookx.dtd">
:info:build                                                                ^
:info:build reference/gtksourceview2-gtksourceprintcompositor.xml:431: parser error : Entity 'nbsp' not defined
:info:build           <term><parameter role="keyword">buffer</parameter>&nbsp;:</term>
:info:build                                                                   ^
:info:build reference/gtksourceview2-gtksourceprintcompositor.xml:435: parser error : Entity 'nbsp' not defined
:info:build           <term><emphasis>Returns</emphasis>&nbsp;:</term>
:info:build                                                   ^
:info:build reference/gtksourceview2-gtksourceprintcompositor.xml:467: parser error : Entity 'nbsp' not defined
:info:build           <term><parameter role="keyword">context</parameter>&nbsp;:</term>
:info:build                                                                    ^
:info:build reference/gtksourceview2-gtksourceprintcompositor.xml:472: parser error : Entity 'nbsp' not defined
:info:build           <term><parameter role="keyword">page_nr</parameter>&nbsp;:</term>
:info:build                                                                    ^
:info:build reference/gtksourceview2-gtksourceprintcompositor.xml:501: parser error : Entity 'nbsp' not defined
:info:build           <term><emphasis>Returns</emphasis>&nbsp;:</term>
:info:build                                                   ^
:info:build reference/gtksourceview2-gtksourceprintcompositor.xml:524: parser error : Entity 'nbsp' not defined
:info:build           <term><parameter role="keyword">unit</parameter>&nbsp;:</term>
:info:build                                                                 ^
:info:build reference/gtksourceview2-gtksourceprintcompositor.xml:528: parser error : Entity 'nbsp' not defined
:info:build           <term><emphasis>Returns</emphasis>&nbsp;:</term>
:info:build                                                   ^
:info:build reference/gtksourceview2-gtksourceprintcompositor.xml:551: parser error : Entity 'nbsp' not defined
:info:build           <term><emphasis>Returns</emphasis>&nbsp;:</term>
:info:build                                                   ^
:info:build reference/gtksourceview2-gtksourceprintcompositor.xml:576: parser error : Entity 'nbsp' not defined
:info:build           <term><emphasis>Returns</emphasis>&nbsp;:</term>
:info:build                                                   ^
:info:build reference/gtksourceview2-gtksourceprintcompositor.xml:599: parser error : Entity 'nbsp' not defined
:info:build           <term><emphasis>Returns</emphasis>&nbsp;:</term>
:info:build                                                   ^
:info:build reference/gtksourceview2-gtksourceprintcompositor.xml:622: parser error : Entity 'nbsp' not defined
:info:build           <term><emphasis>Returns</emphasis>&nbsp;:</term>
:info:build                                                   ^
:info:build reference/gtksourceview2-gtksourceprintcompositor.xml:646: parser error : Entity 'nbsp' not defined
:info:build           <term><parameter role="keyword">unit</parameter>&nbsp;:</term>
:info:build                                                                 ^
:info:build reference/gtksourceview2-gtksourceprintcompositor.xml:650: parser error : Entity 'nbsp' not defined
:info:build           <term><emphasis>Returns</emphasis>&nbsp;:</term>
:info:build                                                   ^
:info:build reference/gtksourceview2-gtksourceprintcompositor.xml:673: parser error : Entity 'nbsp' not defined
:info:build           <term><emphasis>Returns</emphasis>&nbsp;:</term>
:info:build                                                   ^
:info:build reference/gtksourceview2-gtksourceprintcompositor.xml:696: parser error : Entity 'nbsp' not defined
:info:build           <term><emphasis>Returns</emphasis>&nbsp;:</term>
:info:build                                                   ^
:info:build reference/gtksourceview2-gtksourceprintcompositor.xml:719: parser error : Entity 'nbsp' not defined
:info:build           <term><emphasis>Returns</emphasis>&nbsp;:</term>
:info:build                                                   ^
:info:build reference/gtksourceview2-gtksourceprintcompositor.xml:742: parser error : Entity 'nbsp' not defined
:info:build           <term><emphasis>Returns</emphasis>&nbsp;:</term>
:info:build                                                   ^
:info:build reference/gtksourceview2-gtksourceprintcompositor.xml:767: parser error : Entity 'nbsp' not defined
:info:build           <term><emphasis>Returns</emphasis>&nbsp;:</term>
:info:build                                                   ^
:info:build reference/gtksourceview2-gtksourceprintcompositor.xml:792: parser error : Entity 'nbsp' not defined
:info:build           <term><emphasis>Returns</emphasis>&nbsp;:</term>
:info:build                                                   ^
:info:build reference/gtksourceview2-gtksourceprintcompositor.xml:816: parser error : Entity 'nbsp' not defined
:info:build           <term><parameter role="keyword">unit</parameter>&nbsp;:</term>
:info:build                                                                 ^
:info:build reference/gtksourceview2-gtksourceprintcompositor.xml:820: parser error : Entity 'nbsp' not defined
:info:build           <term><emphasis>Returns</emphasis>&nbsp;:</term>
:info:build                                                   ^
:info:build reference/gtksourceview2-gtksourceprintcompositor.xml:843: parser error : Entity 'nbsp' not defined
:info:build           <term><emphasis>Returns</emphasis>&nbsp;:</term>
:info:build                                                   ^
:info:build reference/gtksourceview2-gtksourceprintcompositor.xml:866: parser error : Entity 'nbsp' not defined
:info:build           <term><parameter role="keyword">unit</parameter>&nbsp;:</term>
:info:build                                                                 ^
:info:build reference/gtksourceview2-gtksourceprintcompositor.xml:870: parser error : Entity 'nbsp' not defined
:info:build           <term><emphasis>Returns</emphasis>&nbsp;:</term>
:info:build                                                   ^
:info:build reference/gtksourceview2-gtksourceprintcompositor.xml:893: parser error : Entity 'nbsp' not defined
:info:build           <term><emphasis>Returns</emphasis>&nbsp;:</term>
:info:build                                                   ^
:info:build reference/gtksourceview2-gtksourceprintcompositor.xml:916: parser error : Entity 'nbsp' not defined
:info:build           <term><parameter role="keyword">context</parameter>&nbsp;:</term>
:info:build                                                                    ^
:info:build reference/gtksourceview2-gtksourceprintcompositor.xml:921: parser error : Entity 'nbsp' not defined
:info:build           <term><emphasis>Returns</emphasis>&nbsp;:</term>
:info:build                                                   ^
:info:build reference/gtksourceview2-gtksourceprintcompositor.xml:982: parser error : Entity 'nbsp' not defined
:info:build           <term><parameter role="keyword">font_name</parameter>&nbsp;:</term>
:info:build                                                                      ^
:info:build reference/gtksourceview2-gtksourceprintcompositor.xml:1011: parser error : Entity 'nbsp' not defined
:info:build           <term><parameter role="keyword">margin</parameter>&nbsp;:</term>
:info:build                                                                   ^
:info:build reference/gtksourceview2-gtksourceprintcompositor.xml:1017: parser error : Entity 'nbsp' not defined
:info:build           <term><parameter role="keyword">unit</parameter>&nbsp;:</term>
:info:build                                                                 ^
:info:build reference/gtksourceview2-gtksourceprintcompositor.xml:1039: parser error : Entity 'nbsp' not defined
:info:build           <term><parameter role="keyword">font_name</parameter>&nbsp;:</term>
:info:build                                                                      ^
:info:build reference/gtksourceview2-gtksourceprintcompositor.xml:1071: parser error : Entity 'nbsp' not defined
:info:build           <term><parameter role="keyword">separator</parameter>&nbsp;:</term>
:info:build                                                                      ^
:info:build reference/gtksourceview2-gtksourceprintcompositor.xml:1077: parser error : Entity 'nbsp' not defined
:info:build           <term><parameter role="keyword">left</parameter>&nbsp;:</term>
:info:build                                                                 ^
:info:build reference/gtksourceview2-gtksourceprintcompositor.xml:1083: parser error : Entity 'nbsp' not defined
:info:build           <term><parameter role="keyword">center</parameter>&nbsp;:</term>
:info:build                                                                   ^
:info:build reference/gtksourceview2-gtksourceprintcompositor.xml:1089: parser error : Entity 'nbsp' not defined
:info:build           <term><parameter role="keyword">right</parameter>&nbsp;:</term>
:info:build                                                                  ^
:info:build reference/gtksourceview2-gtksourceprintcompositor.xml:1128: parser error : Entity 'nbsp' not defined
:info:build           <term><parameter role="keyword">font_name</parameter>&nbsp;:</term>
:info:build                                                                      ^
:info:build reference/gtksourceview2-gtksourceprintcompositor.xml:1160: parser error : Entity 'nbsp' not defined
:info:build           <term><parameter role="keyword">separator</parameter>&nbsp;:</term>
:info:build                                                                      ^
:info:build reference/gtksourceview2-gtksourceprintcompositor.xml:1166: parser error : Entity 'nbsp' not defined
:info:build           <term><parameter role="keyword">left</parameter>&nbsp;:</term>
:info:build                                                                 ^
:info:build reference/gtksourceview2-gtksourceprintcompositor.xml:1172: parser error : Entity 'nbsp' not defined
:info:build           <term><parameter role="keyword">center</parameter>&nbsp;:</term>
:info:build                                                                   ^
:info:build reference/gtksourceview2-gtksourceprintcompositor.xml:1178: parser error : Entity 'nbsp' not defined
:info:build           <term><parameter role="keyword">right</parameter>&nbsp;:</term>
:info:build                                                                  ^
:info:build reference/gtksourceview2-gtksourceprintcompositor.xml:1217: parser error : Entity 'nbsp' not defined
:info:build           <term><parameter role="keyword">highlight</parameter>&nbsp;:</term>
:info:build                                                                      ^
:info:build reference/gtksourceview2-gtksourceprintcompositor.xml:1243: parser error : Entity 'nbsp' not defined
:info:build           <term><parameter role="keyword">margin</parameter>&nbsp;:</term>
:info:build                                                                   ^
:info:build reference/gtksourceview2-gtksourceprintcompositor.xml:1249: parser error : Entity 'nbsp' not defined
:info:build           <term><parameter role="keyword">unit</parameter>&nbsp;:</term>
:info:build                                                                 ^
:info:build reference/gtksourceview2-gtksourceprintcompositor.xml:1271: parser error : Entity 'nbsp' not defined
:info:build           <term><parameter role="keyword">font_name</parameter>&nbsp;:</term>
:info:build                                                                      ^
:info:build reference/gtksourceview2-gtksourceprintcompositor.xml:1300: parser error : Entity 'nbsp' not defined
:info:build           <term><parameter role="keyword">print</parameter>&nbsp;:</term>
:info:build                                                                  ^
:info:build reference/gtksourceview2-gtksourceprintcompositor.xml:1331: parser error : Entity 'nbsp' not defined
:info:build           <term><parameter role="keyword">print</parameter>&nbsp;:</term>
:info:build                                                                  ^
:info:build reference/gtksourceview2-gtksourceprintcompositor.xml:1363: parser error : Entity 'nbsp' not defined
:info:build           <term><parameter role="keyword">interval</parameter>&nbsp;:</term>
:info:build                                                                     ^
:info:build reference/gtksourceview2-gtksourceprintcompositor.xml:1395: parser error : Entity 'nbsp' not defined
:info:build           <term><parameter role="keyword">margin</parameter>&nbsp;:</term>
:info:build                                                                   ^
:info:build reference/gtksourceview2-gtksourceprintcompositor.xml:1401: parser error : Entity 'nbsp' not defined
:info:build           <term><parameter role="keyword">unit</parameter>&nbsp;:</term>
:info:build                                                                 ^
:info:build reference/gtksourceview2-gtksourceprintcompositor.xml:1423: parser error : Entity 'nbsp' not defined
:info:build           <term><parameter role="keyword">width</parameter>&nbsp;:</term>
:info:build                                                                  ^
:info:build reference/gtksourceview2-gtksourceprintcompositor.xml:1446: parser error : Entity 'nbsp' not defined
:info:build           <term><parameter role="keyword">margin</parameter>&nbsp;:</term>
:info:build                                                                   ^
:info:build reference/gtksourceview2-gtksourceprintcompositor.xml:1452: parser error : Entity 'nbsp' not defined
:info:build           <term><parameter role="keyword">unit</parameter>&nbsp;:</term>
:info:build                                                                 ^
:info:build reference/gtksourceview2-gtksourceprintcompositor.xml:1474: parser error : Entity 'nbsp' not defined
:info:build           <term><parameter role="keyword">wrap_mode</parameter>&nbsp;:</term>
:info:build                                                                      ^
:info:build reference/gtksourceview2-gtksourceprintcompositor.xml:1507: parser error : Entity 'nbsp' not defined
:info:build         <term><parameter role="keyword">wrap_mode</parameter>&nbsp;:</term>
:info:build                                                                    ^
:info:build reference/gtksourceview2-gtksourceprintcompositor.xml:1513: parser error : Entity 'nbsp' not defined
:info:build         <term><emphasis>Returns</emphasis>&nbsp;:</term>
:info:build                                                 ^
:info:build I/O error : Attempt to load network entity http://www.oasis-open.org/docbook/xml/4.1.2/docbookx.dtd
:info:build reference/gtksourceview2-gtksourcestyle.xml:2: warning: failed to load external entity "http://www.oasis-open.org/docbook/xml/4.1.2/docbookx.dtd"
:info:build cBook XML V4.1.2//EN" "http://www.oasis-open.org/docbook/xml/4.1.2/docbookx.dtd"
:info:build                                                                                ^
:info:build reference/gtksourceview2-gtksourcestyle.xml:156: parser error : Entity 'nbsp' not defined
:info:build         <term><emphasis>Returns</emphasis>&nbsp;:</term>
:info:build                                                 ^
:info:build I/O error : Attempt to load network entity http://www.oasis-open.org/docbook/xml/4.1.2/docbookx.dtd
:info:build reference/gtksourceview2-gtksourcestylescheme.xml:2: warning: failed to load external entity "http://www.oasis-open.org/docbook/xml/4.1.2/docbookx.dtd"
:info:build cBook XML V4.1.2//EN" "http://www.oasis-open.org/docbook/xml/4.1.2/docbookx.dtd"
:info:build                                                                                ^
:info:build reference/gtksourceview2-gtksourcestylescheme.xml:196: parser error : Entity 'num' not defined
:info:build       "&num;000000" or named color understood by Gdk prefixed with "&num;",
:info:build             ^
:info:build reference/gtksourceview2-gtksourcestylescheme.xml:196: parser error : Entity 'num' not defined
:info:build       "&num;000000" or named color understood by Gdk prefixed with "&num;",
:info:build                                                                          ^
:info:build reference/gtksourceview2-gtksourcestylescheme.xml:197: parser error : Entity 'num' not defined
:info:build       e.g. "&num;beige".
:info:build                  ^
:info:build reference/gtksourceview2-gtksourcestylescheme.xml:226: parser error : Entity 'num' not defined
:info:build       hexadecimal format, e.g. "&num;000000", or symbolic name understood
:info:build                                      ^
:info:build reference/gtksourceview2-gtksourcestylescheme.xml:227: parser error : Entity 'num' not defined
:info:build       by Gdk, prefixed with "&num;", e.g. "&num;magenta" or "&num;darkred".
:info:build                                   ^
:info:build reference/gtksourceview2-gtksourcestylescheme.xml:227: parser error : Entity 'num' not defined
:info:build       by Gdk, prefixed with "&num;", e.g. "&num;magenta" or "&num;darkred".
:info:build                                                 ^
:info:build reference/gtksourceview2-gtksourcestylescheme.xml:227: parser error : Entity 'num' not defined
:info:build       by Gdk, prefixed with "&num;", e.g. "&num;magenta" or "&num;darkred".
:info:build                                                                   ^
:info:build reference/gtksourceview2-gtksourcestylescheme.xml:317: parser error : Entity 'nbsp' not defined
:info:build         <term><emphasis>Returns</emphasis>&nbsp;:</term>
:info:build                                                 ^
:info:build reference/gtksourceview2-gtksourcestylescheme.xml:338: parser error : Entity 'nbsp' not defined
:info:build         <term><emphasis>Returns</emphasis>&nbsp;:</term>
:info:build                                                 ^
:info:build reference/gtksourceview2-gtksourcestylescheme.xml:358: parser error : Entity 'nbsp' not defined
:info:build         <term><emphasis>Returns</emphasis>&nbsp;:</term>
:info:build                                                 ^
:info:build reference/gtksourceview2-gtksourcestylescheme.xml:379: parser error : Entity 'nbsp' not defined
:info:build         <term><emphasis>Returns</emphasis>&nbsp;:</term>
:info:build                                                 ^
:info:build reference/gtksourceview2-gtksourcestylescheme.xml:399: parser error : Entity 'nbsp' not defined
:info:build         <term><emphasis>Returns</emphasis>&nbsp;:</term>
:info:build                                                 ^
:info:build reference/gtksourceview2-gtksourcestylescheme.xml:418: parser error : Entity 'nbsp' not defined
:info:build         <term><parameter role="keyword">style_id</parameter>&nbsp;:</term>
:info:build                                                                   ^
:info:build reference/gtksourceview2-gtksourcestylescheme.xml:422: parser error : Entity 'nbsp' not defined
:info:build         <term><emphasis>Returns</emphasis>&nbsp;:</term>
:info:build                                                 ^
:info:build I/O error : Attempt to load network entity http://www.oasis-open.org/docbook/xml/4.1.2/docbookx.dtd
:info:build reference/gtksourceview2-gtksourcestyleschememanager.xml:2: warning: failed to load external entity "http://www.oasis-open.org/docbook/xml/4.1.2/docbookx.dtd"
:info:build cBook XML V4.1.2//EN" "http://www.oasis-open.org/docbook/xml/4.1.2/docbookx.dtd"
:info:build                                                                                ^
:info:build reference/gtksourceview2-gtksourcestyleschememanager.xml:144: parser error : Entity 'nbsp' not defined
:info:build       <term><emphasis>Returns</emphasis>&nbsp;:</term>
:info:build                                               ^
:info:build reference/gtksourceview2-gtksourcestyleschememanager.xml:170: parser error : Entity 'nbsp' not defined
:info:build         <term><emphasis>path</emphasis>&nbsp;:</term>
:info:build                                              ^
:info:build reference/gtksourceview2-gtksourcestyleschememanager.xml:210: parser error : Entity 'nbsp' not defined
:info:build         <term><emphasis>scheme_id</emphasis>&nbsp;:</term>
:info:build                                                   ^
:info:build reference/gtksourceview2-gtksourcestyleschememanager.xml:214: parser error : Entity 'nbsp' not defined
:info:build         <term><emphasis>Returns</emphasis>&nbsp;:</term>
:info:build                                                 ^
:info:build reference/gtksourceview2-gtksourcestyleschememanager.xml:234: parser error : Entity 'nbsp' not defined
:info:build         <term><emphasis>Returns</emphasis>&nbsp;:</term>
:info:build                                                 ^
:info:build reference/gtksourceview2-gtksourcestyleschememanager.xml:255: parser error : Entity 'nbsp' not defined
:info:build         <term><emphasis>Returns</emphasis>&nbsp;:</term>
:info:build                                                 ^
:info:build reference/gtksourceview2-gtksourcestyleschememanager.xml:277: parser error : Entity 'nbsp' not defined
:info:build         <term><emphasis>path</emphasis>&nbsp;:</term>
:info:build                                              ^
:info:build reference/gtksourceview2-gtksourcestyleschememanager.xml:299: parser error : Entity 'nbsp' not defined
:info:build         <term><emphasis>dirs</emphasis>&nbsp;:</term>
:info:build                                              ^
:info:build reference/gtksourceview2-gtksourcestyleschememanager.xml:329: parser error : Entity 'nbsp' not defined
:info:build         <term><emphasis>Returns</emphasis>&nbsp;:</term>
:info:build                                                 ^
:info:build Computing chunks...
:info:build Writing class-gtksourceview2.html for refentry(class-gtksourceview2)
:info:build Writing class-gtksourcebuffer2.html for refentry(class-gtksourcebuffer2)
:info:build Writing class-gtksourcegutter2.html for refentry(class-gtksourcegutter2)
:info:build Writing class-gtksourcelanguage2.html for refentry(class-gtksourcelanguage2)
:info:build Writing class-gtksourcelanguagemanager2.html for refentry(class-gtksourcelanguagemanager2)
:info:build Writing class-gtksourcemark2.html for refentry(class-gtksourcemark2)
:info:build Writing class-gtksourceprintcompositor2.html for refentry(class-gtksourceprintcompositor2)
:info:build Writing class-gtksourcestyle2.html for refentry(class-gtksourcestyle2)
:info:build Writing class-gtksourcestylescheme2.html for refentry(class-gtksourcestylescheme2)
:info:build Writing class-gtksourcestyleschememanager2.html for refentry(class-gtksourcestyleschememanager2)
:info:build Writing index.html for book(pygtksourceview2-reference)
:info:build Writing pygtksourceview2.devhelp for book(pygtksourceview2-reference)
:info:build Writing index.sgml for book(pygtksourceview2-reference)
:info:build /opt/local/bin/python2.7 /opt/local/Library/Frameworks/Python.framework/Versions/2.7/share/pygobject/xsl/fixxref.py -i /opt/local/Library/Frameworks/Python.framework/Versions/2.7/share/gtk-doc/html/pygobject ../docs/html 
:info:build touch build_stamp
:info:build /Library/Developer/CommandLineTools/usr/bin/make  all-am
:info:build make[3]: Entering directory `/opt/local/var/macports/build/_opt_local_var_macports_sources_rsync.macports.org_macports_release_tarballs_ports_python_py27-pygtksourceview/py27-pygtksourceview/work/pygtksourceview-2.10.1/docs'
:info:build make[3]: Nothing to be done for `all-am'.
:info:build make[3]: Leaving directory `/opt/local/var/macports/build/_opt_local_var_macports_sources_rsync.macports.org_macports_release_tarballs_ports_python_py27-pygtksourceview/py27-pygtksourceview/work/pygtksourceview-2.10.1/docs'
:info:build make[2]: Leaving directory `/opt/local/var/macports/build/_opt_local_var_macports_sources_rsync.macports.org_macports_release_tarballs_ports_python_py27-pygtksourceview/py27-pygtksourceview/work/pygtksourceview-2.10.1/docs'
:info:build make[2]: Entering directory `/opt/local/var/macports/build/_opt_local_var_macports_sources_rsync.macports.org_macports_release_tarballs_ports_python_py27-pygtksourceview/py27-pygtksourceview/work/pygtksourceview-2.10.1'
:info:build /bin/sh ./libtool  --tag=CC   --mode=compile /usr/bin/clang -DHAVE_CONFIG_H -I. -I/opt/local/Library/Frameworks/Python.framework/Versions/2.7/include/python2.7  -I/opt/local/include -isysroot/Library/Developer/CommandLineTools/SDKs/MacOSX.sdk -D_REENTRANT -I/opt/local/Library/Frameworks/Python.framework/Versions/2.7/include/pygtk-2.0 -I/opt/local/include/gtksourceview-2.0 -I/opt/local/include/libxml2 -I/opt/local/include/gtk-2.0 -I/opt/local/lib/gtk-2.0/include -I/opt/local/include/pango-1.0 -I/opt/local/include/gio-unix-2.0/ -I/opt/local/include/cairo -I/opt/local/include/atk-1.0 -I/opt/local/include/cairo -I/opt/local/include/pixman-1 -I/opt/local/include/gdk-pixbuf-2.0 -I/opt/local/include/pango-1.0 -I/opt/local/include/harfbuzz -I/opt/local/include/pango-1.0 -I/opt/local/include/fribidi -I/opt/local/include/glib-2.0 -I/opt/local/lib/glib-2.0/include -I/opt/local/include/ossp -I/opt/local/include/freetype2 -I/opt/local/include/libpng16 -pipe -Os -isysroot/Library/Developer/CommandLineTools/SDKs/MacOSX.sdk -arch x86_64 -Wall -fno-strict-aliasing -MT gtksourceview2_la-gtksourceview2module.lo -MD -MP -MF .deps/gtksourceview2_la-gtksourceview2module.Tpo -c -o gtksourceview2_la-gtksourceview2module.lo `test -f 'gtksourceview2module.c' || echo './'`gtksourceview2module.c
:info:build (cd .\
:info:build 	&& /opt/local/bin/python2.7 /opt/local/Library/Frameworks/Python.framework/Versions/2.7/share/pygobject/2.0/codegen/codegen.py							\
:info:build 		--override gtksourceview2.override						\
:info:build 		--register /opt/local/Library/Frameworks/Python.framework/Versions/2.7/share/pygtk/2.0/defs/gdk-types.defs	\
:info:build 		--register /opt/local/Library/Frameworks/Python.framework/Versions/2.7/share/pygtk/2.0/defs/pango-types.defs	\
:info:build 		--register /opt/local/Library/Frameworks/Python.framework/Versions/2.7/share/pygtk/2.0/defs/gtk-types.defs	\
:info:build 		--prefix pygtksourceview2 gtksourceview2.defs) > gen-gtksourceview2.c				\
:info:build 		&& cp gen-gtksourceview2.c gtksourceview2.c						\
:info:build 		&& rm -f gen-gtksourceview2.c
:info:build libtool: compile:  /usr/bin/clang -DHAVE_CONFIG_H -I. -I/opt/local/Library/Frameworks/Python.framework/Versions/2.7/include/python2.7 -I/opt/local/include -isysroot/Library/Developer/CommandLineTools/SDKs/MacOSX.sdk -D_REENTRANT -I/opt/local/Library/Frameworks/Python.framework/Versions/2.7/include/pygtk-2.0 -I/opt/local/include/gtksourceview-2.0 -I/opt/local/include/libxml2 -I/opt/local/include/gtk-2.0 -I/opt/local/lib/gtk-2.0/include -I/opt/local/include/pango-1.0 -I/opt/local/include/gio-unix-2.0/ -I/opt/local/include/cairo -I/opt/local/include/atk-1.0 -I/opt/local/include/cairo -I/opt/local/include/pixman-1 -I/opt/local/include/gdk-pixbuf-2.0 -I/opt/local/include/pango-1.0 -I/opt/local/include/harfbuzz -I/opt/local/include/pango-1.0 -I/opt/local/include/fribidi -I/opt/local/include/glib-2.0 -I/opt/local/lib/glib-2.0/include -I/opt/local/include/ossp -I/opt/local/include/freetype2 -I/opt/local/include/libpng16 -pipe -Os -isysroot/Library/Developer/CommandLineTools/SDKs/MacOSX.sdk -arch x86_64 -Wall -fno-strict-aliasing -MT gtksourceview2_la-gtksourceview2module.lo -MD -MP -MF .deps/gtksourceview2_la-gtksourceview2module.Tpo -c gtksourceview2module.c  -fno-common -DPIC -o .libs/gtksourceview2_la-gtksourceview2module.o
:info:build Warning: generating old-style constructor for:gtk_source_mark_new
:info:build Warning: generating old-style constructor for:gtk_source_print_compositor_new
:info:build Warning: Constructor for GtkSourceMark needs to be updated to new API
:info:build          See http://live.gnome.org/PyGTK_2fWhatsNew28#update-constructors
:info:build Warning: Constructor for GtkSourcePrintCompositor needs to be updated to new API
:info:build          See http://live.gnome.org/PyGTK_2fWhatsNew28#update-constructors
:info:build Warning: Constructor for GtkSourceCompletionItem needs to be updated to new API
:info:build          See http://live.gnome.org/PyGTK_2fWhatsNew28#update-constructors
:info:build Warning: Constructor for GtkSourceCompletionContext needs to be updated to new API
:info:build          See http://live.gnome.org/PyGTK_2fWhatsNew28#update-constructors
:info:build Warning: Constructor for GtkSourceCompletionWords needs to be updated to new API
:info:build          See http://live.gnome.org/PyGTK_2fWhatsNew28#update-constructors
:info:build ***INFO*** The coverage of global functions is 100.00% (7/7)
:info:build ***INFO*** The coverage of methods is 100.00% (182/182)
:info:build ***INFO*** The coverage of virtual proxies is 100.00% (5/5)
:info:build ***INFO*** The coverage of virtual accessors is 100.00% (30/30)
:info:build ***INFO*** The coverage of interface proxies is 100.00% (25/25)
:info:build /bin/sh ./libtool  --tag=CC   --mode=compile /usr/bin/clang -DHAVE_CONFIG_H -I. -I/opt/local/Library/Frameworks/Python.framework/Versions/2.7/include/python2.7  -I/opt/local/include -isysroot/Library/Developer/CommandLineTools/SDKs/MacOSX.sdk -D_REENTRANT -I/opt/local/Library/Frameworks/Python.framework/Versions/2.7/include/pygtk-2.0 -I/opt/local/include/gtksourceview-2.0 -I/opt/local/include/libxml2 -I/opt/local/include/gtk-2.0 -I/opt/local/lib/gtk-2.0/include -I/opt/local/include/pango-1.0 -I/opt/local/include/gio-unix-2.0/ -I/opt/local/include/cairo -I/opt/local/include/atk-1.0 -I/opt/local/include/cairo -I/opt/local/include/pixman-1 -I/opt/local/include/gdk-pixbuf-2.0 -I/opt/local/include/pango-1.0 -I/opt/local/include/harfbuzz -I/opt/local/include/pango-1.0 -I/opt/local/include/fribidi -I/opt/local/include/glib-2.0 -I/opt/local/lib/glib-2.0/include -I/opt/local/include/ossp -I/opt/local/include/freetype2 -I/opt/local/include/libpng16 -pipe -Os -isysroot/Library/Developer/CommandLineTools/SDKs/MacOSX.sdk -arch x86_64 -Wall -fno-strict-aliasing -MT gtksourceview2_la-gtksourceview2.lo -MD -MP -MF .deps/gtksourceview2_la-gtksourceview2.Tpo -c -o gtksourceview2_la-gtksourceview2.lo `test -f 'gtksourceview2.c' || echo './'`gtksourceview2.c
:info:build libtool: compile:  /usr/bin/clang -DHAVE_CONFIG_H -I. -I/opt/local/Library/Frameworks/Python.framework/Versions/2.7/include/python2.7 -I/opt/local/include -isysroot/Library/Developer/CommandLineTools/SDKs/MacOSX.sdk -D_REENTRANT -I/opt/local/Library/Frameworks/Python.framework/Versions/2.7/include/pygtk-2.0 -I/opt/local/include/gtksourceview-2.0 -I/opt/local/include/libxml2 -I/opt/local/include/gtk-2.0 -I/opt/local/lib/gtk-2.0/include -I/opt/local/include/pango-1.0 -I/opt/local/include/gio-unix-2.0/ -I/opt/local/include/cairo -I/opt/local/include/atk-1.0 -I/opt/local/include/cairo -I/opt/local/include/pixman-1 -I/opt/local/include/gdk-pixbuf-2.0 -I/opt/local/include/pango-1.0 -I/opt/local/include/harfbuzz -I/opt/local/include/pango-1.0 -I/opt/local/include/fribidi -I/opt/local/include/glib-2.0 -I/opt/local/lib/glib-2.0/include -I/opt/local/include/ossp -I/opt/local/include/freetype2 -I/opt/local/include/libpng16 -pipe -Os -isysroot/Library/Developer/CommandLineTools/SDKs/MacOSX.sdk -arch x86_64 -Wall -fno-strict-aliasing -MT gtksourceview2_la-gtksourceview2.lo -MD -MP -MF .deps/gtksourceview2_la-gtksourceview2.Tpo -c gtksourceview2.c  -fno-common -DPIC -o .libs/gtksourceview2_la-gtksourceview2.o
:info:build mv -f .deps/gtksourceview2_la-gtksourceview2module.Tpo .deps/gtksourceview2_la-gtksourceview2module.Plo
:info:build gtksourceview2.c:3434:5: warning: 'gtk_source_view_set_mark_category_pixbuf' is deprecated [-Wdeprecated-declarations]
:info:build     gtk_source_view_set_mark_category_pixbuf(GTK_SOURCE_VIEW(self->obj), category, (GdkPixbuf *) pixbuf);
:info:build     ^
:info:build /opt/local/include/gtksourceview-2.0/gtksourceview/gtksourceview.h:197:34: note: 'gtk_source_view_set_mark_category_pixbuf' has been explicitly marked deprecated here
:info:build                                                         GdkPixbuf        *pixbuf) G_GNUC_DEPRECATED;
:info:build                                                                                   ^
:info:build /opt/local/include/glib-2.0/glib/gmacros.h:195:42: note: expanded from macro 'G_GNUC_DEPRECATED'
:info:build #define G_GNUC_DEPRECATED __attribute__((__deprecated__))
:info:build                                          ^
:info:build gtksourceview2.c:3450:11: warning: 'gtk_source_view_get_mark_category_pixbuf' is deprecated [-Wdeprecated-declarations]
:info:build     ret = gtk_source_view_get_mark_category_pixbuf(GTK_SOURCE_VIEW(self->obj), category);
:info:build           ^
:info:build /opt/local/include/gtksourceview-2.0/gtksourceview/gtksourceview.h:218:43: note: 'gtk_source_view_get_mark_category_pixbuf' has been explicitly marked deprecated here
:info:build                                                          const gchar     *category) G_GNUC_DEPRECATED;
:info:build                                                                                     ^
:info:build /opt/local/include/glib-2.0/glib/gmacros.h:195:42: note: expanded from macro 'G_GNUC_DEPRECATED'
:info:build #define G_GNUC_DEPRECATED __attribute__((__deprecated__))
:info:build                                          ^
:info:build 2 warnings generated.
:info:build mv -f .deps/gtksourceview2_la-gtksourceview2.Tpo .deps/gtksourceview2_la-gtksourceview2.Plo
:info:build /bin/sh ./libtool --tag=CC   --mode=link /usr/bin/clang -D_REENTRANT -I/opt/local/Library/Frameworks/Python.framework/Versions/2.7/include/pygtk-2.0 -I/opt/local/include/gtksourceview-2.0 -I/opt/local/include/libxml2 -I/opt/local/include/gtk-2.0 -I/opt/local/lib/gtk-2.0/include -I/opt/local/include/pango-1.0 -I/opt/local/include/gio-unix-2.0/ -I/opt/local/include/cairo -I/opt/local/include/atk-1.0 -I/opt/local/include/cairo -I/opt/local/include/pixman-1 -I/opt/local/include/gdk-pixbuf-2.0 -I/opt/local/include/pango-1.0 -I/opt/local/include/harfbuzz -I/opt/local/include/pango-1.0 -I/opt/local/include/fribidi -I/opt/local/include/glib-2.0 -I/opt/local/lib/glib-2.0/include -I/opt/local/include/ossp -I/opt/local/include/freetype2 -I/opt/local/include/libpng16 -pipe -Os -isysroot/Library/Developer/CommandLineTools/SDKs/MacOSX.sdk -arch x86_64 -Wall -fno-strict-aliasing -module -avoid-version -export-symbols-regex initgtksourceview2   -L/opt/local/lib -Wl,-headerpad_max_install_names -Wl,-syslibroot,/Library/Developer/CommandLineTools/SDKs/MacOSX.sdk -arch x86_64 -o gtksourceview2.la -rpath /opt/local/Library/Frameworks/Python.framework/Versions/2.7/lib/python2.7/site-packages gtksourceview2_la-gtksourceview2module.lo gtksourceview2_la-gtksourceview2.lo -L/opt/local/lib -lgtksourceview-2.0 -lgtk-x11-2.0 -lgdk-x11-2.0 -lpangocairo-1.0 -lgio-2.0 -lXrender -lXinerama -lXi -lXrandr -lXcursor -lXcomposite -lXdamage -lXfixes -lX11 -lXext -latk-1.0 -lcairo -lgdk_pixbuf-2.0 -lgio-2.0 -lpangoft2-1.0 -lpango-1.0 -lgobject-2.0 -lglib-2.0 -lintl -Wl,-framework -Wl,CoreFoundation -lfontconfig -lfreetype  
:info:build libtool: link: /usr/bin/nm -B  .libs/gtksourceview2_la-gtksourceview2module.o .libs/gtksourceview2_la-gtksourceview2.o   | sed -n -e 's/^.*[	 ]\([BCDEGRST][BCDEGRST]*\)[	 ][	 ]*_\([_A-Za-z][_A-Za-z0-9]*\)$/\1 _\2 \2/p' | /opt/local/bin/gsed 's/.* //' | sort | uniq > .libs/gtksourceview2.exp
:info:build libtool: link: /usr/bin/grep -E -e "initgtksourceview2" ".libs/gtksourceview2.exp" > ".libs/gtksourceview2.expT"
:info:build libtool: link: mv -f ".libs/gtksourceview2.expT" ".libs/gtksourceview2.exp"
:info:build libtool: link: sed -e 's,^,_,' < .libs/gtksourceview2.exp > .libs/gtksourceview2-symbols.expsym
:info:build libtool: link: /usr/bin/clang  -o .libs/gtksourceview2.so -bundle  .libs/gtksourceview2_la-gtksourceview2module.o .libs/gtksourceview2_la-gtksourceview2.o   -L/opt/local/lib -lgtksourceview-2.0 -lgtk-x11-2.0 -lgdk-x11-2.0 -lpangocairo-1.0 -lXrender -lXinerama -lXi -lXrandr -lXcursor -lXcomposite -lXdamage -lXfixes -lX11 -lXext -latk-1.0 -lcairo -lgdk_pixbuf-2.0 -lgio-2.0 -lpangoft2-1.0 -lpango-1.0 -lgobject-2.0 -lglib-2.0 -lintl -lfontconfig -lfreetype  -arch x86_64 -Wl,-headerpad_max_install_names -Wl,-syslibroot -Wl,/Library/Developer/CommandLineTools/SDKs/MacOSX.sdk -arch x86_64 -Wl,-framework -Wl,CoreFoundation   -Wl,-exported_symbols_list,.libs/gtksourceview2-symbols.expsym
:info:build Undefined symbols for architecture x86_64:
:info:build   "_PyArg_ParseTuple", referenced from:
:info:build       __wrap_gtk_source_gutter_set_cell_data_func in gtksourceview2_la-gtksourceview2.o
:info:build       __wrap_gtk_source_gutter_set_cell_size_func in gtksourceview2_la-gtksourceview2.o
:info:build       __wrap_gtk_source_view_set_mark_category_tooltip_func in gtksourceview2_la-gtksourceview2.o
:info:build       __wrap_gtk_source_view_set_mark_category_tooltip_markup_func in gtksourceview2_la-gtksourceview2.o
:info:build       __wrap_GtkSourceCompletionProposal__proxy_do_get_label in gtksourceview2_la-gtksourceview2.o
:info:build       __wrap_GtkSourceCompletionProposal__proxy_do_get_markup in gtksourceview2_la-gtksourceview2.o
:info:build       __wrap_GtkSourceCompletionProposal__proxy_do_get_text in gtksourceview2_la-gtksourceview2.o
:info:build       ...
:info:build   "_PyArg_ParseTupleAndKeywords", referenced from:
:info:build       __wrap_gtk_source_buffer_new in gtksourceview2_la-gtksourceview2.o
:info:build       __wrap_gtk_source_language_manager_new in gtksourceview2_la-gtksourceview2.o
:info:build       __wrap_gtk_source_mark_new in gtksourceview2_la-gtksourceview2.o
:info:build       __wrap_gtk_source_print_compositor_new in gtksourceview2_la-gtksourceview2.o
:info:build       __wrap_gtk_source_style_new in gtksourceview2_la-gtksourceview2.o
:info:build       __wrap_gtk_source_style_scheme_manager_new in gtksourceview2_la-gtksourceview2.o
:info:build       __wrap_gtk_source_view_new in gtksourceview2_la-gtksourceview2.o
:info:build       ...
:info:build   "_PyBool_FromLong", referenced from:
:info:build       __wrap_gtk_source_buffer_get_highlight_syntax in gtksourceview2_la-gtksourceview2.o
:info:build       __wrap_gtk_source_buffer_get_highlight_matching_brackets in gtksourceview2_la-gtksourceview2.o
:info:build       __wrap_gtk_source_buffer_can_undo in gtksourceview2_la-gtksourceview2.o
:info:build       __wrap_gtk_source_buffer_can_redo in gtksourceview2_la-gtksourceview2.o
:info:build       __wrap_gtk_source_buffer_forward_iter_to_source_mark in gtksourceview2_la-gtksourceview2.o
:info:build       __wrap_gtk_source_buffer_backward_iter_to_source_mark in gtksourceview2_la-gtksourceview2.o
:info:build       __wrap_gtk_source_buffer_iter_has_context_class in gtksourceview2_la-gtksourceview2.o
:info:build       ...
:info:build   "_PyCFunction_Type", referenced from:
:info:build       ___GtkSourceGutter_class_init in gtksourceview2_la-gtksourceview2.o
:info:build       ___GtkSourceView_class_init in gtksourceview2_la-gtksourceview2.o
:info:build       ___GtkSourceCompletionProposal__interface_init in gtksourceview2_la-gtksourceview2.o
:info:build       ___GtkSourceCompletionProvider__interface_init in gtksourceview2_la-gtksourceview2.o
:info:build       ___GtkSourceUndoManager__interface_init in gtksourceview2_la-gtksourceview2.o
:info:build   "_PyCObject_AsVoidPtr", referenced from:
:info:build       _initgtksourceview2 in gtksourceview2_la-gtksourceview2module.o
:info:build   "_PyCObject_Type", referenced from:
:info:build       _initgtksourceview2 in gtksourceview2_la-gtksourceview2module.o
:info:build   "_PyDict_GetItemString", referenced from:
:info:build       _initgtksourceview2 in gtksourceview2_la-gtksourceview2module.o
:info:build       ___GtkSourceGutter_class_init in gtksourceview2_la-gtksourceview2.o
:info:build       ___GtkSourceView_class_init in gtksourceview2_la-gtksourceview2.o
:info:build   "_PyErr_Clear", referenced from:
:info:build       ___GtkSourceGutter_class_init in gtksourceview2_la-gtksourceview2.o
:info:build       ___GtkSourceView_class_init in gtksourceview2_la-gtksourceview2.o
:info:build       ___GtkSourceCompletionProposal__interface_init in gtksourceview2_la-gtksourceview2.o
:info:build       ___GtkSourceCompletionProvider__interface_init in gtksourceview2_la-gtksourceview2.o
:info:build       ___GtkSourceUndoManager__interface_init in gtksourceview2_la-gtksourceview2.o
:info:build   "_PyErr_Fetch", referenced from:
:info:build       _initgtksourceview2 in gtksourceview2_la-gtksourceview2module.o
:info:build   "_PyErr_Format", referenced from:
:info:build       _initgtksourceview2 in gtksourceview2_la-gtksourceview2module.o
:info:build       _pylist_to_strv in gtksourceview2_la-gtksourceview2.o
:info:build   "_PyErr_Occurred", referenced from:
:info:build       _initgtksourceview2 in gtksourceview2_la-gtksourceview2module.o
:info:build       _pygtksourceview2_add_constants in gtksourceview2_la-gtksourceview2.o
:info:build       __wrap_gtk_source_print_compositor_set_tab_width in gtksourceview2_la-gtksourceview2.o
:info:build       __wrap_gtk_source_print_compositor_set_print_line_numbers in gtksourceview2_la-gtksourceview2.o
:info:build       __wrap_gtk_source_view_set_tab_width in gtksourceview2_la-gtksourceview2.o
:info:build       __wrap_gtk_source_view_set_right_margin_position in gtksourceview2_la-gtksourceview2.o
:info:build       __wrap_GtkSourceCompletionProposal__proxy_do_get_label in gtksourceview2_la-gtksourceview2.o
:info:build       ...
:info:build   "_PyErr_Print", referenced from:
:info:build       _pygtksourceview2_add_constants in gtksourceview2_la-gtksourceview2.o
:info:build       _pygtksourceview_cell_data_func_marshal in gtksourceview2_la-gtksourceview2.o
:info:build       _pygtksourceview_cell_size_func_marshal in gtksourceview2_la-gtksourceview2.o
:info:build       _pygtksourceview_mark_tooltip_func_marshal in gtksourceview2_la-gtksourceview2.o
:info:build       __wrap_GtkSourceCompletionProposal__proxy_do_get_label in gtksourceview2_la-gtksourceview2.o
:info:build       __wrap_GtkSourceCompletionProposal__proxy_do_get_markup in gtksourceview2_la-gtksourceview2.o
:info:build       __wrap_GtkSourceCompletionProposal__proxy_do_get_text in gtksourceview2_la-gtksourceview2.o
:info:build       ...
:info:build   "_PyErr_SetString", referenced from:
:info:build       _initgtksourceview2 in gtksourceview2_la-gtksourceview2module.o
:info:build       __wrap_gtk_source_buffer_new in gtksourceview2_la-gtksourceview2.o
:info:build       __wrap_gtk_source_language_tp_new in gtksourceview2_la-gtksourceview2.o
:info:build       __wrap_gtk_source_language_manager_new in gtksourceview2_la-gtksourceview2.o
:info:build       __wrap_gtk_source_mark_new in gtksourceview2_la-gtksourceview2.o
:info:build       __wrap_gtk_source_print_compositor_new in gtksourceview2_la-gtksourceview2.o
:info:build       __wrap_gtk_source_style_new in gtksourceview2_la-gtksourceview2.o
:info:build       ...
:info:build   "_PyEval_CallFunction", referenced from:
:info:build       _pygtksourceview_cell_data_func_marshal in gtksourceview2_la-gtksourceview2.o
:info:build       _pygtksourceview_cell_size_func_marshal in gtksourceview2_la-gtksourceview2.o
:info:build       _pygtksourceview_mark_tooltip_func_marshal in gtksourceview2_la-gtksourceview2.o
:info:build   "_PyExc_ImportError", referenced from:
:info:build       _initgtksourceview2 in gtksourceview2_la-gtksourceview2module.o
:info:build       _pygtksourceview2_register_classes in gtksourceview2_la-gtksourceview2.o
:info:build   "_PyExc_NotImplementedError", referenced from:
:info:build       __wrap_GtkSourceGutter__do_cell_activated in gtksourceview2_la-gtksourceview2.o
:info:build       __wrap_GtkSourceGutter__do_query_tooltip in gtksourceview2_la-gtksourceview2.o
:info:build       __wrap_GtkSourceView__do_undo in gtksourceview2_la-gtksourceview2.o
:info:build       __wrap_GtkSourceView__do_redo in gtksourceview2_la-gtksourceview2.o
:info:build       __wrap_GtkSourceView__do_line_mark_activated in gtksourceview2_la-gtksourceview2.o
:info:build       __wrap_GtkSourceCompletionProposal__do_get_label in gtksourceview2_la-gtksourceview2.o
:info:build       __wrap_GtkSourceCompletionProposal__do_get_markup in gtksourceview2_la-gtksourceview2.o
:info:build       ...
:info:build   "_PyExc_RuntimeError", referenced from:
:info:build       _initgtksourceview2 in gtksourceview2_la-gtksourceview2module.o
:info:build       __wrap_gtk_source_buffer_new in gtksourceview2_la-gtksourceview2.o
:info:build       __wrap_gtk_source_language_manager_new in gtksourceview2_la-gtksourceview2.o
:info:build       __wrap_gtk_source_mark_new in gtksourceview2_la-gtksourceview2.o
:info:build       __wrap_gtk_source_print_compositor_new in gtksourceview2_la-gtksourceview2.o
:info:build       __wrap_gtk_source_style_new in gtksourceview2_la-gtksourceview2.o
:info:build       __wrap_gtk_source_style_scheme_manager_new in gtksourceview2_la-gtksourceview2.o
:info:build       ...
:info:build   "_PyExc_TypeError", referenced from:
:info:build       __wrap_gtk_source_language_tp_new in gtksourceview2_la-gtksourceview2.o
:info:build       __wrap_gtk_source_style_scheme_tp_new in gtksourceview2_la-gtksourceview2.o
:info:build       __wrap_gtk_source_iter_forward_search in gtksourceview2_la-gtksourceview2.o
:info:build       __wrap_gtk_source_iter_backward_search in gtksourceview2_la-gtksourceview2.o
:info:build       __wrap_gtk_source_buffer_set_language in gtksourceview2_la-gtksourceview2.o
:info:build       __wrap_gtk_source_buffer_ensure_highlight in gtksourceview2_la-gtksourceview2.o
:info:build       __wrap_gtk_source_buffer_create_source_mark in gtksourceview2_la-gtksourceview2.o
:info:build       ...
:info:build   "_PyFloat_FromDouble", referenced from:
:info:build       __wrap_gtk_source_print_compositor_get_top_margin in gtksourceview2_la-gtksourceview2.o
:info:build       __wrap_gtk_source_print_compositor_get_bottom_margin in gtksourceview2_la-gtksourceview2.o
:info:build       __wrap_gtk_source_print_compositor_get_left_margin in gtksourceview2_la-gtksourceview2.o
:info:build       __wrap_gtk_source_print_compositor_get_right_margin in gtksourceview2_la-gtksourceview2.o
:info:build       __wrap_gtk_source_print_compositor_get_pagination_progress in gtksourceview2_la-gtksourceview2.o
:info:build   "_PyImport_ImportModule", referenced from:
:info:build       _initgtksourceview2 in gtksourceview2_la-gtksourceview2module.o
:info:build       _pygtksourceview2_register_classes in gtksourceview2_la-gtksourceview2.o
:info:build   "_PyInt_AsLong", referenced from:
:info:build       __wrap_gtk_source_print_compositor_set_tab_width in gtksourceview2_la-gtksourceview2.o
:info:build       __wrap_gtk_source_print_compositor_set_print_line_numbers in gtksourceview2_la-gtksourceview2.o
:info:build       __wrap_gtk_source_view_set_tab_width in gtksourceview2_la-gtksourceview2.o
:info:build       __wrap_gtk_source_view_set_right_margin_position in gtksourceview2_la-gtksourceview2.o
:info:build   "_PyInt_FromLong", referenced from:
:info:build       __wrap_gtk_source_buffer_get_max_undo_levels in gtksourceview2_la-gtksourceview2.o
:info:build       __wrap_gtk_source_print_compositor_get_n_pages in gtksourceview2_la-gtksourceview2.o
:info:build       __wrap_gtk_source_view_get_indent_width in gtksourceview2_la-gtksourceview2.o
:info:build       __wrap_gtk_source_view_get_mark_category_priority in gtksourceview2_la-gtksourceview2.o
:info:build   "_PyList_Append", referenced from:
:info:build       _gslist_to_pylist_objs in gtksourceview2_la-gtksourceview2.o
:info:build       __wrap_gtk_source_completion_get_providers in gtksourceview2_la-gtksourceview2.o
:info:build   "_PyList_New", referenced from:
:info:build       _gslist_to_pylist_objs in gtksourceview2_la-gtksourceview2.o
:info:build       _strv_to_pylist in gtksourceview2_la-gtksourceview2.o
:info:build       __wrap_gtk_source_completion_get_providers in gtksourceview2_la-gtksourceview2.o
:info:build   "_PyList_SetItem", referenced from:
:info:build       _strv_to_pylist in gtksourceview2_la-gtksourceview2.o
:info:build   "_PyLong_AsUnsignedLong", referenced from:
:info:build       __wrap_gtk_source_print_compositor_set_tab_width in gtksourceview2_la-gtksourceview2.o
:info:build       __wrap_gtk_source_print_compositor_set_print_line_numbers in gtksourceview2_la-gtksourceview2.o
:info:build       __wrap_gtk_source_view_set_tab_width in gtksourceview2_la-gtksourceview2.o
:info:build       __wrap_gtk_source_view_set_right_margin_position in gtksourceview2_la-gtksourceview2.o
:info:build   "_PyLong_FromUnsignedLong", referenced from:
:info:build       __wrap_gtk_source_print_compositor_get_tab_width in gtksourceview2_la-gtksourceview2.o
:info:build       __wrap_gtk_source_print_compositor_get_print_line_numbers in gtksourceview2_la-gtksourceview2.o
:info:build       __wrap_gtk_source_view_get_tab_width in gtksourceview2_la-gtksourceview2.o
:info:build       __wrap_gtk_source_view_get_right_margin_position in gtksourceview2_la-gtksourceview2.o
:info:build       __wrap_gtk_source_completion_proposal_hash in gtksourceview2_la-gtksourceview2.o
:info:build       __wrap_GtkSourceCompletionProposal__do_hash in gtksourceview2_la-gtksourceview2.o
:info:build   "_PyModule_AddObject", referenced from:
:info:build       _initgtksourceview2 in gtksourceview2_la-gtksourceview2module.o
:info:build   "_PyModule_AddStringConstant", referenced from:
:info:build       _pygtksourceview2_add_constants in gtksourceview2_la-gtksourceview2.o
:info:build   "_PyModule_GetDict", referenced from:
:info:build       _initgtksourceview2 in gtksourceview2_la-gtksourceview2module.o
:info:build   "_PyObject_CallObject", referenced from:
:info:build       __wrap_GtkSourceCompletionProposal__proxy_do_get_label in gtksourceview2_la-gtksourceview2.o
:info:build       __wrap_GtkSourceCompletionProposal__proxy_do_get_markup in gtksourceview2_la-gtksourceview2.o
:info:build       __wrap_GtkSourceCompletionProposal__proxy_do_get_text in gtksourceview2_la-gtksourceview2.o
:info:build       __wrap_GtkSourceCompletionProposal__proxy_do_get_icon in gtksourceview2_la-gtksourceview2.o
:info:build       __wrap_GtkSourceCompletionProposal__proxy_do_get_info in gtksourceview2_la-gtksourceview2.o
:info:build       __wrap_GtkSourceCompletionProposal__proxy_do_changed in gtksourceview2_la-gtksourceview2.o
:info:build       __wrap_GtkSourceCompletionProposal__proxy_do_hash in gtksourceview2_la-gtksourceview2.o
:info:build       ...
:info:build   "_PyObject_GetAttrString", referenced from:
:info:build       _initgtksourceview2 in gtksourceview2_la-gtksourceview2module.o
:info:build       _pygtksourceview2_register_classes in gtksourceview2_la-gtksourceview2.o
:info:build       ___GtkSourceGutter_class_init in gtksourceview2_la-gtksourceview2.o
:info:build       ___GtkSourceView_class_init in gtksourceview2_la-gtksourceview2.o
:info:build       ___GtkSourceCompletionProposal__interface_init in gtksourceview2_la-gtksourceview2.o
:info:build       __wrap_GtkSourceCompletionProposal__proxy_do_get_label in gtksourceview2_la-gtksourceview2.o
:info:build       __wrap_GtkSourceCompletionProposal__proxy_do_get_markup in gtksourceview2_la-gtksourceview2.o
:info:build       ...
:info:build   "_PyObject_IsTrue", referenced from:
:info:build       __wrap_gtk_source_completion_context_add_proposals in gtksourceview2_la-gtksourceview2.o
:info:build       __wrap_GtkSourceCompletionProposal__proxy_do_equal in gtksourceview2_la-gtksourceview2.o
:info:build       __wrap_GtkSourceCompletionProvider__proxy_do_match in gtksourceview2_la-gtksourceview2.o
:info:build       __wrap_GtkSourceCompletionProvider__proxy_do_activate_proposal in gtksourceview2_la-gtksourceview2.o
:info:build       __wrap_GtkSourceUndoManager__proxy_do_can_undo in gtksourceview2_la-gtksourceview2.o
:info:build       __wrap_GtkSourceUndoManager__proxy_do_can_redo in gtksourceview2_la-gtksourceview2.o
:info:build       __wrap_GtkSourceGutter__proxy_do_query_tooltip in gtksourceview2_la-gtksourceview2.o
:info:build       ...
:info:build   "_PyObject_Repr", referenced from:
:info:build       _initgtksourceview2 in gtksourceview2_la-gtksourceview2module.o
:info:build   "_PySequence_Check", referenced from:
:info:build       _pylist_to_strv in gtksourceview2_la-gtksourceview2.o
:info:build       __wrap_gtk_source_completion_show in gtksourceview2_la-gtksourceview2.o
:info:build       __wrap_gtk_source_completion_context_add_proposals in gtksourceview2_la-gtksourceview2.o
:info:build   "_PySequence_GetItem", referenced from:
:info:build       _pylist_to_strv in gtksourceview2_la-gtksourceview2.o
:info:build       _pylist_to_glist_gobjs in gtksourceview2_la-gtksourceview2.o
:info:build   "_PySequence_Size", referenced from:
:info:build       _pylist_to_strv in gtksourceview2_la-gtksourceview2.o
:info:build       _pylist_to_glist_gobjs in gtksourceview2_la-gtksourceview2.o
:info:build   "_PyString_AsString", referenced from:
:info:build       _initgtksourceview2 in gtksourceview2_la-gtksourceview2module.o
:info:build       _pylist_to_strv in gtksourceview2_la-gtksourceview2.o
:info:build       _pygtksourceview_mark_tooltip_func_marshal in gtksourceview2_la-gtksourceview2.o
:info:build   "_PyString_FromString", referenced from:
:info:build       _strv_to_pylist in gtksourceview2_la-gtksourceview2.o
:info:build       __wrap_gtk_source_language_get_id in gtksourceview2_la-gtksourceview2.o
:info:build       __wrap_gtk_source_language_get_name in gtksourceview2_la-gtksourceview2.o
:info:build       __wrap_gtk_source_language_get_section in gtksourceview2_la-gtksourceview2.o
:info:build       __wrap_gtk_source_language_get_metadata in gtksourceview2_la-gtksourceview2.o
:info:build       __wrap_gtk_source_language_get_style_name in gtksourceview2_la-gtksourceview2.o
:info:build       __wrap_gtk_source_mark_get_category in gtksourceview2_la-gtksourceview2.o
:info:build       ...
:info:build   "_PyTuple_New", referenced from:
:info:build       __wrap_GtkSourceCompletionProposal__proxy_do_equal in gtksourceview2_la-gtksourceview2.o
:info:build       __wrap_GtkSourceCompletionProvider__proxy_do_populate in gtksourceview2_la-gtksourceview2.o
:info:build       __wrap_GtkSourceCompletionProvider__proxy_do_match in gtksourceview2_la-gtksourceview2.o
:info:build       __wrap_GtkSourceCompletionProvider__proxy_do_get_info_widget in gtksourceview2_la-gtksourceview2.o
:info:build       __wrap_GtkSourceCompletionProvider__proxy_do_update_info in gtksourceview2_la-gtksourceview2.o
:info:build       __wrap_GtkSourceCompletionProvider__proxy_do_get_start_iter in gtksourceview2_la-gtksourceview2.o
:info:build       __wrap_GtkSourceCompletionProvider__proxy_do_activate_proposal in gtksourceview2_la-gtksourceview2.o
:info:build       ...
:info:build   "_PyType_IsSubtype", referenced from:
:info:build       __wrap_gtk_source_iter_forward_search in gtksourceview2_la-gtksourceview2.o
:info:build       __wrap_gtk_source_iter_backward_search in gtksourceview2_la-gtksourceview2.o
:info:build       ___GtkSourceGutter_class_init in gtksourceview2_la-gtksourceview2.o
:info:build       ___GtkSourceView_class_init in gtksourceview2_la-gtksourceview2.o
:info:build       __wrap_gtk_source_buffer_set_language in gtksourceview2_la-gtksourceview2.o
:info:build       __wrap_gtk_source_buffer_ensure_highlight in gtksourceview2_la-gtksourceview2.o
:info:build       __wrap_gtk_source_buffer_create_source_mark in gtksourceview2_la-gtksourceview2.o
:info:build       ...
:info:build   "_Py_BuildValue", referenced from:
:info:build       _initgtksourceview2 in gtksourceview2_la-gtksourceview2module.o
:info:build       __wrap_gtk_source_iter_forward_search in gtksourceview2_la-gtksourceview2.o
:info:build       __wrap_gtk_source_iter_backward_search in gtksourceview2_la-gtksourceview2.o
:info:build       _pygtksourceview2_register_classes in gtksourceview2_la-gtksourceview2.o
:info:build       __wrap_GtkSourceCompletionProposal__proxy_do_get_label in gtksourceview2_la-gtksourceview2.o
:info:build       __wrap_GtkSourceCompletionProposal__proxy_do_get_markup in gtksourceview2_la-gtksourceview2.o
:info:build       __wrap_GtkSourceCompletionProposal__proxy_do_get_text in gtksourceview2_la-gtksourceview2.o
:info:build       ...
:info:build   "_Py_FatalError", referenced from:
:info:build       _initgtksourceview2 in gtksourceview2_la-gtksourceview2module.o
:info:build   "_Py_InitModule4_64", referenced from:
:info:build       _initgtksourceview2 in gtksourceview2_la-gtksourceview2module.o
:info:build   "__Py_NoneStruct", referenced from:
:info:build       __wrap_gtk_source_iter_forward_search in gtksourceview2_la-gtksourceview2.o
:info:build       __wrap_gtk_source_iter_backward_search in gtksourceview2_la-gtksourceview2.o
:info:build       __wrap_gtk_source_buffer_set_highlight_syntax in gtksourceview2_la-gtksourceview2.o
:info:build       __wrap_gtk_source_buffer_set_highlight_matching_brackets in gtksourceview2_la-gtksourceview2.o
:info:build       __wrap_gtk_source_buffer_set_max_undo_levels in gtksourceview2_la-gtksourceview2.o
:info:build       __wrap_gtk_source_buffer_set_language in gtksourceview2_la-gtksourceview2.o
:info:build       __wrap_gtk_source_buffer_undo in gtksourceview2_la-gtksourceview2.o
:info:build       ...
:info:build ld: symbol(s) not found for architecture x86_64
:info:build clang: error: linker command failed with exit code 1 (use -v to see invocation)
:info:build make[2]: *** [gtksourceview2.la] Error 1
:info:build make[2]: Leaving directory `/opt/local/var/macports/build/_opt_local_var_macports_sources_rsync.macports.org_macports_release_tarballs_ports_python_py27-pygtksourceview/py27-pygtksourceview/work/pygtksourceview-2.10.1'
:info:build make[1]: *** [all-recursive] Error 1
:info:build make[1]: Leaving directory `/opt/local/var/macports/build/_opt_local_var_macports_sources_rsync.macports.org_macports_release_tarballs_ports_python_py27-pygtksourceview/py27-pygtksourceview/work/pygtksourceview-2.10.1'
:info:build make: *** [all] Error 2
:info:build make: Leaving directory `/opt/local/var/macports/build/_opt_local_var_macports_sources_rsync.macports.org_macports_release_tarballs_ports_python_py27-pygtksourceview/py27-pygtksourceview/work/pygtksourceview-2.10.1'
:info:build Command failed:  cd "/opt/local/var/macports/build/_opt_local_var_macports_sources_rsync.macports.org_macports_release_tarballs_ports_python_py27-pygtksourceview/py27-pygtksourceview/work/pygtksourceview-2.10.1" && /usr/bin/make -j4 -w all 
:info:build Exit code: 2
:error:build Failed to build py27-pygtksourceview: command execution failed
:debug:build Error code: CHILDSTATUS 81427 2
:debug:build Backtrace: command execution failed
:debug:build     while executing
:debug:build "system {*}$notty {*}$nice $fullcmdstring"
:debug:build     invoked from within
:debug:build "command_exec build"
:debug:build     (procedure "portbuild::build_main" line 8)
:debug:build     invoked from within
:debug:build "$procedure $targetname"
:error:build See /opt/local/var/macports/logs/_opt_local_var_macports_sources_rsync.macports.org_macports_release_tarballs_ports_python_py27-pygtksourceview/py27-pygtksourceview/main.log for details.
version:1
:debug:sysinfo macOS 11.2 (darwin/20.3.0) arch i386
:debug:sysinfo MacPorts 2.6.4
:debug:sysinfo Xcode none
:debug:sysinfo SDK 11.2
:debug:sysinfo MACOSX_DEPLOYMENT_TARGET: 11.2
:debug:clean dropping privileges: euid changed to 503, egid changed to 502.
:debug:main Executing org.macports.main (py27-pygtksourceview)
:debug:main Privilege de-escalation not attempted as not running as root.
:debug:archivefetch archivefetch phase started at Wed Mar 24 21:37:36 CET 2021
:msg:archivefetch --->  Fetching archive for py27-pygtksourceview
:debug:archivefetch Executing org.macports.archivefetch (py27-pygtksourceview)
:debug:archivefetch euid/egid changed to: 0/0
:debug:archivefetch chowned /opt/local/var/macports/incoming to macports
:debug:archivefetch euid/egid changed to: 503/502
:info:archivefetch --->  py27-pygtksourceview-2.10.1_4.darwin_20.x86_64.tbz2 doesn't seem to exist in /opt/local/var/macports/incoming/verified
:msg:archivefetch --->  Attempting to fetch py27-pygtksourceview-2.10.1_4.darwin_20.x86_64.tbz2 from https://packages.macports.org/py27-pygtksourceview
:debug:archivefetch Fetching archive failed: The requested URL returned error: 404 Not Found
:msg:archivefetch --->  Attempting to fetch py27-pygtksourceview-2.10.1_4.darwin_20.x86_64.tbz2 from https://lil.fr.packages.macports.org/py27-pygtksourceview
:debug:archivefetch Fetching archive failed: The requested URL returned error: 404 Not Found
:msg:archivefetch --->  Attempting to fetch py27-pygtksourceview-2.10.1_4.darwin_20.x86_64.tbz2 from http://fco.it.packages.macports.org/py27-pygtksourceview
:debug:archivefetch Fetching archive failed: The requested URL returned error: 404 Not Found
:debug:archivefetch Privilege de-escalation not attempted as not running as root.
:debug:archivefetch Skipping completed org.macports.fetch (py27-pygtksourceview)
:debug:archivefetch Privilege de-escalation not attempted as not running as root.
:debug:archivefetch Skipping completed org.macports.checksum (py27-pygtksourceview)
:debug:archivefetch Privilege de-escalation not attempted as not running as root.
:debug:archivefetch Skipping completed org.macports.extract (py27-pygtksourceview)
:debug:archivefetch Privilege de-escalation not attempted as not running as root.
:debug:archivefetch Skipping completed org.macports.patch (py27-pygtksourceview)
:debug:archivefetch Privilege de-escalation not attempted as not running as root.
:debug:archivefetch Skipping completed org.macports.configure (py27-pygtksourceview)
:debug:archivefetch Privilege de-escalation not attempted as not running as root.
:debug:build build phase started at Wed Mar 24 21:37:39 CET 2021
:notice:build --->  Building py27-pygtksourceview
:debug:build Executing org.macports.build (py27-pygtksourceview)
:debug:build Environment: 
:debug:build CC_PRINT_OPTIONS='YES'
:debug:build CC_PRINT_OPTIONS_FILE='/opt/local/var/macports/build/_opt_local_var_macports_sources_rsync.macports.org_macports_release_tarballs_ports_python_py27-pygtksourceview/py27-pygtksourceview/work/.CC_PRINT_OPTIONS'
:debug:build CPATH='/opt/local/include'
:debug:build DEVELOPER_DIR='/Library/Developer/CommandLineTools'
:debug:build LIBRARY_PATH='/opt/local/lib'
:debug:build MACOSX_DEPLOYMENT_TARGET='11.2'
:debug:build SDKROOT='/Library/Developer/CommandLineTools/SDKs/MacOSX.sdk'
:info:build Executing:  cd "/opt/local/var/macports/build/_opt_local_var_macports_sources_rsync.macports.org_macports_release_tarballs_ports_python_py27-pygtksourceview/py27-pygtksourceview/work/pygtksourceview-2.10.1" && /usr/bin/make -j4 -w all 
:debug:build system:  cd "/opt/local/var/macports/build/_opt_local_var_macports_sources_rsync.macports.org_macports_release_tarballs_ports_python_py27-pygtksourceview/py27-pygtksourceview/work/pygtksourceview-2.10.1" && /usr/bin/make -j4 -w all 
:info:build make: Entering directory `/opt/local/var/macports/build/_opt_local_var_macports_sources_rsync.macports.org_macports_release_tarballs_ports_python_py27-pygtksourceview/py27-pygtksourceview/work/pygtksourceview-2.10.1'
:info:build /Library/Developer/CommandLineTools/usr/bin/make  all-recursive
:info:build make[1]: Entering directory `/opt/local/var/macports/build/_opt_local_var_macports_sources_rsync.macports.org_macports_release_tarballs_ports_python_py27-pygtksourceview/py27-pygtksourceview/work/pygtksourceview-2.10.1'
:info:build Making all in test
:info:build make[2]: Entering directory `/opt/local/var/macports/build/_opt_local_var_macports_sources_rsync.macports.org_macports_release_tarballs_ports_python_py27-pygtksourceview/py27-pygtksourceview/work/pygtksourceview-2.10.1/test'
:info:build make[2]: Nothing to be done for `all'.
:info:build make[2]: Leaving directory `/opt/local/var/macports/build/_opt_local_var_macports_sources_rsync.macports.org_macports_release_tarballs_ports_python_py27-pygtksourceview/py27-pygtksourceview/work/pygtksourceview-2.10.1/test'
:info:build Making all in docs
:info:build make[2]: Entering directory `/opt/local/var/macports/build/_opt_local_var_macports_sources_rsync.macports.org_macports_release_tarballs_ports_python_py27-pygtksourceview/py27-pygtksourceview/work/pygtksourceview-2.10.1/docs'
:info:build /Library/Developer/CommandLineTools/usr/bin/make  all-am
:info:build make[3]: Entering directory `/opt/local/var/macports/build/_opt_local_var_macports_sources_rsync.macports.org_macports_release_tarballs_ports_python_py27-pygtksourceview/py27-pygtksourceview/work/pygtksourceview-2.10.1/docs'
:info:build make[3]: Nothing to be done for `all-am'.
:info:build make[3]: Leaving directory `/opt/local/var/macports/build/_opt_local_var_macports_sources_rsync.macports.org_macports_release_tarballs_ports_python_py27-pygtksourceview/py27-pygtksourceview/work/pygtksourceview-2.10.1/docs'
:info:build make[2]: Leaving directory `/opt/local/var/macports/build/_opt_local_var_macports_sources_rsync.macports.org_macports_release_tarballs_ports_python_py27-pygtksourceview/py27-pygtksourceview/work/pygtksourceview-2.10.1/docs'
:info:build make[2]: Entering directory `/opt/local/var/macports/build/_opt_local_var_macports_sources_rsync.macports.org_macports_release_tarballs_ports_python_py27-pygtksourceview/py27-pygtksourceview/work/pygtksourceview-2.10.1'
:info:build /bin/sh ./libtool --tag=CC   --mode=link /usr/bin/clang -D_REENTRANT -I/opt/local/Library/Frameworks/Python.framework/Versions/2.7/include/pygtk-2.0 -I/opt/local/include/gtksourceview-2.0 -I/opt/local/include/libxml2 -I/opt/local/include/gtk-2.0 -I/opt/local/lib/gtk-2.0/include -I/opt/local/include/pango-1.0 -I/opt/local/include/gio-unix-2.0/ -I/opt/local/include/cairo -I/opt/local/include/atk-1.0 -I/opt/local/include/cairo -I/opt/local/include/pixman-1 -I/opt/local/include/gdk-pixbuf-2.0 -I/opt/local/include/pango-1.0 -I/opt/local/include/harfbuzz -I/opt/local/include/pango-1.0 -I/opt/local/include/fribidi -I/opt/local/include/glib-2.0 -I/opt/local/lib/glib-2.0/include -I/opt/local/include/ossp -I/opt/local/include/freetype2 -I/opt/local/include/libpng16 -pipe -Os -isysroot/Library/Developer/CommandLineTools/SDKs/MacOSX.sdk -arch x86_64 -Wall -fno-strict-aliasing -module -avoid-version -export-symbols-regex initgtksourceview2   -L/opt/local/lib -Wl,-headerpad_max_install_names -Wl,-syslibroot,/Library/Developer/CommandLineTools/SDKs/MacOSX.sdk -arch x86_64 -o gtksourceview2.la -rpath /opt/local/Library/Frameworks/Python.framework/Versions/2.7/lib/python2.7/site-packages gtksourceview2_la-gtksourceview2module.lo gtksourceview2_la-gtksourceview2.lo -L/opt/local/lib -lgtksourceview-2.0 -lgtk-x11-2.0 -lgdk-x11-2.0 -lpangocairo-1.0 -lgio-2.0 -lXrender -lXinerama -lXi -lXrandr -lXcursor -lXcomposite -lXdamage -lXfixes -lX11 -lXext -latk-1.0 -lcairo -lgdk_pixbuf-2.0 -lgio-2.0 -lpangoft2-1.0 -lpango-1.0 -lgobject-2.0 -lglib-2.0 -lintl -Wl,-framework -Wl,CoreFoundation -lfontconfig -lfreetype  
:info:build libtool: link: rm -fr  .libs/gtksourceview2.exp
:info:build libtool: link: /usr/bin/nm -B  .libs/gtksourceview2_la-gtksourceview2module.o .libs/gtksourceview2_la-gtksourceview2.o   | sed -n -e 's/^.*[	 ]\([BCDEGRST][BCDEGRST]*\)[	 ][	 ]*_\([_A-Za-z][_A-Za-z0-9]*\)$/\1 _\2 \2/p' | /opt/local/bin/gsed 's/.* //' | sort | uniq > .libs/gtksourceview2.exp
:info:build libtool: link: /usr/bin/grep -E -e "initgtksourceview2" ".libs/gtksourceview2.exp" > ".libs/gtksourceview2.expT"
:info:build libtool: link: mv -f ".libs/gtksourceview2.expT" ".libs/gtksourceview2.exp"
:info:build libtool: link: sed -e 's,^,_,' < .libs/gtksourceview2.exp > .libs/gtksourceview2-symbols.expsym
:info:build libtool: link: /usr/bin/clang  -o .libs/gtksourceview2.so -bundle  .libs/gtksourceview2_la-gtksourceview2module.o .libs/gtksourceview2_la-gtksourceview2.o   -L/opt/local/lib -lgtksourceview-2.0 -lgtk-x11-2.0 -lgdk-x11-2.0 -lpangocairo-1.0 -lXrender -lXinerama -lXi -lXrandr -lXcursor -lXcomposite -lXdamage -lXfixes -lX11 -lXext -latk-1.0 -lcairo -lgdk_pixbuf-2.0 -lgio-2.0 -lpangoft2-1.0 -lpango-1.0 -lgobject-2.0 -lglib-2.0 -lintl -lfontconfig -lfreetype  -arch x86_64 -Wl,-headerpad_max_install_names -Wl,-syslibroot -Wl,/Library/Developer/CommandLineTools/SDKs/MacOSX.sdk -arch x86_64 -Wl,-framework -Wl,CoreFoundation   -Wl,-exported_symbols_list,.libs/gtksourceview2-symbols.expsym
:info:build Undefined symbols for architecture x86_64:
:info:build   "_PyArg_ParseTuple", referenced from:
:info:build       __wrap_gtk_source_gutter_set_cell_data_func in gtksourceview2_la-gtksourceview2.o
:info:build       __wrap_gtk_source_gutter_set_cell_size_func in gtksourceview2_la-gtksourceview2.o
:info:build       __wrap_gtk_source_view_set_mark_category_tooltip_func in gtksourceview2_la-gtksourceview2.o
:info:build       __wrap_gtk_source_view_set_mark_category_tooltip_markup_func in gtksourceview2_la-gtksourceview2.o
:info:build       __wrap_GtkSourceCompletionProposal__proxy_do_get_label in gtksourceview2_la-gtksourceview2.o
:info:build       __wrap_GtkSourceCompletionProposal__proxy_do_get_markup in gtksourceview2_la-gtksourceview2.o
:info:build       __wrap_GtkSourceCompletionProposal__proxy_do_get_text in gtksourceview2_la-gtksourceview2.o
:info:build       ...
:info:build   "_PyArg_ParseTupleAndKeywords", referenced from:
:info:build       __wrap_gtk_source_buffer_new in gtksourceview2_la-gtksourceview2.o
:info:build       __wrap_gtk_source_language_manager_new in gtksourceview2_la-gtksourceview2.o
:info:build       __wrap_gtk_source_mark_new in gtksourceview2_la-gtksourceview2.o
:info:build       __wrap_gtk_source_print_compositor_new in gtksourceview2_la-gtksourceview2.o
:info:build       __wrap_gtk_source_style_new in gtksourceview2_la-gtksourceview2.o
:info:build       __wrap_gtk_source_style_scheme_manager_new in gtksourceview2_la-gtksourceview2.o
:info:build       __wrap_gtk_source_view_new in gtksourceview2_la-gtksourceview2.o
:info:build       ...
:info:build   "_PyBool_FromLong", referenced from:
:info:build       __wrap_gtk_source_buffer_get_highlight_syntax in gtksourceview2_la-gtksourceview2.o
:info:build       __wrap_gtk_source_buffer_get_highlight_matching_brackets in gtksourceview2_la-gtksourceview2.o
:info:build       __wrap_gtk_source_buffer_can_undo in gtksourceview2_la-gtksourceview2.o
:info:build       __wrap_gtk_source_buffer_can_redo in gtksourceview2_la-gtksourceview2.o
:info:build       __wrap_gtk_source_buffer_forward_iter_to_source_mark in gtksourceview2_la-gtksourceview2.o
:info:build       __wrap_gtk_source_buffer_backward_iter_to_source_mark in gtksourceview2_la-gtksourceview2.o
:info:build       __wrap_gtk_source_buffer_iter_has_context_class in gtksourceview2_la-gtksourceview2.o
:info:build       ...
:info:build   "_PyCFunction_Type", referenced from:
:info:build       ___GtkSourceGutter_class_init in gtksourceview2_la-gtksourceview2.o
:info:build       ___GtkSourceView_class_init in gtksourceview2_la-gtksourceview2.o
:info:build       ___GtkSourceCompletionProposal__interface_init in gtksourceview2_la-gtksourceview2.o
:info:build       ___GtkSourceCompletionProvider__interface_init in gtksourceview2_la-gtksourceview2.o
:info:build       ___GtkSourceUndoManager__interface_init in gtksourceview2_la-gtksourceview2.o
:info:build   "_PyCObject_AsVoidPtr", referenced from:
:info:build       _initgtksourceview2 in gtksourceview2_la-gtksourceview2module.o
:info:build   "_PyCObject_Type", referenced from:
:info:build       _initgtksourceview2 in gtksourceview2_la-gtksourceview2module.o
:info:build   "_PyDict_GetItemString", referenced from:
:info:build       _initgtksourceview2 in gtksourceview2_la-gtksourceview2module.o
:info:build       ___GtkSourceGutter_class_init in gtksourceview2_la-gtksourceview2.o
:info:build       ___GtkSourceView_class_init in gtksourceview2_la-gtksourceview2.o
:info:build   "_PyErr_Clear", referenced from:
:info:build       ___GtkSourceGutter_class_init in gtksourceview2_la-gtksourceview2.o
:info:build       ___GtkSourceView_class_init in gtksourceview2_la-gtksourceview2.o
:info:build       ___GtkSourceCompletionProposal__interface_init in gtksourceview2_la-gtksourceview2.o
:info:build       ___GtkSourceCompletionProvider__interface_init in gtksourceview2_la-gtksourceview2.o
:info:build       ___GtkSourceUndoManager__interface_init in gtksourceview2_la-gtksourceview2.o
:info:build   "_PyErr_Fetch", referenced from:
:info:build       _initgtksourceview2 in gtksourceview2_la-gtksourceview2module.o
:info:build   "_PyErr_Format", referenced from:
:info:build       _initgtksourceview2 in gtksourceview2_la-gtksourceview2module.o
:info:build       _pylist_to_strv in gtksourceview2_la-gtksourceview2.o
:info:build   "_PyErr_Occurred", referenced from:
:info:build       _initgtksourceview2 in gtksourceview2_la-gtksourceview2module.o
:info:build       _pygtksourceview2_add_constants in gtksourceview2_la-gtksourceview2.o
:info:build       __wrap_gtk_source_print_compositor_set_tab_width in gtksourceview2_la-gtksourceview2.o
:info:build       __wrap_gtk_source_print_compositor_set_print_line_numbers in gtksourceview2_la-gtksourceview2.o
:info:build       __wrap_gtk_source_view_set_tab_width in gtksourceview2_la-gtksourceview2.o
:info:build       __wrap_gtk_source_view_set_right_margin_position in gtksourceview2_la-gtksourceview2.o
:info:build       __wrap_GtkSourceCompletionProposal__proxy_do_get_label in gtksourceview2_la-gtksourceview2.o
:info:build       ...
:info:build   "_PyErr_Print", referenced from:
:info:build       _pygtksourceview2_add_constants in gtksourceview2_la-gtksourceview2.o
:info:build       _pygtksourceview_cell_data_func_marshal in gtksourceview2_la-gtksourceview2.o
:info:build       _pygtksourceview_cell_size_func_marshal in gtksourceview2_la-gtksourceview2.o
:info:build       _pygtksourceview_mark_tooltip_func_marshal in gtksourceview2_la-gtksourceview2.o
:info:build       __wrap_GtkSourceCompletionProposal__proxy_do_get_label in gtksourceview2_la-gtksourceview2.o
:info:build       __wrap_GtkSourceCompletionProposal__proxy_do_get_markup in gtksourceview2_la-gtksourceview2.o
:info:build       __wrap_GtkSourceCompletionProposal__proxy_do_get_text in gtksourceview2_la-gtksourceview2.o
:info:build       ...
:info:build   "_PyErr_SetString", referenced from:
:info:build       _initgtksourceview2 in gtksourceview2_la-gtksourceview2module.o
:info:build       __wrap_gtk_source_buffer_new in gtksourceview2_la-gtksourceview2.o
:info:build       __wrap_gtk_source_language_tp_new in gtksourceview2_la-gtksourceview2.o
:info:build       __wrap_gtk_source_language_manager_new in gtksourceview2_la-gtksourceview2.o
:info:build       __wrap_gtk_source_mark_new in gtksourceview2_la-gtksourceview2.o
:info:build       __wrap_gtk_source_print_compositor_new in gtksourceview2_la-gtksourceview2.o
:info:build       __wrap_gtk_source_style_new in gtksourceview2_la-gtksourceview2.o
:info:build       ...
:info:build   "_PyEval_CallFunction", referenced from:
:info:build       _pygtksourceview_cell_data_func_marshal in gtksourceview2_la-gtksourceview2.o
:info:build       _pygtksourceview_cell_size_func_marshal in gtksourceview2_la-gtksourceview2.o
:info:build       _pygtksourceview_mark_tooltip_func_marshal in gtksourceview2_la-gtksourceview2.o
:info:build   "_PyExc_ImportError", referenced from:
:info:build       _initgtksourceview2 in gtksourceview2_la-gtksourceview2module.o
:info:build       _pygtksourceview2_register_classes in gtksourceview2_la-gtksourceview2.o
:info:build   "_PyExc_NotImplementedError", referenced from:
:info:build       __wrap_GtkSourceGutter__do_cell_activated in gtksourceview2_la-gtksourceview2.o
:info:build       __wrap_GtkSourceGutter__do_query_tooltip in gtksourceview2_la-gtksourceview2.o
:info:build       __wrap_GtkSourceView__do_undo in gtksourceview2_la-gtksourceview2.o
:info:build       __wrap_GtkSourceView__do_redo in gtksourceview2_la-gtksourceview2.o
:info:build       __wrap_GtkSourceView__do_line_mark_activated in gtksourceview2_la-gtksourceview2.o
:info:build       __wrap_GtkSourceCompletionProposal__do_get_label in gtksourceview2_la-gtksourceview2.o
:info:build       __wrap_GtkSourceCompletionProposal__do_get_markup in gtksourceview2_la-gtksourceview2.o
:info:build       ...
:info:build   "_PyExc_RuntimeError", referenced from:
:info:build       _initgtksourceview2 in gtksourceview2_la-gtksourceview2module.o
:info:build       __wrap_gtk_source_buffer_new in gtksourceview2_la-gtksourceview2.o
:info:build       __wrap_gtk_source_language_manager_new in gtksourceview2_la-gtksourceview2.o
:info:build       __wrap_gtk_source_mark_new in gtksourceview2_la-gtksourceview2.o
:info:build       __wrap_gtk_source_print_compositor_new in gtksourceview2_la-gtksourceview2.o
:info:build       __wrap_gtk_source_style_new in gtksourceview2_la-gtksourceview2.o
:info:build       __wrap_gtk_source_style_scheme_manager_new in gtksourceview2_la-gtksourceview2.o
:info:build       ...
:info:build   "_PyExc_TypeError", referenced from:
:info:build       __wrap_gtk_source_language_tp_new in gtksourceview2_la-gtksourceview2.o
:info:build       __wrap_gtk_source_style_scheme_tp_new in gtksourceview2_la-gtksourceview2.o
:info:build       __wrap_gtk_source_iter_forward_search in gtksourceview2_la-gtksourceview2.o
:info:build       __wrap_gtk_source_iter_backward_search in gtksourceview2_la-gtksourceview2.o
:info:build       __wrap_gtk_source_buffer_set_language in gtksourceview2_la-gtksourceview2.o
:info:build       __wrap_gtk_source_buffer_ensure_highlight in gtksourceview2_la-gtksourceview2.o
:info:build       __wrap_gtk_source_buffer_create_source_mark in gtksourceview2_la-gtksourceview2.o
:info:build       ...
:info:build   "_PyFloat_FromDouble", referenced from:
:info:build       __wrap_gtk_source_print_compositor_get_top_margin in gtksourceview2_la-gtksourceview2.o
:info:build       __wrap_gtk_source_print_compositor_get_bottom_margin in gtksourceview2_la-gtksourceview2.o
:info:build       __wrap_gtk_source_print_compositor_get_left_margin in gtksourceview2_la-gtksourceview2.o
:info:build       __wrap_gtk_source_print_compositor_get_right_margin in gtksourceview2_la-gtksourceview2.o
:info:build       __wrap_gtk_source_print_compositor_get_pagination_progress in gtksourceview2_la-gtksourceview2.o
:info:build   "_PyImport_ImportModule", referenced from:
:info:build       _initgtksourceview2 in gtksourceview2_la-gtksourceview2module.o
:info:build       _pygtksourceview2_register_classes in gtksourceview2_la-gtksourceview2.o
:info:build   "_PyInt_AsLong", referenced from:
:info:build       __wrap_gtk_source_print_compositor_set_tab_width in gtksourceview2_la-gtksourceview2.o
:info:build       __wrap_gtk_source_print_compositor_set_print_line_numbers in gtksourceview2_la-gtksourceview2.o
:info:build       __wrap_gtk_source_view_set_tab_width in gtksourceview2_la-gtksourceview2.o
:info:build       __wrap_gtk_source_view_set_right_margin_position in gtksourceview2_la-gtksourceview2.o
:info:build   "_PyInt_FromLong", referenced from:
:info:build       __wrap_gtk_source_buffer_get_max_undo_levels in gtksourceview2_la-gtksourceview2.o
:info:build       __wrap_gtk_source_print_compositor_get_n_pages in gtksourceview2_la-gtksourceview2.o
:info:build       __wrap_gtk_source_view_get_indent_width in gtksourceview2_la-gtksourceview2.o
:info:build       __wrap_gtk_source_view_get_mark_category_priority in gtksourceview2_la-gtksourceview2.o
:info:build   "_PyList_Append", referenced from:
:info:build       _gslist_to_pylist_objs in gtksourceview2_la-gtksourceview2.o
:info:build       __wrap_gtk_source_completion_get_providers in gtksourceview2_la-gtksourceview2.o
:info:build   "_PyList_New", referenced from:
:info:build       _gslist_to_pylist_objs in gtksourceview2_la-gtksourceview2.o
:info:build       _strv_to_pylist in gtksourceview2_la-gtksourceview2.o
:info:build       __wrap_gtk_source_completion_get_providers in gtksourceview2_la-gtksourceview2.o
:info:build   "_PyList_SetItem", referenced from:
:info:build       _strv_to_pylist in gtksourceview2_la-gtksourceview2.o
:info:build   "_PyLong_AsUnsignedLong", referenced from:
:info:build       __wrap_gtk_source_print_compositor_set_tab_width in gtksourceview2_la-gtksourceview2.o
:info:build       __wrap_gtk_source_print_compositor_set_print_line_numbers in gtksourceview2_la-gtksourceview2.o
:info:build       __wrap_gtk_source_view_set_tab_width in gtksourceview2_la-gtksourceview2.o
:info:build       __wrap_gtk_source_view_set_right_margin_position in gtksourceview2_la-gtksourceview2.o
:info:build   "_PyLong_FromUnsignedLong", referenced from:
:info:build       __wrap_gtk_source_print_compositor_get_tab_width in gtksourceview2_la-gtksourceview2.o
:info:build       __wrap_gtk_source_print_compositor_get_print_line_numbers in gtksourceview2_la-gtksourceview2.o
:info:build       __wrap_gtk_source_view_get_tab_width in gtksourceview2_la-gtksourceview2.o
:info:build       __wrap_gtk_source_view_get_right_margin_position in gtksourceview2_la-gtksourceview2.o
:info:build       __wrap_gtk_source_completion_proposal_hash in gtksourceview2_la-gtksourceview2.o
:info:build       __wrap_GtkSourceCompletionProposal__do_hash in gtksourceview2_la-gtksourceview2.o
:info:build   "_PyModule_AddObject", referenced from:
:info:build       _initgtksourceview2 in gtksourceview2_la-gtksourceview2module.o
:info:build   "_PyModule_AddStringConstant", referenced from:
:info:build       _pygtksourceview2_add_constants in gtksourceview2_la-gtksourceview2.o
:info:build   "_PyModule_GetDict", referenced from:
:info:build       _initgtksourceview2 in gtksourceview2_la-gtksourceview2module.o
:info:build   "_PyObject_CallObject", referenced from:
:info:build       __wrap_GtkSourceCompletionProposal__proxy_do_get_label in gtksourceview2_la-gtksourceview2.o
:info:build       __wrap_GtkSourceCompletionProposal__proxy_do_get_markup in gtksourceview2_la-gtksourceview2.o
:info:build       __wrap_GtkSourceCompletionProposal__proxy_do_get_text in gtksourceview2_la-gtksourceview2.o
:info:build       __wrap_GtkSourceCompletionProposal__proxy_do_get_icon in gtksourceview2_la-gtksourceview2.o
:info:build       __wrap_GtkSourceCompletionProposal__proxy_do_get_info in gtksourceview2_la-gtksourceview2.o
:info:build       __wrap_GtkSourceCompletionProposal__proxy_do_changed in gtksourceview2_la-gtksourceview2.o
:info:build       __wrap_GtkSourceCompletionProposal__proxy_do_hash in gtksourceview2_la-gtksourceview2.o
:info:build       ...
:info:build   "_PyObject_GetAttrString", referenced from:
:info:build       _initgtksourceview2 in gtksourceview2_la-gtksourceview2module.o
:info:build       _pygtksourceview2_register_classes in gtksourceview2_la-gtksourceview2.o
:info:build       ___GtkSourceGutter_class_init in gtksourceview2_la-gtksourceview2.o
:info:build       ___GtkSourceView_class_init in gtksourceview2_la-gtksourceview2.o
:info:build       ___GtkSourceCompletionProposal__interface_init in gtksourceview2_la-gtksourceview2.o
:info:build       __wrap_GtkSourceCompletionProposal__proxy_do_get_label in gtksourceview2_la-gtksourceview2.o
:info:build       __wrap_GtkSourceCompletionProposal__proxy_do_get_markup in gtksourceview2_la-gtksourceview2.o
:info:build       ...
:info:build   "_PyObject_IsTrue", referenced from:
:info:build       __wrap_gtk_source_completion_context_add_proposals in gtksourceview2_la-gtksourceview2.o
:info:build       __wrap_GtkSourceCompletionProposal__proxy_do_equal in gtksourceview2_la-gtksourceview2.o
:info:build       __wrap_GtkSourceCompletionProvider__proxy_do_match in gtksourceview2_la-gtksourceview2.o
:info:build       __wrap_GtkSourceCompletionProvider__proxy_do_activate_proposal in gtksourceview2_la-gtksourceview2.o
:info:build       __wrap_GtkSourceUndoManager__proxy_do_can_undo in gtksourceview2_la-gtksourceview2.o
:info:build       __wrap_GtkSourceUndoManager__proxy_do_can_redo in gtksourceview2_la-gtksourceview2.o
:info:build       __wrap_GtkSourceGutter__proxy_do_query_tooltip in gtksourceview2_la-gtksourceview2.o
:info:build       ...
:info:build   "_PyObject_Repr", referenced from:
:info:build       _initgtksourceview2 in gtksourceview2_la-gtksourceview2module.o
:info:build   "_PySequence_Check", referenced from:
:info:build       _pylist_to_strv in gtksourceview2_la-gtksourceview2.o
:info:build       __wrap_gtk_source_completion_show in gtksourceview2_la-gtksourceview2.o
:info:build       __wrap_gtk_source_completion_context_add_proposals in gtksourceview2_la-gtksourceview2.o
:info:build   "_PySequence_GetItem", referenced from:
:info:build       _pylist_to_strv in gtksourceview2_la-gtksourceview2.o
:info:build       _pylist_to_glist_gobjs in gtksourceview2_la-gtksourceview2.o
:info:build   "_PySequence_Size", referenced from:
:info:build       _pylist_to_strv in gtksourceview2_la-gtksourceview2.o
:info:build       _pylist_to_glist_gobjs in gtksourceview2_la-gtksourceview2.o
:info:build   "_PyString_AsString", referenced from:
:info:build       _initgtksourceview2 in gtksourceview2_la-gtksourceview2module.o
:info:build       _pylist_to_strv in gtksourceview2_la-gtksourceview2.o
:info:build       _pygtksourceview_mark_tooltip_func_marshal in gtksourceview2_la-gtksourceview2.o
:info:build   "_PyString_FromString", referenced from:
:info:build       _strv_to_pylist in gtksourceview2_la-gtksourceview2.o
:info:build       __wrap_gtk_source_language_get_id in gtksourceview2_la-gtksourceview2.o
:info:build       __wrap_gtk_source_language_get_name in gtksourceview2_la-gtksourceview2.o
:info:build       __wrap_gtk_source_language_get_section in gtksourceview2_la-gtksourceview2.o
:info:build       __wrap_gtk_source_language_get_metadata in gtksourceview2_la-gtksourceview2.o
:info:build       __wrap_gtk_source_language_get_style_name in gtksourceview2_la-gtksourceview2.o
:info:build       __wrap_gtk_source_mark_get_category in gtksourceview2_la-gtksourceview2.o
:info:build       ...
:info:build   "_PyTuple_New", referenced from:
:info:build       __wrap_GtkSourceCompletionProposal__proxy_do_equal in gtksourceview2_la-gtksourceview2.o
:info:build       __wrap_GtkSourceCompletionProvider__proxy_do_populate in gtksourceview2_la-gtksourceview2.o
:info:build       __wrap_GtkSourceCompletionProvider__proxy_do_match in gtksourceview2_la-gtksourceview2.o
:info:build       __wrap_GtkSourceCompletionProvider__proxy_do_get_info_widget in gtksourceview2_la-gtksourceview2.o
:info:build       __wrap_GtkSourceCompletionProvider__proxy_do_update_info in gtksourceview2_la-gtksourceview2.o
:info:build       __wrap_GtkSourceCompletionProvider__proxy_do_get_start_iter in gtksourceview2_la-gtksourceview2.o
:info:build       __wrap_GtkSourceCompletionProvider__proxy_do_activate_proposal in gtksourceview2_la-gtksourceview2.o
:info:build       ...
:info:build   "_PyType_IsSubtype", referenced from:
:info:build       __wrap_gtk_source_iter_forward_search in gtksourceview2_la-gtksourceview2.o
:info:build       __wrap_gtk_source_iter_backward_search in gtksourceview2_la-gtksourceview2.o
:info:build       ___GtkSourceGutter_class_init in gtksourceview2_la-gtksourceview2.o
:info:build       ___GtkSourceView_class_init in gtksourceview2_la-gtksourceview2.o
:info:build       __wrap_gtk_source_buffer_set_language in gtksourceview2_la-gtksourceview2.o
:info:build       __wrap_gtk_source_buffer_ensure_highlight in gtksourceview2_la-gtksourceview2.o
:info:build       __wrap_gtk_source_buffer_create_source_mark in gtksourceview2_la-gtksourceview2.o
:info:build       ...
:info:build   "_Py_BuildValue", referenced from:
:info:build       _initgtksourceview2 in gtksourceview2_la-gtksourceview2module.o
:info:build       __wrap_gtk_source_iter_forward_search in gtksourceview2_la-gtksourceview2.o
:info:build       __wrap_gtk_source_iter_backward_search in gtksourceview2_la-gtksourceview2.o
:info:build       _pygtksourceview2_register_classes in gtksourceview2_la-gtksourceview2.o
:info:build       __wrap_GtkSourceCompletionProposal__proxy_do_get_label in gtksourceview2_la-gtksourceview2.o
:info:build       __wrap_GtkSourceCompletionProposal__proxy_do_get_markup in gtksourceview2_la-gtksourceview2.o
:info:build       __wrap_GtkSourceCompletionProposal__proxy_do_get_text in gtksourceview2_la-gtksourceview2.o
:info:build       ...
:info:build   "_Py_FatalError", referenced from:
:info:build       _initgtksourceview2 in gtksourceview2_la-gtksourceview2module.o
:info:build   "_Py_InitModule4_64", referenced from:
:info:build       _initgtksourceview2 in gtksourceview2_la-gtksourceview2module.o
:info:build   "__Py_NoneStruct", referenced from:
:info:build       __wrap_gtk_source_iter_forward_search in gtksourceview2_la-gtksourceview2.o
:info:build       __wrap_gtk_source_iter_backward_search in gtksourceview2_la-gtksourceview2.o
:info:build       __wrap_gtk_source_buffer_set_highlight_syntax in gtksourceview2_la-gtksourceview2.o
:info:build       __wrap_gtk_source_buffer_set_highlight_matching_brackets in gtksourceview2_la-gtksourceview2.o
:info:build       __wrap_gtk_source_buffer_set_max_undo_levels in gtksourceview2_la-gtksourceview2.o
:info:build       __wrap_gtk_source_buffer_set_language in gtksourceview2_la-gtksourceview2.o
:info:build       __wrap_gtk_source_buffer_undo in gtksourceview2_la-gtksourceview2.o
:info:build       ...
:info:build ld: symbol(s) not found for architecture x86_64
:info:build clang: error: linker command failed with exit code 1 (use -v to see invocation)
:info:build make[2]: *** [gtksourceview2.la] Error 1
:info:build make[2]: Leaving directory `/opt/local/var/macports/build/_opt_local_var_macports_sources_rsync.macports.org_macports_release_tarballs_ports_python_py27-pygtksourceview/py27-pygtksourceview/work/pygtksourceview-2.10.1'
:info:build make[1]: *** [all-recursive] Error 1
:info:build make[1]: Leaving directory `/opt/local/var/macports/build/_opt_local_var_macports_sources_rsync.macports.org_macports_release_tarballs_ports_python_py27-pygtksourceview/py27-pygtksourceview/work/pygtksourceview-2.10.1'
:info:build make: *** [all] Error 2
:info:build make: Leaving directory `/opt/local/var/macports/build/_opt_local_var_macports_sources_rsync.macports.org_macports_release_tarballs_ports_python_py27-pygtksourceview/py27-pygtksourceview/work/pygtksourceview-2.10.1'
:info:build Command failed:  cd "/opt/local/var/macports/build/_opt_local_var_macports_sources_rsync.macports.org_macports_release_tarballs_ports_python_py27-pygtksourceview/py27-pygtksourceview/work/pygtksourceview-2.10.1" && /usr/bin/make -j4 -w all 
:info:build Exit code: 2
:error:build Failed to build py27-pygtksourceview: command execution failed
:debug:build Error code: CHILDSTATUS 83317 2
:debug:build Backtrace: command execution failed
:debug:build     while executing
:debug:build "system {*}$notty {*}$nice $fullcmdstring"
:debug:build     invoked from within
:debug:build "command_exec build"
:debug:build     (procedure "portbuild::build_main" line 8)
:debug:build     invoked from within
:debug:build "$procedure $targetname"
:error:build See /opt/local/var/macports/logs/_opt_local_var_macports_sources_rsync.macports.org_macports_release_tarballs_ports_python_py27-pygtksourceview/py27-pygtksourceview/main.log for details.
version:1
:debug:sysinfo macOS 11.2 (darwin/20.3.0) arch i386
:debug:sysinfo MacPorts 2.6.4
:debug:sysinfo Xcode none
:debug:sysinfo SDK 11.2
:debug:sysinfo MACOSX_DEPLOYMENT_TARGET: 11.2
:debug:main dropping privileges: euid changed to 503, egid changed to 502.
:debug:main Executing org.macports.main (py27-pygtksourceview)
:debug:main Privilege de-escalation not attempted as not running as root.
:debug:archivefetch archivefetch phase started at Wed Mar 24 21:38:05 CET 2021
:msg:archivefetch --->  Fetching archive for py27-pygtksourceview
:debug:archivefetch Executing org.macports.archivefetch (py27-pygtksourceview)
:debug:archivefetch euid/egid changed to: 0/0
:debug:archivefetch chowned /opt/local/var/macports/incoming to macports
:debug:archivefetch euid/egid changed to: 503/502
:info:archivefetch --->  py27-pygtksourceview-2.10.1_4.darwin_20.x86_64.tbz2 doesn't seem to exist in /opt/local/var/macports/incoming/verified
:msg:archivefetch --->  Attempting to fetch py27-pygtksourceview-2.10.1_4.darwin_20.x86_64.tbz2 from https://packages.macports.org/py27-pygtksourceview
:debug:archivefetch Fetching archive failed: The requested URL returned error: 404 Not Found
:msg:archivefetch --->  Attempting to fetch py27-pygtksourceview-2.10.1_4.darwin_20.x86_64.tbz2 from https://lil.fr.packages.macports.org/py27-pygtksourceview
:debug:archivefetch Fetching archive failed: The requested URL returned error: 404 Not Found
:msg:archivefetch --->  Attempting to fetch py27-pygtksourceview-2.10.1_4.darwin_20.x86_64.tbz2 from http://fco.it.packages.macports.org/py27-pygtksourceview
:debug:archivefetch Fetching archive failed: The requested URL returned error: 404 Not Found
:debug:archivefetch Privilege de-escalation not attempted as not running as root.
:debug:archivefetch Skipping completed org.macports.fetch (py27-pygtksourceview)
:debug:archivefetch Privilege de-escalation not attempted as not running as root.
:debug:archivefetch Skipping completed org.macports.checksum (py27-pygtksourceview)
:debug:archivefetch Privilege de-escalation not attempted as not running as root.
:debug:archivefetch Skipping completed org.macports.extract (py27-pygtksourceview)
:debug:archivefetch Privilege de-escalation not attempted as not running as root.
:debug:archivefetch Skipping completed org.macports.patch (py27-pygtksourceview)
:debug:archivefetch Privilege de-escalation not attempted as not running as root.
:debug:archivefetch Skipping completed org.macports.configure (py27-pygtksourceview)
:debug:archivefetch Privilege de-escalation not attempted as not running as root.
:debug:build build phase started at Wed Mar 24 21:38:10 CET 2021
:notice:build --->  Building py27-pygtksourceview
:debug:build Executing org.macports.build (py27-pygtksourceview)
:debug:build Environment: 
:debug:build CC_PRINT_OPTIONS='YES'
:debug:build CC_PRINT_OPTIONS_FILE='/opt/local/var/macports/build/_opt_local_var_macports_sources_rsync.macports.org_macports_release_tarballs_ports_python_py27-pygtksourceview/py27-pygtksourceview/work/.CC_PRINT_OPTIONS'
:debug:build CPATH='/opt/local/include'
:debug:build DEVELOPER_DIR='/Library/Developer/CommandLineTools'
:debug:build LIBRARY_PATH='/opt/local/lib'
:debug:build MACOSX_DEPLOYMENT_TARGET='11.2'
:debug:build SDKROOT='/Library/Developer/CommandLineTools/SDKs/MacOSX.sdk'
:info:build Executing:  cd "/opt/local/var/macports/build/_opt_local_var_macports_sources_rsync.macports.org_macports_release_tarballs_ports_python_py27-pygtksourceview/py27-pygtksourceview/work/pygtksourceview-2.10.1" && /usr/bin/make -j4 -w all 
:debug:build system:  cd "/opt/local/var/macports/build/_opt_local_var_macports_sources_rsync.macports.org_macports_release_tarballs_ports_python_py27-pygtksourceview/py27-pygtksourceview/work/pygtksourceview-2.10.1" && /usr/bin/make -j4 -w all 
:info:build make: Entering directory `/opt/local/var/macports/build/_opt_local_var_macports_sources_rsync.macports.org_macports_release_tarballs_ports_python_py27-pygtksourceview/py27-pygtksourceview/work/pygtksourceview-2.10.1'
:info:build /Library/Developer/CommandLineTools/usr/bin/make  all-recursive
:info:build make[1]: Entering directory `/opt/local/var/macports/build/_opt_local_var_macports_sources_rsync.macports.org_macports_release_tarballs_ports_python_py27-pygtksourceview/py27-pygtksourceview/work/pygtksourceview-2.10.1'
:info:build Making all in test
:info:build make[2]: Entering directory `/opt/local/var/macports/build/_opt_local_var_macports_sources_rsync.macports.org_macports_release_tarballs_ports_python_py27-pygtksourceview/py27-pygtksourceview/work/pygtksourceview-2.10.1/test'
:info:build make[2]: Nothing to be done for `all'.
:info:build make[2]: Leaving directory `/opt/local/var/macports/build/_opt_local_var_macports_sources_rsync.macports.org_macports_release_tarballs_ports_python_py27-pygtksourceview/py27-pygtksourceview/work/pygtksourceview-2.10.1/test'
:info:build Making all in docs
:info:build make[2]: Entering directory `/opt/local/var/macports/build/_opt_local_var_macports_sources_rsync.macports.org_macports_release_tarballs_ports_python_py27-pygtksourceview/py27-pygtksourceview/work/pygtksourceview-2.10.1/docs'
:info:build /Library/Developer/CommandLineTools/usr/bin/make  all-am
:info:build make[3]: Entering directory `/opt/local/var/macports/build/_opt_local_var_macports_sources_rsync.macports.org_macports_release_tarballs_ports_python_py27-pygtksourceview/py27-pygtksourceview/work/pygtksourceview-2.10.1/docs'
:info:build make[3]: Nothing to be done for `all-am'.
:info:build make[3]: Leaving directory `/opt/local/var/macports/build/_opt_local_var_macports_sources_rsync.macports.org_macports_release_tarballs_ports_python_py27-pygtksourceview/py27-pygtksourceview/work/pygtksourceview-2.10.1/docs'
:info:build make[2]: Leaving directory `/opt/local/var/macports/build/_opt_local_var_macports_sources_rsync.macports.org_macports_release_tarballs_ports_python_py27-pygtksourceview/py27-pygtksourceview/work/pygtksourceview-2.10.1/docs'
:info:build make[2]: Entering directory `/opt/local/var/macports/build/_opt_local_var_macports_sources_rsync.macports.org_macports_release_tarballs_ports_python_py27-pygtksourceview/py27-pygtksourceview/work/pygtksourceview-2.10.1'
:info:build /bin/sh ./libtool --tag=CC   --mode=link /usr/bin/clang -D_REENTRANT -I/opt/local/Library/Frameworks/Python.framework/Versions/2.7/include/pygtk-2.0 -I/opt/local/include/gtksourceview-2.0 -I/opt/local/include/libxml2 -I/opt/local/include/gtk-2.0 -I/opt/local/lib/gtk-2.0/include -I/opt/local/include/pango-1.0 -I/opt/local/include/gio-unix-2.0/ -I/opt/local/include/cairo -I/opt/local/include/atk-1.0 -I/opt/local/include/cairo -I/opt/local/include/pixman-1 -I/opt/local/include/gdk-pixbuf-2.0 -I/opt/local/include/pango-1.0 -I/opt/local/include/harfbuzz -I/opt/local/include/pango-1.0 -I/opt/local/include/fribidi -I/opt/local/include/glib-2.0 -I/opt/local/lib/glib-2.0/include -I/opt/local/include/ossp -I/opt/local/include/freetype2 -I/opt/local/include/libpng16 -pipe -Os -isysroot/Library/Developer/CommandLineTools/SDKs/MacOSX.sdk -arch x86_64 -Wall -fno-strict-aliasing -module -avoid-version -export-symbols-regex initgtksourceview2   -L/opt/local/lib -Wl,-headerpad_max_install_names -Wl,-syslibroot,/Library/Developer/CommandLineTools/SDKs/MacOSX.sdk -arch x86_64 -o gtksourceview2.la -rpath /opt/local/Library/Frameworks/Python.framework/Versions/2.7/lib/python2.7/site-packages gtksourceview2_la-gtksourceview2module.lo gtksourceview2_la-gtksourceview2.lo -L/opt/local/lib -lgtksourceview-2.0 -lgtk-x11-2.0 -lgdk-x11-2.0 -lpangocairo-1.0 -lgio-2.0 -lXrender -lXinerama -lXi -lXrandr -lXcursor -lXcomposite -lXdamage -lXfixes -lX11 -lXext -latk-1.0 -lcairo -lgdk_pixbuf-2.0 -lgio-2.0 -lpangoft2-1.0 -lpango-1.0 -lgobject-2.0 -lglib-2.0 -lintl -Wl,-framework -Wl,CoreFoundation -lfontconfig -lfreetype  
:info:build libtool: link: rm -fr  .libs/gtksourceview2.exp
:info:build libtool: link: /usr/bin/nm -B  .libs/gtksourceview2_la-gtksourceview2module.o .libs/gtksourceview2_la-gtksourceview2.o   | sed -n -e 's/^.*[	 ]\([BCDEGRST][BCDEGRST]*\)[	 ][	 ]*_\([_A-Za-z][_A-Za-z0-9]*\)$/\1 _\2 \2/p' | /opt/local/bin/gsed 's/.* //' | sort | uniq > .libs/gtksourceview2.exp
:info:build libtool: link: /usr/bin/grep -E -e "initgtksourceview2" ".libs/gtksourceview2.exp" > ".libs/gtksourceview2.expT"
:info:build libtool: link: mv -f ".libs/gtksourceview2.expT" ".libs/gtksourceview2.exp"
:info:build libtool: link: sed -e 's,^,_,' < .libs/gtksourceview2.exp > .libs/gtksourceview2-symbols.expsym
:info:build libtool: link: /usr/bin/clang  -o .libs/gtksourceview2.so -bundle  .libs/gtksourceview2_la-gtksourceview2module.o .libs/gtksourceview2_la-gtksourceview2.o   -L/opt/local/lib -lgtksourceview-2.0 -lgtk-x11-2.0 -lgdk-x11-2.0 -lpangocairo-1.0 -lXrender -lXinerama -lXi -lXrandr -lXcursor -lXcomposite -lXdamage -lXfixes -lX11 -lXext -latk-1.0 -lcairo -lgdk_pixbuf-2.0 -lgio-2.0 -lpangoft2-1.0 -lpango-1.0 -lgobject-2.0 -lglib-2.0 -lintl -lfontconfig -lfreetype  -arch x86_64 -Wl,-headerpad_max_install_names -Wl,-syslibroot -Wl,/Library/Developer/CommandLineTools/SDKs/MacOSX.sdk -arch x86_64 -Wl,-framework -Wl,CoreFoundation   -Wl,-exported_symbols_list,.libs/gtksourceview2-symbols.expsym
:info:build Undefined symbols for architecture x86_64:
:info:build   "_PyArg_ParseTuple", referenced from:
:info:build       __wrap_gtk_source_gutter_set_cell_data_func in gtksourceview2_la-gtksourceview2.o
:info:build       __wrap_gtk_source_gutter_set_cell_size_func in gtksourceview2_la-gtksourceview2.o
:info:build       __wrap_gtk_source_view_set_mark_category_tooltip_func in gtksourceview2_la-gtksourceview2.o
:info:build       __wrap_gtk_source_view_set_mark_category_tooltip_markup_func in gtksourceview2_la-gtksourceview2.o
:info:build       __wrap_GtkSourceCompletionProposal__proxy_do_get_label in gtksourceview2_la-gtksourceview2.o
:info:build       __wrap_GtkSourceCompletionProposal__proxy_do_get_markup in gtksourceview2_la-gtksourceview2.o
:info:build       __wrap_GtkSourceCompletionProposal__proxy_do_get_text in gtksourceview2_la-gtksourceview2.o
:info:build       ...
:info:build   "_PyArg_ParseTupleAndKeywords", referenced from:
:info:build       __wrap_gtk_source_buffer_new in gtksourceview2_la-gtksourceview2.o
:info:build       __wrap_gtk_source_language_manager_new in gtksourceview2_la-gtksourceview2.o
:info:build       __wrap_gtk_source_mark_new in gtksourceview2_la-gtksourceview2.o
:info:build       __wrap_gtk_source_print_compositor_new in gtksourceview2_la-gtksourceview2.o
:info:build       __wrap_gtk_source_style_new in gtksourceview2_la-gtksourceview2.o
:info:build       __wrap_gtk_source_style_scheme_manager_new in gtksourceview2_la-gtksourceview2.o
:info:build       __wrap_gtk_source_view_new in gtksourceview2_la-gtksourceview2.o
:info:build       ...
:info:build   "_PyBool_FromLong", referenced from:
:info:build       __wrap_gtk_source_buffer_get_highlight_syntax in gtksourceview2_la-gtksourceview2.o
:info:build       __wrap_gtk_source_buffer_get_highlight_matching_brackets in gtksourceview2_la-gtksourceview2.o
:info:build       __wrap_gtk_source_buffer_can_undo in gtksourceview2_la-gtksourceview2.o
:info:build       __wrap_gtk_source_buffer_can_redo in gtksourceview2_la-gtksourceview2.o
:info:build       __wrap_gtk_source_buffer_forward_iter_to_source_mark in gtksourceview2_la-gtksourceview2.o
:info:build       __wrap_gtk_source_buffer_backward_iter_to_source_mark in gtksourceview2_la-gtksourceview2.o
:info:build       __wrap_gtk_source_buffer_iter_has_context_class in gtksourceview2_la-gtksourceview2.o
:info:build       ...
:info:build   "_PyCFunction_Type", referenced from:
:info:build       ___GtkSourceGutter_class_init in gtksourceview2_la-gtksourceview2.o
:info:build       ___GtkSourceView_class_init in gtksourceview2_la-gtksourceview2.o
:info:build       ___GtkSourceCompletionProposal__interface_init in gtksourceview2_la-gtksourceview2.o
:info:build       ___GtkSourceCompletionProvider__interface_init in gtksourceview2_la-gtksourceview2.o
:info:build       ___GtkSourceUndoManager__interface_init in gtksourceview2_la-gtksourceview2.o
:info:build   "_PyCObject_AsVoidPtr", referenced from:
:info:build       _initgtksourceview2 in gtksourceview2_la-gtksourceview2module.o
:info:build   "_PyCObject_Type", referenced from:
:info:build       _initgtksourceview2 in gtksourceview2_la-gtksourceview2module.o
:info:build   "_PyDict_GetItemString", referenced from:
:info:build       _initgtksourceview2 in gtksourceview2_la-gtksourceview2module.o
:info:build       ___GtkSourceGutter_class_init in gtksourceview2_la-gtksourceview2.o
:info:build       ___GtkSourceView_class_init in gtksourceview2_la-gtksourceview2.o
:info:build   "_PyErr_Clear", referenced from:
:info:build       ___GtkSourceGutter_class_init in gtksourceview2_la-gtksourceview2.o
:info:build       ___GtkSourceView_class_init in gtksourceview2_la-gtksourceview2.o
:info:build       ___GtkSourceCompletionProposal__interface_init in gtksourceview2_la-gtksourceview2.o
:info:build       ___GtkSourceCompletionProvider__interface_init in gtksourceview2_la-gtksourceview2.o
:info:build       ___GtkSourceUndoManager__interface_init in gtksourceview2_la-gtksourceview2.o
:info:build   "_PyErr_Fetch", referenced from:
:info:build       _initgtksourceview2 in gtksourceview2_la-gtksourceview2module.o
:info:build   "_PyErr_Format", referenced from:
:info:build       _initgtksourceview2 in gtksourceview2_la-gtksourceview2module.o
:info:build       _pylist_to_strv in gtksourceview2_la-gtksourceview2.o
:info:build   "_PyErr_Occurred", referenced from:
:info:build       _initgtksourceview2 in gtksourceview2_la-gtksourceview2module.o
:info:build       _pygtksourceview2_add_constants in gtksourceview2_la-gtksourceview2.o
:info:build       __wrap_gtk_source_print_compositor_set_tab_width in gtksourceview2_la-gtksourceview2.o
:info:build       __wrap_gtk_source_print_compositor_set_print_line_numbers in gtksourceview2_la-gtksourceview2.o
:info:build       __wrap_gtk_source_view_set_tab_width in gtksourceview2_la-gtksourceview2.o
:info:build       __wrap_gtk_source_view_set_right_margin_position in gtksourceview2_la-gtksourceview2.o
:info:build       __wrap_GtkSourceCompletionProposal__proxy_do_get_label in gtksourceview2_la-gtksourceview2.o
:info:build       ...
:info:build   "_PyErr_Print", referenced from:
:info:build       _pygtksourceview2_add_constants in gtksourceview2_la-gtksourceview2.o
:info:build       _pygtksourceview_cell_data_func_marshal in gtksourceview2_la-gtksourceview2.o
:info:build       _pygtksourceview_cell_size_func_marshal in gtksourceview2_la-gtksourceview2.o
:info:build       _pygtksourceview_mark_tooltip_func_marshal in gtksourceview2_la-gtksourceview2.o
:info:build       __wrap_GtkSourceCompletionProposal__proxy_do_get_label in gtksourceview2_la-gtksourceview2.o
:info:build       __wrap_GtkSourceCompletionProposal__proxy_do_get_markup in gtksourceview2_la-gtksourceview2.o
:info:build       __wrap_GtkSourceCompletionProposal__proxy_do_get_text in gtksourceview2_la-gtksourceview2.o
:info:build       ...
:info:build   "_PyErr_SetString", referenced from:
:info:build       _initgtksourceview2 in gtksourceview2_la-gtksourceview2module.o
:info:build       __wrap_gtk_source_buffer_new in gtksourceview2_la-gtksourceview2.o
:info:build       __wrap_gtk_source_language_tp_new in gtksourceview2_la-gtksourceview2.o
:info:build       __wrap_gtk_source_language_manager_new in gtksourceview2_la-gtksourceview2.o
:info:build       __wrap_gtk_source_mark_new in gtksourceview2_la-gtksourceview2.o
:info:build       __wrap_gtk_source_print_compositor_new in gtksourceview2_la-gtksourceview2.o
:info:build       __wrap_gtk_source_style_new in gtksourceview2_la-gtksourceview2.o
:info:build       ...
:info:build   "_PyEval_CallFunction", referenced from:
:info:build       _pygtksourceview_cell_data_func_marshal in gtksourceview2_la-gtksourceview2.o
:info:build       _pygtksourceview_cell_size_func_marshal in gtksourceview2_la-gtksourceview2.o
:info:build       _pygtksourceview_mark_tooltip_func_marshal in gtksourceview2_la-gtksourceview2.o
:info:build   "_PyExc_ImportError", referenced from:
:info:build       _initgtksourceview2 in gtksourceview2_la-gtksourceview2module.o
:info:build       _pygtksourceview2_register_classes in gtksourceview2_la-gtksourceview2.o
:info:build   "_PyExc_NotImplementedError", referenced from:
:info:build       __wrap_GtkSourceGutter__do_cell_activated in gtksourceview2_la-gtksourceview2.o
:info:build       __wrap_GtkSourceGutter__do_query_tooltip in gtksourceview2_la-gtksourceview2.o
:info:build       __wrap_GtkSourceView__do_undo in gtksourceview2_la-gtksourceview2.o
:info:build       __wrap_GtkSourceView__do_redo in gtksourceview2_la-gtksourceview2.o
:info:build       __wrap_GtkSourceView__do_line_mark_activated in gtksourceview2_la-gtksourceview2.o
:info:build       __wrap_GtkSourceCompletionProposal__do_get_label in gtksourceview2_la-gtksourceview2.o
:info:build       __wrap_GtkSourceCompletionProposal__do_get_markup in gtksourceview2_la-gtksourceview2.o
:info:build       ...
:info:build   "_PyExc_RuntimeError", referenced from:
:info:build       _initgtksourceview2 in gtksourceview2_la-gtksourceview2module.o
:info:build       __wrap_gtk_source_buffer_new in gtksourceview2_la-gtksourceview2.o
:info:build       __wrap_gtk_source_language_manager_new in gtksourceview2_la-gtksourceview2.o
:info:build       __wrap_gtk_source_mark_new in gtksourceview2_la-gtksourceview2.o
:info:build       __wrap_gtk_source_print_compositor_new in gtksourceview2_la-gtksourceview2.o
:info:build       __wrap_gtk_source_style_new in gtksourceview2_la-gtksourceview2.o
:info:build       __wrap_gtk_source_style_scheme_manager_new in gtksourceview2_la-gtksourceview2.o
:info:build       ...
:info:build   "_PyExc_TypeError", referenced from:
:info:build       __wrap_gtk_source_language_tp_new in gtksourceview2_la-gtksourceview2.o
:info:build       __wrap_gtk_source_style_scheme_tp_new in gtksourceview2_la-gtksourceview2.o
:info:build       __wrap_gtk_source_iter_forward_search in gtksourceview2_la-gtksourceview2.o
:info:build       __wrap_gtk_source_iter_backward_search in gtksourceview2_la-gtksourceview2.o
:info:build       __wrap_gtk_source_buffer_set_language in gtksourceview2_la-gtksourceview2.o
:info:build       __wrap_gtk_source_buffer_ensure_highlight in gtksourceview2_la-gtksourceview2.o
:info:build       __wrap_gtk_source_buffer_create_source_mark in gtksourceview2_la-gtksourceview2.o
:info:build       ...
:info:build   "_PyFloat_FromDouble", referenced from:
:info:build       __wrap_gtk_source_print_compositor_get_top_margin in gtksourceview2_la-gtksourceview2.o
:info:build       __wrap_gtk_source_print_compositor_get_bottom_margin in gtksourceview2_la-gtksourceview2.o
:info:build       __wrap_gtk_source_print_compositor_get_left_margin in gtksourceview2_la-gtksourceview2.o
:info:build       __wrap_gtk_source_print_compositor_get_right_margin in gtksourceview2_la-gtksourceview2.o
:info:build       __wrap_gtk_source_print_compositor_get_pagination_progress in gtksourceview2_la-gtksourceview2.o
:info:build   "_PyImport_ImportModule", referenced from:
:info:build       _initgtksourceview2 in gtksourceview2_la-gtksourceview2module.o
:info:build       _pygtksourceview2_register_classes in gtksourceview2_la-gtksourceview2.o
:info:build   "_PyInt_AsLong", referenced from:
:info:build       __wrap_gtk_source_print_compositor_set_tab_width in gtksourceview2_la-gtksourceview2.o
:info:build       __wrap_gtk_source_print_compositor_set_print_line_numbers in gtksourceview2_la-gtksourceview2.o
:info:build       __wrap_gtk_source_view_set_tab_width in gtksourceview2_la-gtksourceview2.o
:info:build       __wrap_gtk_source_view_set_right_margin_position in gtksourceview2_la-gtksourceview2.o
:info:build   "_PyInt_FromLong", referenced from:
:info:build       __wrap_gtk_source_buffer_get_max_undo_levels in gtksourceview2_la-gtksourceview2.o
:info:build       __wrap_gtk_source_print_compositor_get_n_pages in gtksourceview2_la-gtksourceview2.o
:info:build       __wrap_gtk_source_view_get_indent_width in gtksourceview2_la-gtksourceview2.o
:info:build       __wrap_gtk_source_view_get_mark_category_priority in gtksourceview2_la-gtksourceview2.o
:info:build   "_PyList_Append", referenced from:
:info:build       _gslist_to_pylist_objs in gtksourceview2_la-gtksourceview2.o
:info:build       __wrap_gtk_source_completion_get_providers in gtksourceview2_la-gtksourceview2.o
:info:build   "_PyList_New", referenced from:
:info:build       _gslist_to_pylist_objs in gtksourceview2_la-gtksourceview2.o
:info:build       _strv_to_pylist in gtksourceview2_la-gtksourceview2.o
:info:build       __wrap_gtk_source_completion_get_providers in gtksourceview2_la-gtksourceview2.o
:info:build   "_PyList_SetItem", referenced from:
:info:build       _strv_to_pylist in gtksourceview2_la-gtksourceview2.o
:info:build   "_PyLong_AsUnsignedLong", referenced from:
:info:build       __wrap_gtk_source_print_compositor_set_tab_width in gtksourceview2_la-gtksourceview2.o
:info:build       __wrap_gtk_source_print_compositor_set_print_line_numbers in gtksourceview2_la-gtksourceview2.o
:info:build       __wrap_gtk_source_view_set_tab_width in gtksourceview2_la-gtksourceview2.o
:info:build       __wrap_gtk_source_view_set_right_margin_position in gtksourceview2_la-gtksourceview2.o
:info:build   "_PyLong_FromUnsignedLong", referenced from:
:info:build       __wrap_gtk_source_print_compositor_get_tab_width in gtksourceview2_la-gtksourceview2.o
:info:build       __wrap_gtk_source_print_compositor_get_print_line_numbers in gtksourceview2_la-gtksourceview2.o
:info:build       __wrap_gtk_source_view_get_tab_width in gtksourceview2_la-gtksourceview2.o
:info:build       __wrap_gtk_source_view_get_right_margin_position in gtksourceview2_la-gtksourceview2.o
:info:build       __wrap_gtk_source_completion_proposal_hash in gtksourceview2_la-gtksourceview2.o
:info:build       __wrap_GtkSourceCompletionProposal__do_hash in gtksourceview2_la-gtksourceview2.o
:info:build   "_PyModule_AddObject", referenced from:
:info:build       _initgtksourceview2 in gtksourceview2_la-gtksourceview2module.o
:info:build   "_PyModule_AddStringConstant", referenced from:
:info:build       _pygtksourceview2_add_constants in gtksourceview2_la-gtksourceview2.o
:info:build   "_PyModule_GetDict", referenced from:
:info:build       _initgtksourceview2 in gtksourceview2_la-gtksourceview2module.o
:info:build   "_PyObject_CallObject", referenced from:
:info:build       __wrap_GtkSourceCompletionProposal__proxy_do_get_label in gtksourceview2_la-gtksourceview2.o
:info:build       __wrap_GtkSourceCompletionProposal__proxy_do_get_markup in gtksourceview2_la-gtksourceview2.o
:info:build       __wrap_GtkSourceCompletionProposal__proxy_do_get_text in gtksourceview2_la-gtksourceview2.o
:info:build       __wrap_GtkSourceCompletionProposal__proxy_do_get_icon in gtksourceview2_la-gtksourceview2.o
:info:build       __wrap_GtkSourceCompletionProposal__proxy_do_get_info in gtksourceview2_la-gtksourceview2.o
:info:build       __wrap_GtkSourceCompletionProposal__proxy_do_changed in gtksourceview2_la-gtksourceview2.o
:info:build       __wrap_GtkSourceCompletionProposal__proxy_do_hash in gtksourceview2_la-gtksourceview2.o
:info:build       ...
:info:build   "_PyObject_GetAttrString", referenced from:
:info:build       _initgtksourceview2 in gtksourceview2_la-gtksourceview2module.o
:info:build       _pygtksourceview2_register_classes in gtksourceview2_la-gtksourceview2.o
:info:build       ___GtkSourceGutter_class_init in gtksourceview2_la-gtksourceview2.o
:info:build       ___GtkSourceView_class_init in gtksourceview2_la-gtksourceview2.o
:info:build       ___GtkSourceCompletionProposal__interface_init in gtksourceview2_la-gtksourceview2.o
:info:build       __wrap_GtkSourceCompletionProposal__proxy_do_get_label in gtksourceview2_la-gtksourceview2.o
:info:build       __wrap_GtkSourceCompletionProposal__proxy_do_get_markup in gtksourceview2_la-gtksourceview2.o
:info:build       ...
:info:build   "_PyObject_IsTrue", referenced from:
:info:build       __wrap_gtk_source_completion_context_add_proposals in gtksourceview2_la-gtksourceview2.o
:info:build       __wrap_GtkSourceCompletionProposal__proxy_do_equal in gtksourceview2_la-gtksourceview2.o
:info:build       __wrap_GtkSourceCompletionProvider__proxy_do_match in gtksourceview2_la-gtksourceview2.o
:info:build       __wrap_GtkSourceCompletionProvider__proxy_do_activate_proposal in gtksourceview2_la-gtksourceview2.o
:info:build       __wrap_GtkSourceUndoManager__proxy_do_can_undo in gtksourceview2_la-gtksourceview2.o
:info:build       __wrap_GtkSourceUndoManager__proxy_do_can_redo in gtksourceview2_la-gtksourceview2.o
:info:build       __wrap_GtkSourceGutter__proxy_do_query_tooltip in gtksourceview2_la-gtksourceview2.o
:info:build       ...
:info:build   "_PyObject_Repr", referenced from:
:info:build       _initgtksourceview2 in gtksourceview2_la-gtksourceview2module.o
:info:build   "_PySequence_Check", referenced from:
:info:build       _pylist_to_strv in gtksourceview2_la-gtksourceview2.o
:info:build       __wrap_gtk_source_completion_show in gtksourceview2_la-gtksourceview2.o
:info:build       __wrap_gtk_source_completion_context_add_proposals in gtksourceview2_la-gtksourceview2.o
:info:build   "_PySequence_GetItem", referenced from:
:info:build       _pylist_to_strv in gtksourceview2_la-gtksourceview2.o
:info:build       _pylist_to_glist_gobjs in gtksourceview2_la-gtksourceview2.o
:info:build   "_PySequence_Size", referenced from:
:info:build       _pylist_to_strv in gtksourceview2_la-gtksourceview2.o
:info:build       _pylist_to_glist_gobjs in gtksourceview2_la-gtksourceview2.o
:info:build   "_PyString_AsString", referenced from:
:info:build       _initgtksourceview2 in gtksourceview2_la-gtksourceview2module.o
:info:build       _pylist_to_strv in gtksourceview2_la-gtksourceview2.o
:info:build       _pygtksourceview_mark_tooltip_func_marshal in gtksourceview2_la-gtksourceview2.o
:info:build   "_PyString_FromString", referenced from:
:info:build       _strv_to_pylist in gtksourceview2_la-gtksourceview2.o
:info:build       __wrap_gtk_source_language_get_id in gtksourceview2_la-gtksourceview2.o
:info:build       __wrap_gtk_source_language_get_name in gtksourceview2_la-gtksourceview2.o
:info:build       __wrap_gtk_source_language_get_section in gtksourceview2_la-gtksourceview2.o
:info:build       __wrap_gtk_source_language_get_metadata in gtksourceview2_la-gtksourceview2.o
:info:build       __wrap_gtk_source_language_get_style_name in gtksourceview2_la-gtksourceview2.o
:info:build       __wrap_gtk_source_mark_get_category in gtksourceview2_la-gtksourceview2.o
:info:build       ...
:info:build   "_PyTuple_New", referenced from:
:info:build       __wrap_GtkSourceCompletionProposal__proxy_do_equal in gtksourceview2_la-gtksourceview2.o
:info:build       __wrap_GtkSourceCompletionProvider__proxy_do_populate in gtksourceview2_la-gtksourceview2.o
:info:build       __wrap_GtkSourceCompletionProvider__proxy_do_match in gtksourceview2_la-gtksourceview2.o
:info:build       __wrap_GtkSourceCompletionProvider__proxy_do_get_info_widget in gtksourceview2_la-gtksourceview2.o
:info:build       __wrap_GtkSourceCompletionProvider__proxy_do_update_info in gtksourceview2_la-gtksourceview2.o
:info:build       __wrap_GtkSourceCompletionProvider__proxy_do_get_start_iter in gtksourceview2_la-gtksourceview2.o
:info:build       __wrap_GtkSourceCompletionProvider__proxy_do_activate_proposal in gtksourceview2_la-gtksourceview2.o
:info:build       ...
:info:build   "_PyType_IsSubtype", referenced from:
:info:build       __wrap_gtk_source_iter_forward_search in gtksourceview2_la-gtksourceview2.o
:info:build       __wrap_gtk_source_iter_backward_search in gtksourceview2_la-gtksourceview2.o
:info:build       ___GtkSourceGutter_class_init in gtksourceview2_la-gtksourceview2.o
:info:build       ___GtkSourceView_class_init in gtksourceview2_la-gtksourceview2.o
:info:build       __wrap_gtk_source_buffer_set_language in gtksourceview2_la-gtksourceview2.o
:info:build       __wrap_gtk_source_buffer_ensure_highlight in gtksourceview2_la-gtksourceview2.o
:info:build       __wrap_gtk_source_buffer_create_source_mark in gtksourceview2_la-gtksourceview2.o
:info:build       ...
:info:build   "_Py_BuildValue", referenced from:
:info:build       _initgtksourceview2 in gtksourceview2_la-gtksourceview2module.o
:info:build       __wrap_gtk_source_iter_forward_search in gtksourceview2_la-gtksourceview2.o
:info:build       __wrap_gtk_source_iter_backward_search in gtksourceview2_la-gtksourceview2.o
:info:build       _pygtksourceview2_register_classes in gtksourceview2_la-gtksourceview2.o
:info:build       __wrap_GtkSourceCompletionProposal__proxy_do_get_label in gtksourceview2_la-gtksourceview2.o
:info:build       __wrap_GtkSourceCompletionProposal__proxy_do_get_markup in gtksourceview2_la-gtksourceview2.o
:info:build       __wrap_GtkSourceCompletionProposal__proxy_do_get_text in gtksourceview2_la-gtksourceview2.o
:info:build       ...
:info:build   "_Py_FatalError", referenced from:
:info:build       _initgtksourceview2 in gtksourceview2_la-gtksourceview2module.o
:info:build   "_Py_InitModule4_64", referenced from:
:info:build       _initgtksourceview2 in gtksourceview2_la-gtksourceview2module.o
:info:build   "__Py_NoneStruct", referenced from:
:info:build       __wrap_gtk_source_iter_forward_search in gtksourceview2_la-gtksourceview2.o
:info:build       __wrap_gtk_source_iter_backward_search in gtksourceview2_la-gtksourceview2.o
:info:build       __wrap_gtk_source_buffer_set_highlight_syntax in gtksourceview2_la-gtksourceview2.o
:info:build       __wrap_gtk_source_buffer_set_highlight_matching_brackets in gtksourceview2_la-gtksourceview2.o
:info:build       __wrap_gtk_source_buffer_set_max_undo_levels in gtksourceview2_la-gtksourceview2.o
:info:build       __wrap_gtk_source_buffer_set_language in gtksourceview2_la-gtksourceview2.o
:info:build       __wrap_gtk_source_buffer_undo in gtksourceview2_la-gtksourceview2.o
:info:build       ...
:info:build ld: symbol(s) not found for architecture x86_64
:info:build clang: error: linker command failed with exit code 1 (use -v to see invocation)
:info:build make[2]: *** [gtksourceview2.la] Error 1
:info:build make[2]: Leaving directory `/opt/local/var/macports/build/_opt_local_var_macports_sources_rsync.macports.org_macports_release_tarballs_ports_python_py27-pygtksourceview/py27-pygtksourceview/work/pygtksourceview-2.10.1'
:info:build make[1]: *** [all-recursive] Error 1
:info:build make[1]: Leaving directory `/opt/local/var/macports/build/_opt_local_var_macports_sources_rsync.macports.org_macports_release_tarballs_ports_python_py27-pygtksourceview/py27-pygtksourceview/work/pygtksourceview-2.10.1'
:info:build make: *** [all] Error 2
:info:build make: Leaving directory `/opt/local/var/macports/build/_opt_local_var_macports_sources_rsync.macports.org_macports_release_tarballs_ports_python_py27-pygtksourceview/py27-pygtksourceview/work/pygtksourceview-2.10.1'
:info:build Command failed:  cd "/opt/local/var/macports/build/_opt_local_var_macports_sources_rsync.macports.org_macports_release_tarballs_ports_python_py27-pygtksourceview/py27-pygtksourceview/work/pygtksourceview-2.10.1" && /usr/bin/make -j4 -w all 
:info:build Exit code: 2
:error:build Failed to build py27-pygtksourceview: command execution failed
:debug:build Error code: CHILDSTATUS 83419 2
:debug:build Backtrace: command execution failed
:debug:build     while executing
:debug:build "system {*}$notty {*}$nice $fullcmdstring"
:debug:build     invoked from within
:debug:build "command_exec build"
:debug:build     (procedure "portbuild::build_main" line 8)
:debug:build     invoked from within
:debug:build "$procedure $targetname"
:error:build See /opt/local/var/macports/logs/_opt_local_var_macports_sources_rsync.macports.org_macports_release_tarballs_ports_python_py27-pygtksourceview/py27-pygtksourceview/main.log for details.

Change History (4)

comment:1 Changed 3 weeks ago by jmroot (Joshua Root)

Cc: kencu added

Please note that we prefer to see the whole log, as the relevant information is not always obvious. This may need the libtool.m4 fix recognising macOS versions greater than 10.x?

comment:2 Changed 3 weeks ago by gagarine (Simon)

Description: modified (diff)

I updated the ticket with the full log

comment:3 Changed 3 weeks ago by gagarine (Simon)

Regarding cherrytree, pygtksourceview is not required anymore for later version of cherrytree (they moved from python to C++ apparently).

I try to compile it on my machine but cherrytree requiere glibmm >= 2.64 and macport provide only up to 2.58.1

I believe cherrytree will benefit from an update. The one in the tree is 0.39.4 and is still the python based one. Asking if an port could be updated is also done trough this trac?

Last edited 3 weeks ago by gagarine (Simon) (previous) (diff)

comment:4 Changed 3 weeks ago by kencu (Ken)

MacPorts is a bit behind on some required subsystems like glib2, so we can't build the c++ version yet.

Once the required supporting ports are reasonably up to date, I (or someone) will add the c++ version of CherryTree to MacPorts.

It's a simple cmake build, and I have built it locally without any troubles.

Note: See TracTickets for help on using tickets.