Opened 2 months ago

Last modified 2 months ago

#66357 assigned defect

py39-tensorflow failed - macos Ventura 13.0.1

Reported by: majaabal Owned by: emcrisostomo (Enrico Maria Crisostomo)
Priority: Normal Milestone:
Component: ports Version:
Keywords: ventura Cc: cjones051073 (Chris Jones)
Port: py-tensorflow

Description (last modified by ryandesign (Ryan Schmidt))

Hi there,

command:

sudo port install py39-tensorflow

Error logs -

:msg:archivefetch --->  Attempting to fetch py39-tensorflow-2.6.0_0.darwin_22.x86_64.tbz2 from https://packages.macports.org/py39-tensorflow
:debug:archivefetch Fetching archive failed: The requested URL returned error: 404
:msg:archivefetch --->  Attempting to fetch py39-tensorflow-2.6.0_0.darwin_22.x86_64.tbz2 from https://kmq.jp.packages.macports.org/py39-tensorflow
:debug:archivefetch Fetching archive failed: The requested URL returned error: 404
:msg:archivefetch --->  Attempting to fetch py39-tensorflow-2.6.0_0.darwin_22.x86_64.tbz2 from https://mse.uk.packages.macports.org/py39-tensorflow
:debug:archivefetch Fetching archive failed: The requested URL returned error: 404
:info:build ERROR: /opt/local/var/macports/build/_opt_local_var_macports_sources_rsync.macports.org_macports_release_tarballs_ports_python_py-tensorflow/py39-tensorflow/work/bazel_build/e9e69db706faba1d7be5d215555390d9/external/com_google_protobuf/BUILD:301:11: C++ compilation of rule '@com_google_protobuf//:protoc_lib' failed (Exit 71): wrapped_clang failed: error executing command 
:info:build xcrun: error: can't exec '/opt/local/var/macports/build/_opt_local_var_macports_sources_rsync.macports.org_macports_release_tarballs_ports_devel_bazel/bazel-3.7/work/bazelwrap/cc' (errno=No such file or directory)
:info:build ERROR: /opt/local/var/macports/build/_opt_local_var_macports_sources_rsync.macports.org_macports_release_tarballs_ports_python_py-tensorflow/py39-tensorflow/work/tensorflow-tensorflow-919f693/tensorflow/python/tools/BUILD:142:10 C++ compilation of rule '@com_google_protobuf//:protoc_lib' failed (Exit 71): wrapped_clang failed: error executing command 
:error:build Failed to build py39-tensorflow: command execution failed
:debug:build Error code: CHILDSTATUS 29944 1
:error:build See /opt/local/var/macports/logs/_opt_local_var_macports_sources_rsync.macports.org_macports_release_tarballs_ports_python_py-tensorflow/py39-tensorflow/main.log for details.

Thanks!

Attachments (1)

main.log (242.5 KB) - added by majaabal 2 months ago.
file location - /opt/local/var/macports/logs/_opt_local_var_macports_sources_rsync.macports.org_macports_release_tarballs_ports_python_py-tensorflow/py39-tensorflow/main.log

Download all attachments as: .zip

Change History (3)

Changed 2 months ago by majaabal

Attachment: main.log added

file location - /opt/local/var/macports/logs/_opt_local_var_macports_sources_rsync.macports.org_macports_release_tarballs_ports_python_py-tensorflow/py39-tensorflow/main.log

comment:1 Changed 2 months ago by jmroot (Joshua Root)

Cc: cjones051073 added
Owner: set to emcrisostomo
Port: py-tensorflow added
Status: newassigned

comment:2 Changed 2 months ago by ryandesign (Ryan Schmidt)

Description: modified (diff)
Keywords: ventura added
Note: See TracTickets for help on using tickets.