Opened 21 months ago
#71735 new defect
texlive-bin @2024.70613_1 does not build on PPC Leopard, Mac OS X 10.5.8, because of incompatible pointer types
| Reported by: | ballapete (Peter "Pete" Dyballa) | Owned by: | |
|---|---|---|---|
| Priority: | Normal | Milestone: | |
| Component: | ports | Version: | 2.10.5 |
| Keywords: | leopard ppc | Cc: | dports@… |
| Port: | texlive-bin |
Description
/opt/local/bin/gcc-mp-14 -DHAVE_CONFIG_H -I. -I/opt/local/var/macports/build/nue.de.rsync.macports.org_macports_release_tarballs_ports_tex_texlive-bin/texlive-bin/work/texlive-source-2024.70613-stripped/texk/web2c -I./w2c -I/opt/local/var/macports/build/nue.de.rsync.macports.org_macports_release_tarballs_ports_tex_texlive-bin/texlive-bin/work/build/texk -I/opt/local/var/macports/build/nue.de.rsync.macports.org_macports_release_tarballs_ports_tex_texlive-bin/texlive-bin/work/texlive-source-2024.70613-stripped/texk -I/opt/local/include/libpng16 -DPDF_PARSER_ONLY -I/opt/local/var/macports/build/nue.de.rsync.macports.org_macports_release_tarballs_ports_tex_texlive-bin/texlive-bin/work/build/libs/xpdf -I/opt/local/var/macports/build/nue.de.rsync.macports.org_macports_release_tarballs_ports_tex_texlive-bin/texlive-bin/work/build/libs/xpdf/goo -I/opt/local/var/macports/build/nue.de.rsync.macports.org_macports_release_tarballs_ports_tex_texlive-bin/texlive-bin/work/build/libs/xpdf/xpdf -I/opt/local/var/macports/build/nue.de.rsync.macports.org_macports_release_tarballs_ports_tex_texlive-bin/texlive-bin/work/texlive-source-2024.70613-stripped/texk/web2c/libmd5 -I/opt/local/var/macports/build/nue.de.rsync.macports.org_macports_release_tarballs_ports_tex_texlive-bin/texlive-bin/work/texlive-source-2024.70613-stripped/texk/web2c/pdftexdir -I/opt/local/var/macports/build/nue.de.rsync.macports.org_macports_release_tarballs_ports_tex_texlive-bin/texlive-bin/work/texlive-source-2024.70613-stripped/texk/web2c/synctexdir -D__SyncTeX__ -DSYNCTEX_ENGINE_H=\"synctex-pdftex.h\" -isystem/opt/local/include -Wimplicit -Wreturn-type -pipe -Os -arch ppc -MT pdftex-pdftexini.o -MD -MP -MF .deps/pdftex-pdftexini.Tpo -c -o pdftex-pdftexini.o `test -f 'pdftexini.c' || echo '/opt/local/var/macports/build/nue.de.rsync.macports.org_macports_release_tarballs_ports_tex_texlive-bin/texlive-bin/work/texlive-source-2024.70613-stripped/texk/web2c/'`pdftexini.c
pdftexini.c: In function 'loadfmtfile':
pdftexini.c:4016:25: error: assignment to 'boolean *' {aka 'int *'} from incompatible pointer type 'internalfontnumber *' {aka 'long int *'} [-Wincompatible-pointer-types]
4016 | pdffonthasspacechar = xmallocarray ( internalfontnumber , fontmax ) ;
| ^
pdftexini.c: In function 'mainbody':
pdftexini.c:5569:27: error: assignment to 'boolean *' {aka 'int *'} from incompatible pointer type 'internalfontnumber *' {aka 'long int *'} [-Wincompatible-pointer-types]
5569 | pdffonthasspacechar = xmallocarray ( internalfontnumber , fontmax ) ;
| ^
make[5]: *** [pdftex-pdftexini.o] Error 1
make[5]: Leaving directory `/opt/local/var/macports/build/nue.de.rsync.macports.org_macports_release_tarballs_ports_tex_texlive-bin/texlive-bin/work/build/texk/web2c'
make[4]: *** [all-recursive] Error 1
Attachments (1)
Note: See
TracTickets for help on using
tickets.

Main.log from PPC Leopard, Mac OS X 10.5.8