Opened 5 months ago
Closed 5 months ago
#73924 closed defect (duplicate)
openal-soft @1.25.1: error: no member named 'join' in namespace 'std::ranges::views'
| Reported by: | mrkapqa | Owned by: | |
|---|---|---|---|
| Priority: | Normal | Milestone: | |
| Component: | ports | Version: | 2.12.5 |
| Keywords: | mojave | Cc: | |
| Port: | openal-soft |
Description
Hello ,
when doing "port upgrade" for "selfupdate" following error encounter
:info:build 7 warnings and 1 error generated.
:info:build make[2]: *** [CMakeFiles/OpenAL.dir/alc/backends/coreaudio.cpp.o] Error 1
:info:build make[2]: Leaving directory `/opt/local/var/macports/build/openal-soft-be5e6b3e/work/build'
:info:build make[1]: *** [CMakeFiles/makemhr.dir/all] Error 2
:info:build make[1]: *** Waiting for unfinished jobs....
:info:build make[2]: Leaving directory `/opt/local/var/macports/build/openal-soft-be5e6b3e/work/build'
:info:build make[1]: *** [CMakeFiles/OpenAL.dir/all] Error 2
:info:build make[1]: Leaving directory `/opt/local/var/macports/build/openal-soft-be5e6b3e/work/build'
:info:build make: *** [all] Error 2
:info:build make: Leaving directory `/opt/local/var/macports/build/openal-soft-be5e6b3e/work/build'
:info:build Command failed: cd "/opt/local/var/macports/build/openal-soft-be5e6b3e/work/build" && /usr/bin/make -j24 -w all VERBOSE=ON
:info:build Exit code: 2
:error:build Failed to build openal-soft: command execution failed
:debug:build Error code: CHILDSTATUS 24400 2
:debug:build Backtrace: command execution failed
:debug:build while executing
:debug:build "system {*}$notty {*}$callback {*}$nice $fullcmdstring"
:debug:build invoked from within
:debug:build "command_exec -callback portprogress::target_progress_callback build"
:debug:build (procedure "portbuild::build_main" line 10)
:debug:build invoked from within
:debug:build "$procedure $targetname"
this has probably already been reported.##
thanks
Attachments (1)
Change History (2)
Changed 5 months ago by mrkapqa
| Attachment: | opena1.log added |
|---|
comment:1 Changed 5 months ago by ryandesign (Ryan Carsten Schmidt)
| Keywords: | openal-soft removed |
|---|---|
| Resolution: | → duplicate |
| Status: | new → closed |
| Summary: | (10.14) error:build Failed to build openal-soft: command execution failed → openal-soft @1.25.1: error: no member named 'join' in namespace 'std::ranges::views' |
Note: See
TracTickets for help on using
tickets.

Duplicate of #73874.