Opened 4 months ago
Last modified 4 months ago
#73993 assigned defect
rocksdb: build failure
| Reported by: | examachine (Eray Özkural) | Owned by: | stromnov (Andrey Stromnov) |
|---|---|---|---|
| Priority: | Normal | Milestone: | |
| Component: | ports | Version: | |
| Keywords: | Cc: | ||
| Port: | rocksdb |
Description
I am attaching the build log.
Change History (3)
comment:1 Changed 4 months ago by examachine (Eray Özkural)
comment:2 Changed 4 months ago by jmroot (Joshua Root)
| Owner: | set to stromnov |
|---|---|
| Port: | rocksdb added |
| Status: | new → assigned |
comment:3 Changed 4 months ago by jmroot (Joshua Root)
Note: See
TracTickets for help on using
tickets.

tail of the build log, what is going on here haha!
:info:build [ 45%] Building CXX object CMakeFiles/rocksdb.dir/port/stack_trace.cc.o :info:build /usr/bin/clang++ -DBZIP2 -DGFLAGS=1 -DGFLAGS_IS_A_DLL=0 -DHAVE_FULLFSYNC -DLZ4 -DOS_MACOSX -DROCKSDB_LIB_IO_POSIX -DROCKSDB_NO_DYNAMIC_EXTENSION -DROCKSDB_PLATFORM_POSIX -DSNAPPY -DZLIB -DZSTD -I/opt/local/var/macports/build/rocksdb-d32946fd/work/rocksdb-10.1.3/include -I/opt/local/var/macports/build/rocksdb-d32946fd/work/rocksdb-10.1.3 -isystem /opt/local/var/macports/build/rocksdb-d32946fd/work/rocksdb-10.1.3/third-party/gtest-1.8.1/fused-src -isystem /opt/local/include -pipe -Os -DNDEBUG -I/opt/local/include -stdlib=libc++ -isysroot/Library/Developer/CommandLineTools/SDKs/MacOSX26.sdk -W -Wextra -Wall -pthread -Wsign-compare -Wshadow -Wno-unused-parameter -Wno-unused-variable -Woverloaded-virtual -Wnon-virtual-dtor -Wno-missing-field-initializers -Wno-strict-aliasing -Wno-invalid-offsetof -fno-omit-frame-pointer -momit-leaf-frame-pointer -march=armv8-a+crc+crypto -Wno-unused-function -Werror -std=gnu++17 -arch arm64 -isysroot /Library/Developer/CommandLineTools/SDKs/MacOSX26.sdk -mmacosx-version-min=26.0 -MD -MT CMakeFiles/rocksdb.dir/port/stack_trace.cc.o -MF CMakeFiles/rocksdb.dir/port/stack_trace.cc.o.d -o CMakeFiles/rocksdb.dir/port/stack_trace.cc.o -c /opt/local/var/macports/build/rocksdb-d32946fd/work/rocksdb-10.1.3/port/stack_trace.cc :info:build [ 45%] Building CXX object CMakeFiles/rocksdb.dir/table/adaptive/adaptive_table_factory.cc.o :info:build /usr/bin/clang++ -DBZIP2 -DGFLAGS=1 -DGFLAGS_IS_A_DLL=0 -DHAVE_FULLFSYNC -DLZ4 -DOS_MACOSX -DROCKSDB_LIB_IO_POSIX -DROCKSDB_NO_DYNAMIC_EXTENSION -DROCKSDB_PLATFORM_POSIX -DSNAPPY -DZLIB -DZSTD -I/opt/local/var/macports/build/rocksdb-d32946fd/work/rocksdb-10.1.3/include -I/opt/local/var/macports/build/rocksdb-d32946fd/work/rocksdb-10.1.3 -isystem /opt/local/var/macports/build/rocksdb-d32946fd/work/rocksdb-10.1.3/third-party/gtest-1.8.1/fused-src -isystem /opt/local/include -pipe -Os -DNDEBUG -I/opt/local/include -stdlib=libc++ -isysroot/Library/Developer/CommandLineTools/SDKs/MacOSX26.sdk -W -Wextra -Wall -pthread -Wsign-compare -Wshadow -Wno-unused-parameter -Wno-unused-variable -Woverloaded-virtual -Wnon-virtual-dtor -Wno-missing-field-initializers -Wno-strict-aliasing -Wno-invalid-offsetof -fno-omit-frame-pointer -momit-leaf-frame-pointer -march=armv8-a+crc+crypto -Wno-unused-function -Werror -std=gnu++17 -arch arm64 -isysroot /Library/Developer/CommandLineTools/SDKs/MacOSX26.sdk -mmacosx-version-min=26.0 -MD -MT CMakeFiles/rocksdb.dir/table/adaptive/adaptive_table_factory.cc.o -MF CMakeFiles/rocksdb.dir/table/adaptive/adaptive_table_factory.cc.o.d -o CMakeFiles/rocksdb.dir/table/adaptive/adaptive_table_factory.cc.o -c /opt/local/var/macports/build/rocksdb-d32946fd/work/rocksdb-10.1.3/table/adaptive/adaptive_table_factory.cc :info:build /opt/local/var/macports/build/rocksdb-d32946fd/work/rocksdb-10.1.3/port/mmap.cc:50:15: error: first argument in call to 'memcpy' is a pointer to non-trivially copyable type 'rocksdb::MemMapping' [-Werror,-Wnontrivial-memcall] :info:build 50 | std::memcpy(this, &other, sizeof(*this)); :info:build | ^ :info:build /opt/local/var/macports/build/rocksdb-d32946fd/work/rocksdb-10.1.3/port/mmap.cc:50:15: note: explicitly cast the pointer to silence this warning :info:build 50 | std::memcpy(this, &other, sizeof(*this)); :info:build | ^ :info:build | (void*) :info:build 1 error generated. :info:build make[2]: *** [CMakeFiles/rocksdb.dir/port/mmap.cc.o] Error 1 :info:build make[2]: *** Waiting for unfinished jobs.... :info:build make[2]: Leaving directory `/opt/local/var/macports/build/rocksdb-d32946fd/work/build' :info:build make[1]: *** [CMakeFiles/rocksdb.dir/all] Error 2 :info:build make[1]: Leaving directory `/opt/local/var/macports/build/rocksdb-d32946fd/work/build' :info:build make: *** [all] Error 2 :info:build make: Leaving directory `/opt/local/var/macports/build/rocksdb-d32946fd/work/build' :info:build Command failed: cd "/opt/local/var/macports/build/rocksdb-d32946fd/work/build" && /usr/bin/make -j8 -w all VERBOSE=ON :info:build Exit code: 2 :error:build Failed to build rocksdb: command execution failed :debug:build Error code: CHILDSTATUS 33624 2 :debug:build Backtrace: command execution failed :debug:build while executing :debug:build "system {*}$notty {*}$callback {*}$nice $fullcmdstring" :debug:build invoked from within :debug:build "command_exec -callback portprogress::target_progress_callback build" :debug:build (procedure "portbuild::build_main" line 10) :debug:build invoked from within :debug:build "$procedure $targetname" :error:build See /opt/local/var/macports/logs/_opt_local_var_macports_sources_rsync.macports.org_macports_release_tarballs_ports_databases_rocksdb/rocksdb/main.log for details.