Opened 4 months ago

Closed 4 months ago

#74044 closed defect (fixed)

jxrlib @1.3.8 does not build on PPC Leopard, Mac OS X 10.6.8, because of error: expected ‘)’ before ‘bits’

Reported by: ballapete (Peter "Pete" Dyballa) Owned by: Dave-Allured (Dave Allured)
Priority: Normal Milestone:
Component: ports Version: 2.12.5
Keywords: ppc leopard Cc: Dave-Allured (Dave Allured)
Port: jxrlib

Description

[ 23%] Building C object CMakeFiles/jpegxr.dir/image/decode/segdec.c.o
/usr/bin/gcc-4.2 -DDISABLE_PERF_MEASUREMENT -D_BIG__ENDIAN_ -D__ANSI__ -Djpegxr_EXPORTS -I/opt/local/var/macports/build/jxrlib-f6e1f7df/work/jxrlib-1.3.8/common/include -I/opt/local/var/macports/build/jxrlib-f6e1f7df/work/jxrlib-1.3.8/image/sys -I/opt/local/var/macports/build/jxrlib-f6e1f7df/work/jxrlib-1.3.8/jxrgluelib -I/opt/local/var/macports/build/jxrlib-f6e1f7df/work/jxrlib-1.3.8/jxrtestlib -pipe -Os -DNDEBUG -I/opt/local/include -arch ppc -mmacosx-version-min=10.5 -fPIC -w -Wno-error=implicit-function-declaration -MD -MT CMakeFiles/jpegxr.dir/image/decode/segdec.c.o -MF CMakeFiles/jpegxr.dir/image/decode/segdec.c.o.d -o CMakeFiles/jpegxr.dir/image/decode/segdec.c.o -c /opt/local/var/macports/build/jxrlib-f6e1f7df/work/jxrlib-1.3.8/image/decode/segdec.c
/opt/local/var/macports/build/jxrlib-f6e1f7df/work/jxrlib-1.3.8/image/decode/segdec.c:56: error: expected ‘)’ before ‘bits’
make[2]: *** [CMakeFiles/jpegxr.dir/image/decode/segdec.c.o] Error 1
make[2]: Leaving directory `/opt/local/var/macports/build/jxrlib-f6e1f7df/work/build'
make[1]: *** [CMakeFiles/jpegxr.dir/all] Error 2
make[1]: Leaving directory `/opt/local/var/macports/build/jxrlib-f6e1f7df/work/build'
make: *** [all] Error 2

Does this product have an idea of byte order?

Attachments (1)

main.log (91.0 KB) - added by ballapete (Peter "Pete" Dyballa) 4 months ago.
Main.log from PPC Leopard, Mac OS X 10.5.8

Download all attachments as: .zip

Change History (5)

Changed 4 months ago by ballapete (Peter "Pete" Dyballa)

Attachment: main.log added

Main.log from PPC Leopard, Mac OS X 10.5.8

comment:1 Changed 4 months ago by Dave-Allured (Dave Allured)

I think this was just fixed upstream. Thanks @barracuda156 for reporting early. Expect new release and port update soon.

https://github.com/mircomir/jxrlib/issues/31

comment:2 Changed 4 months ago by Dave-Allured (Dave Allured)

Cc: Dave-Allured added

comment:4 Changed 4 months ago by Dave-Allured (Dave Allured)

Owner: set to Dave-Allured
Resolution: fixed
Status: newclosed

In 766b3056fa64cd940edfe6ae8c79696cad8aca1d/macports-ports (master):

jxrlib: Update to 1.3.9

Closes #74044

Note: See TracTickets for help on using tickets.