Opened 4 weeks ago

Last modified 4 weeks ago

#74430 assigned defect

lilypond @2.24.4_1: Fails to compile on macOS 27 (Golden Gate)

Reported by: jcobleigh Owned by: nerdling (Jeremy Lavergne)
Priority: Normal Milestone:
Component: ports Version:
Keywords: goldengate Cc:
Port: lilypond

Description (last modified by jmroot (Joshua Root))

port install lilypond

--->  Building lilypond
Error: Failed to build lilypond: command execution failed
Error: See /opt/local/var/macports/logs/_opt_local_var_macports_sources_rsync.macports.org_macports_release_tarballs_ports_textproc_lilypond/lilypond/main.log for details.
:notice:build --->  Building lilypond
:debug:build Executing org.macports.build (lilypond)
:debug:build Environment: 
:debug:build CC_PRINT_OPTIONS='YES'
:debug:build CC_PRINT_OPTIONS_FILE='/opt/local/var/macports/build/lilypond-c3c4a752/work/.CC_PRINT_OPTIONS'
:debug:build CPATH='/opt/local/include'
:debug:build DEVELOPER_DIR='/Library/Developer/CommandLineTools'
:debug:build LIBRARY_PATH='/opt/local/lib'
:debug:build LTDL_LIBRARY_PATH='/opt/local/lib'
:debug:build MACOSX_DEPLOYMENT_TARGET='27.0'
:debug:build PYTHON='/opt/local/bin/python3.11'
:debug:build SDKROOT='/Library/Developer/CommandLineTools/SDKs/MacOSX27.sdk'
:debug:build SOURCE_DATE_EPOCH='1788315013'
:info:build Executing:  cd "/opt/local/var/macports/build/lilypond-c3c4a752/work/lilypond-2.24.4" && /usr/bin/gnumake -j10 -w bytecode 
:debug:build system:  cd "/opt/local/var/macports/build/lilypond-c3c4a752/work/lilypond-2.24.4" && /usr/bin/gnumake -j10 -w bytecode 
:info:build gnumake: Entering directory `/opt/local/var/macports/build/lilypond-c3c4a752/work/lilypond-2.24.4'
:info:build gnumake[1]: Entering directory `/opt/local/var/macports/build/lilypond-c3c4a752/work/lilypond-2.24.4/python'
:info:build gnumake[2]: Entering directory `/opt/local/var/macports/build/lilypond-c3c4a752/work/lilypond-2.24.4/python/auxiliar'
:info:build gnumake[2]: Leaving directory `/opt/local/var/macports/build/lilypond-c3c4a752/work/lilypond-2.24.4/python/auxiliar'
:info:build gnumake[1]: Leaving directory `/opt/local/var/macports/build/lilypond-c3c4a752/work/lilypond-2.24.4/python'
:info:build gnumake[1]: Entering directory `/opt/local/var/macports/build/lilypond-c3c4a752/work/lilypond-2.24.4/scripts'
:info:build gnumake[2]: Entering directory `/opt/local/var/macports/build/lilypond-c3c4a752/work/lilypond-2.24.4/scripts/build'
:info:build gnumake[2]: Leaving directory `/opt/local/var/macports/build/lilypond-c3c4a752/work/lilypond-2.24.4/scripts/build'
:info:build gnumake[2]: Entering directory `/opt/local/var/macports/build/lilypond-c3c4a752/work/lilypond-2.24.4/scripts/build'
:info:build gnumake[2]: Leaving directory `/opt/local/var/macports/build/lilypond-c3c4a752/work/lilypond-2.24.4/scripts/build'
:info:build gnumake[1]: Leaving directory `/opt/local/var/macports/build/lilypond-c3c4a752/work/lilypond-2.24.4/scripts'
:info:build gnumake[1]: Entering directory `/opt/local/var/macports/build/lilypond-c3c4a752/work/lilypond-2.24.4/flower'
:info:build gnumake[1]: Leaving directory `/opt/local/var/macports/build/lilypond-c3c4a752/work/lilypond-2.24.4/flower'
:info:build gnumake[1]: Entering directory `/opt/local/var/macports/build/lilypond-c3c4a752/work/lilypond-2.24.4/lily'
:info:build Making lily/out/accidental-engraver.o < cc
:info:build Making lily/out/accidental.o < cc
:info:build Making lily/out/ambitus-engraver.o < cc
:info:build Making lily/out/arpeggio-engraver.o < cc
:info:build Making lily/out/arpeggio.o < cc
:info:build Making lily/out/articulations.o < cc
:info:build Making lily/out/audio-column.o < cc
:info:build Making lily/out/audio-element-info.o < cc
:info:build Making lily/out/audio-element.o < cc
:info:build gnumake[2]: Entering directory `/opt/local/var/macports/build/lilypond-c3c4a752/work/lilypond-2.24.4/lily/include'
:info:build gnumake[2]: Leaving directory `/opt/local/var/macports/build/lilypond-c3c4a752/work/lilypond-2.24.4/lily/include'
:info:build Making lily/out/audio-item.o < cc
:info:build Making lily/out/audio-staff.o < cc
:info:build In file included from audio-column.cc:22:
:info:build /opt/local/var/macports/build/lilypond-c3c4a752/work/lilypond-2.24.4/lily/include/audio-item.hh:101:23: warning: virtual method 'to_string' is inside a 'final' class and can never be overridden [-Wunnecessary-virtual-specifier]
:info:build   101 |   virtual std::string to_string () const;
:info:build       |                       ^
:info:build In file included from audio-element-info.cc:22:
:info:build In file included from /opt/local/var/macports/build/lilypond-c3c4a752/work/lilypond-2.24.4/lily/include/translator-group.hh:23:
:info:build /opt/local/var/macports/build/lilypond-c3c4a752/work/lilypond-2.24.4/lily/include/callback.hh:250:3: error: 'smob_trampoline' is a private member of 'Smob_base<Method_instance>'
:info:build   250 |   LY_DECLARE_SMOB_PROC (&Method_instance::call, 0, 0, 1)
:info:build       |   ^~~~~~~~~~~~~~~~~~~~~~~~~~~~~~~~~~~~~~~~~~~~~~~~~~~~~~
:info:build /opt/local/var/macports/build/lilypond-c3c4a752/work/lilypond-2.24.4/lily/include/smobs.hh:245:32: note: expanded from macro 'LY_DECLARE_SMOB_PROC'
:info:build   245 |   LY_DECLARE_STATIC_SMOB_PROC (smob_trampoline<PMF>, REQ, OPT, VAR)
:info:build       |   ~~~~~~~~~~~~~~~~~~~~~~~~~~~~~^~~~~~~~~~~~~~~~~~~~~~~~~~~~~~~~~~~~
:info:build /opt/local/var/macports/build/lilypond-c3c4a752/work/lilypond-2.24.4/lily/include/smobs.hh:240:65: note: expanded from macro 'LY_DECLARE_STATIC_SMOB_PROC'
:info:build   240 |     scm_set_smob_apply (smob_tag, reinterpret_cast<scm_t_subr> (FUN), REQ,     \
:info:build       |                                                                 ^~~
:info:build /opt/local/var/macports/build/lilypond-c3c4a752/work/lilypond-2.24.4/lily/include/smobs.hh:260:14: note: declared private here
:info:build   260 |   static SCM smob_trampoline (SCM self, SCM arg1)
:info:build       |              ^
:info:build In file included from accidental-engraver.cc:25:
:info:build In file included from /opt/local/var/macports/build/lilypond-c3c4a752/work/lilypond-2.24.4/lily/include/engraver.hh:23:
:info:build /opt/local/var/macports/build/lilypond-c3c4a752/work/lilypond-2.24.4/lily/include/callback.hh:250:3: error: 'smob_trampoline' is a private member of 'Smob_base<Method_instance>'
:info:build   250 |   LY_DECLARE_SMOB_PROC (&Method_instance::call, 0, 0, 1)
:info:build       |   ^~~~~~~~~~~~~~~~~~~~~~~~~~~~~~~~~~~~~~~~~~~~~~~~~~~~~~
:info:build /opt/local/var/macports/build/lilypond-c3c4a752/work/lilypond-2.24.4/lily/include/smobs.hh:245:32: note: expanded from macro 'LY_DECLARE_SMOB_PROC'
:info:build   245 |   LY_DECLARE_STATIC_SMOB_PROC (smob_trampoline<PMF>, REQ, OPT, VAR)
:info:build       |   ~~~~~~~~~~~~~~~~~~~~~~~~~~~~~^~~~~~~~~~~~~~~~~~~~~~~~~~~~~~~~~~~~
:info:build /opt/local/var/macports/build/lilypond-c3c4a752/work/lilypond-2.24.4/lily/include/smobs.hh:240:65: note: expanded from macro 'LY_DECLARE_STATIC_SMOB_PROC'
:info:build   240 |     scm_set_smob_apply (smob_tag, reinterpret_cast<scm_t_subr> (FUN), REQ,     \
:info:build       |                                                                 ^~~
:info:build /opt/local/var/macports/build/lilypond-c3c4a752/work/lilypond-2.24.4/lily/include/smobs.hh:260:14: note: declared private here
:info:build   260 |   static SCM smob_trampoline (SCM self, SCM arg1)
:info:build       |              ^
:info:build In file included from audio-element-info.cc:22:
:info:build In file included from /opt/local/var/macports/build/lilypond-c3c4a752/work/lilypond-2.24.4/lily/include/translator-group.hh:24:
:info:build /opt/local/var/macports/build/lilypond-c3c4a752/work/lilypond-2.24.4/lily/include/translator.hh:66:3: error: 'smob_trampoline' is a private member of 'Smob_base<Translator_creator>'
:info:build    66 |   LY_DECLARE_SMOB_PROC (&Translator_creator::call, 1, 0, 0);
:info:build       |   ^~~~~~~~~~~~~~~~~~~~~~~~~~~~~~~~~~~~~~~~~~~~~~~~~~~~~~~~~
:info:build /opt/local/var/macports/build/lilypond-c3c4a752/work/lilypond-2.24.4/lily/include/smobs.hh:245:32: note: expanded from macro 'LY_DECLARE_SMOB_PROC'
:info:build   245 |   LY_DECLARE_STATIC_SMOB_PROC (smob_trampoline<PMF>, REQ, OPT, VAR)
:info:build       |   ~~~~~~~~~~~~~~~~~~~~~~~~~~~~~^~~~~~~~~~~~~~~~~~~~~~~~~~~~~~~~~~~~
:info:build /opt/local/var/macports/build/lilypond-c3c4a752/work/lilypond-2.24.4/lily/include/smobs.hh:240:65: note: expanded from macro 'LY_DECLARE_STATIC_SMOB_PROC'
:info:build   240 |     scm_set_smob_apply (smob_tag, reinterpret_cast<scm_t_subr> (FUN), REQ,     \
:info:build       |                                                                 ^~~
:info:build /opt/local/var/macports/build/lilypond-c3c4a752/work/lilypond-2.24.4/lily/include/smobs.hh:260:14: note: declared private here
:info:build   260 |   static SCM smob_trampoline (SCM self, SCM arg1)
:info:build       |              ^
:info:build In file included from accidental-engraver.cc:25:
:info:build In file included from /opt/local/var/macports/build/lilypond-c3c4a752/work/lilypond-2.24.4/lily/include/engraver.hh:26:
:info:build /opt/local/var/macports/build/lilypond-c3c4a752/work/lilypond-2.24.4/lily/include/translator.hh:66:3: error: 'smob_trampoline' is a private member of 'Smob_base<Translator_creator>'
:info:build    66 |   LY_DECLARE_SMOB_PROC (&Translator_creator::call, 1, 0, 0);
:info:build       |   ^~~~~~~~~~~~~~~~~~~~~~~~~~~~~~~~~~~~~~~~~~~~~~~~~~~~~~~~~
:info:build /opt/local/var/macports/build/lilypond-c3c4a752/work/lilypond-2.24.4/lily/include/smobs.hh:245:32: note: expanded from macro 'LY_DECLARE_SMOB_PROC'
:info:build   245 |   LY_DECLARE_STATIC_SMOB_PROC (smob_trampoline<PMF>, REQ, OPT, VAR)
:info:build       |   ~~~~~~~~~~~~~~~~~~~~~~~~~~~~~^~~~~~~~~~~~~~~~~~~~~~~~~~~~~~~~~~~~
:info:build /opt/local/var/macports/build/lilypond-c3c4a752/work/lilypond-2.24.4/lily/include/smobs.hh:240:65: note: expanded from macro 'LY_DECLARE_STATIC_SMOB_PROC'
:info:build   240 |     scm_set_smob_apply (smob_tag, reinterpret_cast<scm_t_subr> (FUN), REQ,     \
:info:build       |                                                                 ^~~
:info:build /opt/local/var/macports/build/lilypond-c3c4a752/work/lilypond-2.24.4/lily/include/smobs.hh:260:14: note: declared private here
:info:build   260 |   static SCM smob_trampoline (SCM self, SCM arg1)
:info:build       |              ^
:info:build In file included from audio-item.cc:20:
:info:build /opt/local/var/macports/build/lilypond-c3c4a752/work/lilypond-2.24.4/lily/include/audio-item.hh:101:23: warning: virtual method 'to_string' is inside a 'final' class and can never be overridden [-Wunnecessary-virtual-specifier]
:info:build   101 |   virtual std::string to_string () const;
:info:build       |                       ^
:info:build In file included from articulations.cc:19:
:info:build In file included from /opt/local/var/macports/build/lilypond-c3c4a752/work/lilypond-2.24.4/lily/include/engraver.hh:23:
:info:build /opt/local/var/macports/build/lilypond-c3c4a752/work/lilypond-2.24.4/lily/include/callback.hh:250:3: error: 'smob_trampoline' is a private member of 'Smob_base<Method_instance>'
:info:build   250 |   LY_DECLARE_SMOB_PROC (&Method_instance::call, 0, 0, 1)
:info:build       |   ^~~~~~~~~~~~~~~~~~~~~~~~~~~~~~~~~~~~~~~~~~~~~~~~~~~~~~
:info:build /opt/local/var/macports/build/lilypond-c3c4a752/work/lilypond-2.24.4/lily/include/smobs.hh:245:32: note: expanded from macro 'LY_DECLARE_SMOB_PROC'
:info:build   245 |   LY_DECLARE_STATIC_SMOB_PROC (smob_trampoline<PMF>, REQ, OPT, VAR)
:info:build       |   ~~~~~~~~~~~~~~~~~~~~~~~~~~~~~^~~~~~~~~~~~~~~~~~~~~~~~~~~~~~~~~~~~
:info:build /opt/local/var/macports/build/lilypond-c3c4a752/work/lilypond-2.24.4/lily/include/smobs.hh:240:65: note: expanded from macro 'LY_DECLARE_STATIC_SMOB_PROC'
:info:build   240 |     scm_set_smob_apply (smob_tag, reinterpret_cast<scm_t_subr> (FUN), REQ,     \
:info:build       |                                                                 ^~~
:info:build /opt/local/var/macports/build/lilypond-c3c4a752/work/lilypond-2.24.4/lily/include/smobs.hh:260:14: note: declared private here
:info:build   260 |   static SCM smob_trampoline (SCM self, SCM arg1)
:info:build       |              ^
:info:build accidental-engraver.cc:390:43: warning: implicit conversion changes signedness: 'vsize' (aka 'unsigned long') to 'difference_type' (aka 'long') [-Wsign-conversion]
:info:build   390 |             ties_.erase (ties_.begin () + j);
:info:build       |                                         ~ ^
:info:build In file included from arpeggio-engraver.cc:20:
:info:build In file included from /opt/local/var/macports/build/lilypond-c3c4a752/work/lilypond-2.24.4/lily/include/engraver.hh:23:
:info:build /opt/local/var/macports/build/lilypond-c3c4a752/work/lilypond-2.24.4/lily/include/callback.hh:250:3: error: 'smob_trampoline' is a private member of 'Smob_base<Method_instance>'
:info:build   250 |   LY_DECLARE_SMOB_PROC (&Method_instance::call, 0, 0, 1)
:info:build       |   ^~~~~~~~~~~~~~~~~~~~~~~~~~~~~~~~~~~~~~~~~~~~~~~~~~~~~~
:info:build /opt/local/var/macports/build/lilypond-c3c4a752/work/lilypond-2.24.4/lily/include/smobs.hh:245:32: note: expanded from macro 'LY_DECLARE_SMOB_PROC'
:info:build   245 |   LY_DECLARE_STATIC_SMOB_PROC (smob_trampoline<PMF>, REQ, OPT, VAR)
:info:build       |   ~~~~~~~~~~~~~~~~~~~~~~~~~~~~~^~~~~~~~~~~~~~~~~~~~~~~~~~~~~~~~~~~~
:info:build /opt/local/var/macports/build/lilypond-c3c4a752/work/lilypond-2.24.4/lily/include/smobs.hh:240:65: note: expanded from macro 'LY_DECLARE_STATIC_SMOB_PROC'
:info:build   240 |     scm_set_smob_apply (smob_tag, reinterpret_cast<scm_t_subr> (FUN), REQ,     \
:info:build       |                                                                 ^~~
:info:build /opt/local/var/macports/build/lilypond-c3c4a752/work/lilypond-2.24.4/lily/include/smobs.hh:260:14: note: declared private here
:info:build   260 |   static SCM smob_trampoline (SCM self, SCM arg1)
:info:build       |              ^
:info:build In file included from articulations.cc:19:
:info:build In file included from /opt/local/var/macports/build/lilypond-c3c4a752/work/lilypond-2.24.4/lily/include/engraver.hh:26:
:info:build /opt/local/var/macports/build/lilypond-c3c4a752/work/lilypond-2.24.4/lily/include/translator.hh:66:3: error: 'smob_trampoline' is a private member of 'Smob_base<Translator_creator>'
:info:build    66 |   LY_DECLARE_SMOB_PROC (&Translator_creator::call, 1, 0, 0);
:info:build       |   ^~~~~~~~~~~~~~~~~~~~~~~~~~~~~~~~~~~~~~~~~~~~~~~~~~~~~~~~~
:info:build /opt/local/var/macports/build/lilypond-c3c4a752/work/lilypond-2.24.4/lily/include/smobs.hh:245:32: note: expanded from macro 'LY_DECLARE_SMOB_PROC'
:info:build   245 |   LY_DECLARE_STATIC_SMOB_PROC (smob_trampoline<PMF>, REQ, OPT, VAR)
:info:build       |   ~~~~~~~~~~~~~~~~~~~~~~~~~~~~~^~~~~~~~~~~~~~~~~~~~~~~~~~~~~~~~~~~~
:info:build /opt/local/var/macports/build/lilypond-c3c4a752/work/lilypond-2.24.4/lily/include/smobs.hh:240:65: note: expanded from macro 'LY_DECLARE_STATIC_SMOB_PROC'
:info:build   240 |     scm_set_smob_apply (smob_tag, reinterpret_cast<scm_t_subr> (FUN), REQ,     \
:info:build       |                                                                 ^~~
:info:build /opt/local/var/macports/build/lilypond-c3c4a752/work/lilypond-2.24.4/lily/include/smobs.hh:260:14: note: declared private here
:info:build   260 |   static SCM smob_trampoliIn file included from ambitus-engraver.cc:22:
:info:build In file included from /opt/local/var/macports/build/lilypond-c3c4a752/work/lilypond-2.24.4/lily/include/engraver.hh:23:
:info:build /opt/local/var/macports/build/lilypond-c3c4a752/work/lilypond-2.24.4/lily/include/callback.hh:250:3: error: 'smob_trampoline' is a private member of 'Smob_base<Method_instance>'
:info:build   250 |   LY_DECLARE_SMOB_PROC (&Method_instance::call, 0, 0, 1)
:info:build       |   ^~~~~~~~~~~~~~~~~~~~~~~~~~~~~~~~~~~~~~~~~~~~~~~~~~~~~~
:info:build /opt/local/var/macports/build/lilypond-c3c4a752/work/lilypond-2.24.4/lily/include/smobs.hh:245:32: note: expanded from macro 'LY_DECLARE_SMOB_PROC'
:info:build   245 |   LY_DECLARE_STATIC_SMOB_PROC (smob_trampoline<PMF>, REQ, OPT, VAR)
:info:build       |   ~~~~~~~~~~~~~~~~~~~~~~~~~~~~~^~~~~~~~~~~~~~~~~~~~~~~~~~~~~~~~~~~~
:info:build /opt/local/var/macports/build/lilypond-c3c4a752/work/lilypond-2.24.4/lily/include/smobs.hh:240:65: note: expanded from macro 'LY_DECLARE_STATIC_SMOB_PROC'
:info:build   240 |     scm_set_smob_apply (smob_tag, reinterpret_cast<scm_t_subr> (FUN), REQ,     \
:info:build       |                                                                 ^~~
:info:build /opt/local/var/macports/build/lilypond-c3c4a752/work/lilypond-2.24.4/lily/include/smobs.hh:260:14: note: declared private here
:info:build   260 |   static SCM smob_trampoline (SCM self, SCM arg1)
:info:build       |              ^
:info:build ne (SCM self, SCM arg1)
:info:build       |              ^
:info:build In file included from ambitus-engraver.cc:22:
:info:build In file included from /opt/local/var/macports/build/lilypond-c3c4a752/work/lilypond-2.24.4/lily/include/engraver.hh:26:
:info:build /opt/local/var/macports/build/lilypond-c3c4a752/work/lilypond-2.24.4/lily/include/translator.hh:66:3: error: 'smob_trampoline' is a private member of 'Smob_base<Translator_creator>'
:info:build    66 |   LY_DECLARE_SMOB_PROC (&Translator_creator::call, 1, 0, 0);
:info:build       |   ^~~~~~~~~~~~~~~~~~~~~~~~~~~~~~~~~~~~~~~~~~~~~~~~~~~~~~~~~
:info:build /opt/local/var/macports/build/lilypond-c3c4a752/work/lilypond-2.24.4/lily/include/smobs.hh:245:32: note: expanded from macro 'LY_DECLARE_SMOB_PROC'
:info:build   245 |   LY_DECLARE_STATIC_SMOB_PROC (smob_trampoline<PMF>, REQ, OPT, VAR)
:info:build       |   ~~~~~~~~~~~~~~~~~~~~~~~~~~~~~^~~~~~~~~~~~~~~~~~~~~~~~~~~~~~~~~~~~
:info:build /opt/local/var/macports/build/lilypond-c3c4a752/work/lilypond-2.24.4/lily/include/smobs.hh:240:65: note: expanded from macro 'LY_DECLARE_STATIC_SMOB_PROC'
:info:build   240 |     scm_set_smob_apply (smob_tag, reinterpret_cast<scm_t_subr> (FUN), REQ,     \
:info:build       |                                                                 ^~~
:info:build /opt/local/var/macports/build/lilypond-c3c4a752/work/lilypond-2.24.4/lily/include/smobs.hh:260:14: note: declared private here
:info:build   260 |   static SCM smob_trampoline (SCM self, SCM arg1)
:info:build       |              ^
:info:build In file included from arpeggio-engraver.cc:20:
:info:build In file included from /opt/local/var/macports/build/lilypond-c3c4a752/work/lilypond-2.24.4/lily/include/engraver.hh:26:
:info:build /opt/local/var/macports/build/lilypond-c3c4a752/work/lilypond-2.24.4/lily/include/translator.hh:66:3: error: 'smob_trampoline' is a private member of 'Smob_base<Translator_creator>'
:info:build    66 |   LY_DECLARE_SMOB_PROC (&Translator_creator::call, 1, 0, 0);
:info:build       |   ^~~~~~~~~~~~~~~~~~~~~~~~~~~~~~~~~~~~~~~~~~~~~~~~~~~~~~~~~
:info:build /opt/local/var/macports/build/lilypond-c3c4a752/work/lilypond-2.24.4/lily/include/smobs.hh:245:32: note: expanded from macro 'LY_DECLARE_SMOB_PROC'
:info:build   245 |   LY_DECLARE_STATIC_SMOB_PROC (smob_trampoline<PMF>, REQ, OPT, VAR)
:info:build       |   ~~~~~~~~~~~~~~~~~~~~~~~~~~~~~^~~~~~~~~~~~~~~~~~~~~~~~~~~~~~~~~~~~
:info:build /opt/local/var/macports/build/lilypond-c3c4a752/work/lilypond-2.24.4/lily/include/smobs.hh:240:65: note: expanded from macro 'LY_DECLARE_STATIC_SMOB_PROC'
:info:build   240 |     scm_set_smob_apply (smob_tag, reinterpret_cast<scm_t_subr> (FUN), REQ,     \
:info:build       |                                                                 ^~~
:info:build /opt/local/var/macports/build/lilypond-c3c4a752/work/lilypond-2.24.4/lily/include/smobs.hh:260:14: note: declared private here
:info:build   260 |   static SCM smob_trampoline (SCM self, SCM arg1)
:info:build       |              ^
:info:build 2 errors generated.
:info:build gnumake[1]: *** [out/audio-element-info.o] Error 1
:info:build gnumake[1]: *** Waiting for unfinished jobs....
:info:build In file included from audio-staff.cc:23:
:info:build In file included from /opt/local/var/macports/build/lilypond-c3c4a752/work/lilypond-2.24.4/lily/include/midi-item.hh:23:
:info:build /opt/local/var/macports/build/lilypond-c3c4a752/work/lilypond-2.24.4/lily/include/audio-item.hh:101:23: warning: virtual method 'to_string' is inside a 'final' class and can never be overridden [-Wunnecessary-virtual-specifier]
:info:build   101 |   virtual std::string to_string () const;
:info:build       |                       ^
:info:build 2 errors generated.
:info:build gnumake[1]: *** [out/articulations.o] Error 1
:info:build In file included from accidental.cc:24:
:info:build In file included from /opt/local/var/macports/build/lilypond-c3c4a752/work/lilypond-2.24.4/lily/include/lazy-skyline-pair.hh:24:
:info:build /opt/local/var/macports/build/lilypond-c3c4a752/work/lilypond-2.24.4/lily/include/transform.hh:32:3: error: 'smob_trampoline' is a private member of 'Smob_base<Transform>'
:info:build    32 |   LY_DECLARE_SMOB_PROC (&Transform::call, 1, 0, 0);
:info:build       |   ^~~~~~~~~~~~~~~~~~~~~~~~~~~~~~~~~~~~~~~~~~~~~~~~
:info:build /opt/local/var/macports/build/lilypond-c3c4a752/work/lilypond-2.24.4/lily/include/smobs.hh:245:32: note: expanded from macro 'LY_DECLARE_SMOB_PROC'
:info:build   245 |   LY_DECLARE_STATIC_SMOB_PROC (smob_trampoline<PMF>, REQ, OPT, VAR)
:info:build       |   ~~~~~~~~~~~~~~~~~~~~~~~~~~~~~^~~~~~~~~~~~~~~~~~~~~~~~~~~~~~~~~~~~
:info:build /opt/local/var/macports/build/lilypond-c3c4a752/work/lilypond-2.24.4/lily/include/smobs.hh:240:65: note: expanded from macro 'LY_DECLARE_STATIC_SMOB_PROC'
:info:build   240 |     scm_set_smob_apply (smob_tag, reinterpret_cast<scm_t_subr> (FUN), REQ,     \
:info:build       |                                                                 ^~~
:info:build /opt/local/var/macports/build/lilypond-c3c4a752/work/lilypond-2.24.4/lily/include/smobs.hh:260:14: note: declared private here
:info:build   260 |   static SCM smob_trampoline (SCM self, SCM arg1)
:info:build       |              ^
:info:build 2 errors generated.
:info:build gnumake[1]: *** [out/arpeggio-engraver.o] Error 1
:info:build 2 errors generated.
:info:build gnumake[1]: *** [out/ambitus-engraver.o] Error 1
:info:build 1 warning and 2 errors generated.
:info:build 1 warning generated.
:info:build gnumake[1]: *** [out/accidental-engraver.o] Error 1
:info:build 1 error generated.
:info:build 1 warning generated.
:info:build gnumake[1]: *** [out/accidental.o] Error 1
:info:build 1 warning generated.
:info:build gnumake[1]: Leaving directory `/opt/local/var/macports/build/lilypond-c3c4a752/work/lilypond-2.24.4/lily'
:info:build gnumake: *** [all] Error 2
:info:build gnumake: Leaving directory `/opt/local/var/macports/build/lilypond-c3c4a752/work/lilypond-2.24.4'
:info:build Command failed:  cd "/opt/local/var/macports/build/lilypond-c3c4a752/work/lilypond-2.24.4" && /usr/bin/gnumake -j10 -w bytecode 
:info:build Exit code: 2
:error:build Failed to build lilypond: command execution failed
:debug:build Error code: CHILDSTATUS 80535 2
:debug:build Backtrace: command execution failed
:debug:build     while executing
:debug:build "system {*}$notty {*}$callback {*}$nice $fullcmdstring"
:debug:build     invoked from within
:debug:build "command_exec -callback portprogress::target_progress_callback build"
:debug:build     (procedure "portbuild::build_main" line 10)
:debug:build     invoked from within
:debug:build "$procedure $targetname"
:error:build See /opt/local/var/macports/logs/_opt_local_var_macports_sources_rsync.macports.org_macports_release_tarballs_ports_textproc_lilypond/lilypond/main.log for details.

Change History (1)

comment:1 Changed 4 weeks ago by jmroot (Joshua Root)

Description: modified (diff)
Keywords: goldengate added
Owner: set to nerdling
Port: lilypond added
Status: new → assigned
Note: See TracTickets for help on using tickets.