New Ticket     Tickets     Wiki     Browse Source     Timeline     Roadmap     Ticket Reports     Search

Timeline


and

10/24/11:

23:54 Changeset [86394] by ryandesign@…
php54: subports for SAPIs; remove apache (1) support; remove ipc, pear and …
23:38 Changeset [86393] by ryandesign@…
audiofile: use unversioned docdir
23:36 Changeset [86392] by ryandesign@…
jbig2dec: fix license, fix typo in long_description, install doc files
23:29 Ticket #31758 (jbig2dec) closed by ryandesign@…
fixed: Committed in r86391 with these changes: * adjusted formatting and …
23:29 Changeset [86391] by ryandesign@…
jbig2dec: new port, version 0.11; see #31758
23:14 Ticket #31727 (weechat: update to 0.3.6) closed by ryandesign@…
fixed: r86390.
23:13 Changeset [86390] by ryandesign@…
weechat: update to 0.3.6; see #31727
23:05 Ticket #29547 (enblend build uses extraordinary amounts of memory) closed by ryandesign@…
fixed: r86389
23:04 Changeset [86389] by ryandesign@…
enblend: disable parallel build; see #29547
21:13 Changeset [86388] by rmstonecipher@…
multimedia/live555 upgraded version from 2011.10.09 to 2011.10.18
21:12 Changeset [86387] by rmstonecipher@…
archivers/unrar upgraded version from 4.1.1 to 4.1.2
21:09 Changeset [86386] by rmstonecipher@…
audio/libmpdclient upgraded version from 2.3 to 2.6
21:03 Ticket #31615 (wireshark: Segmentation fault: 11) closed by ricci@…
fixed: Fixed in r86385.
21:01 Changeset [86385] by ricci@…
Actually fix #31615 by setting compiler on Lion (darwin 11) Bump revision …
20:37 Ticket #31734 (VirtualBox 4.1.6 doesn't work with Lion and Xcode 4.2) reopened by royliu@…
I'm reopening this. Apparently everything compiles, but VMs don't work …
20:33 Changeset [86384] by rmstonecipher@…
audio/quodlibet upgraded version from 2.3.1 to 2.3.2
20:17 Ticket #25941 (php52 fastcgi doesn't work. can't find native php functions) closed by ryandesign@…
worksforme: Closing due to lack of information.
20:16 Ticket #31249 (php5 Download Link Fix (ONE LINE FIX IN DESCRIPTION)) closed by ryandesign@…
invalid: Closing due to lack of information.
20:11 Ticket #29935 (Tidy installs Apache and PHP) closed by ryandesign@…
duplicate: Replying to ldl@…: > No. I expect the website will make it …
19:15 Ticket #31734 (VirtualBox 4.1.6 doesn't work with Lion and Xcode 4.2) closed by royliu@…
fixed: Committed in #36383. Let me know if you continue to have problems.
19:09 Changeset [86383] by royliu@…
virtualbox: use LLVM when available and close ticket #31734
18:12 Changeset [86382] by ryandesign@…
php54: remove unnecessary -lresolv addition
18:01 Changeset [86381] by ryandesign@…
php54: version 5.4.0beta1, with some as yet incomplete effort to not …
17:41 Ticket #31758 (jbig2dec) created by dargo@…
17:33 Ticket #31754 (postfix 2.8.6-0 archive fails to install) closed by jmr@…
fixed: r86380
17:33 Changeset [86380] by jmr@…
postfix: move chown command incorrectly added in pre-install in r41192
16:56 Ticket #31757 (wireshark +python27 mtree violation) created by ishikura.kiwamu@…
When I install wireshark+python27, I got following warnings: […] and …
16:35 Ticket #31696 (kerberos5: linker command failed with exit code 1) closed by ryandesign@…
fixed: r86379.
16:35 Changeset [86379] by ryandesign@…
kerberos5: use llvm-gcc-4.2 instead of clang; see #31696
16:32 Changeset [86378] by devans@…
upnp-inspector: add noarch.
16:27 Changeset [86377] by devans@…
coherence: add dependencies required by MediaStore backend, noarch, …
16:21 Changeset [86376] by devans@…
py-axiom: new port, version 0.6.0, Axiom object database.
16:18 Changeset [86375] by devans@…
py-epsilon: new port, version 0.6.0, utilities required by Axiom.
16:04 Changeset [86374] by devans@…
py27-id3lib: new port based on py26-id3lib.
16:02 Ticket #31752 (kerberos5: clang: error: linker command failed with exit code 1) closed by ryandesign@…
duplicate: Duplicate of #31696, in which two users show using llvm-gcc-4.2 works for …
15:02 Changeset [86373] by devans@…
deluge: add +python2[67] variants, default +python27, update license, …
14:50 Changeset [86372] by devans@…
libtorrent-rasterbar-devel: add +python2[67] variants, default +python27, …
14:47 Changeset [86371] by devans@…
libtorrent-rasterbar: add +python2[67] variants, default +python27, …
14:28 Changeset [86370] by breskeby@…
griffon: version upgrade to 0.9.4
14:15 Ticket #31756 (ruby19 @1.9.2-p290) created by joshuajmoody@…
System Information: Lion 10.7.2 and Xcode 4.2 I ran into trouble …
14:02 Changeset [86369] by and.damore@…
port repo: added dist_subdir postfix for stealth update, increased …
13:30 Changeset [86368] by devans@…
py27-openssl: new port, version 0.13, patterned after py26-openssl, less …
13:12 Changeset [86367] by devans@…
py-xdg: unify port, update to version 0.19, add license, livecheck.
12:54 Ticket #31750 (apache2 +universal is not universal) closed by ryandesign@…
fixed: r86366.
12:54 Changeset [86366] by ryandesign@…
apache2: fix arch handling broken by r86196; see #31750
12:01 Ticket #31755 (py27-pyside-tools fails configure: can't find python?) created by david.w.watson@…
py27-pyside-tools fails configure: can't find python?
11:30 Ticket #31754 (postfix 2.8.6-0 archive fails to install) created by khudson@…
Attempting to install postfix 2.8.6-0 on a 10.6.8 machine fails at the …
10:33 Ticket #31753 (py27-pyqt4 fails configure: error: phonon/videowidget.h: No such file or ...) created by david.w.watson@…
py27-pyqt4 fails configure: can't find python.pro
10:03 Changeset [86365] by mww@…
rsnapshot: whitespace changes; add more checksums
10:01 Changeset [86364] by mww@…
rsnapshot: oops -- forgot to increment revision
09:57 Changeset [86363] by jeremyhu@…
xdpyinfo: Bump to 1.3.0
09:55 Changeset [86362] by jeremyhu@…
sessreg: Bump to 1.0.7
09:54 Changeset [86361] by jeremyhu@…
xterm: Bump to 276
09:34 Changeset [86360] by dluke@…
subversion: version bump (subversion and bindings ports) to 1.7.1
09:33 Changeset [86359] by mww@…
rsnapshot: add license
09:16 Ticket #31752 (kerberos5: clang: error: linker command failed with exit code 1) created by whatdoyouwant@…
kerberos5 won't compile. I've been trying to compile kde4-baseapps and …
08:57 Ticket #31751 (Pidgin 2.9.0 +no_x11 +quartz still uses x11) created by macports.ilsa@…
While pidgin compiles successfully, it uses x11 despite me telling …
08:48 Changeset [86358] by jmr@…
net6: license
08:43 MacPortsDevelopers edited by jmr@…
(diff)
08:43 Ticket #31750 (apache2 +universal is not universal) created by xavier.dagassan@…
Hi, I have a problem when i try to install the package for php 5.2 on my …
08:20 Changeset [86357] by jmr@…
p5-b-hooks-op-check: license
08:17 Changeset [86356] by jmr@…
p5-class-methodmaker: license
08:15 Changeset [86355] by jmr@…
p5-class-returnvalue: license
08:14 Changeset [86354] by jmr@…
p5-class-throwable: license
08:12 Changeset [86353] by jmr@…
p5-crypt-dsa: license
08:12 Changeset [86352] by jmr@…
p5-convert-pem: license
08:11 Changeset [86351] by jmr@…
p5-crypt-des_ede3: license
08:09 Changeset [86350] by jmr@…
p5-convert-asn1: license
08:04 Changeset [86349] by jmr@…
p5-crypt-idea: license
08:02 Changeset [86348] by snc@…
pspp-devel: don't set +x11 or -x11 variant by default
07:59 Changeset [86347] by jmr@…
p5-crypt-rsa: license
07:58 Changeset [86346] by jmr@…
p5-tie-encryptedhash: license
07:57 Changeset [86345] by jmr@…
p5-crypt-cbc: license
07:53 Changeset [86344] by jmr@…
p5-sort-versions: license
07:51 Changeset [86343] by jmr@…
p5-digest-md2: license
07:50 Changeset [86342] by jmr@…
p5-crypt-primes: license
07:46 Changeset [86341] by snc@…
pspp-devel: * update to g0b52ef * default to X11 (seems gtksourceview …
07:46 Changeset [86340] by jmr@…
p5-convert-ascii-armour: license
07:44 Changeset [86339] by jmr@…
p5-class-loader: license
07:42 Changeset [86338] by jmr@…
p5-data-buffer: license
07:40 Changeset [86337] by jmr@…
p5-device-serialport: license
07:38 Changeset [86336] by jmr@…
p5-email-mime-contenttype: license
07:37 Changeset [86335] by jmr@…
p5-email-mime-encodings: license
07:36 Changeset [86334] by jmr@…
p5-expect: license
07:35 Changeset [86333] by jmr@…
p5-io-stty: license
07:30 Changeset [86332] by jmr@…
p5-extutils-f77: license
07:28 Changeset [86331] by jmr@…
p5-gdgraph: license
07:26 Changeset [86330] by jmr@…
p5-gdtextutil: license
07:24 Changeset [86329] by jmr@…
p5-graph: license
07:23 Changeset [86328] by jmr@…
p5-heap: license
07:20 Changeset [86327] by jmr@…
p5-html-mason: license
07:19 Changeset [86326] by jmr@…
p5-cgi: license
07:11 Changeset [86325] by jmr@…
p5-libapreq2: license
07:10 Changeset [86324] by jmr@…
p5-extutils-xsbuilder: license
07:06 Changeset [86323] by jmr@…
mod_perl2: license
07:02 Changeset [86322] by jmr@…
p5-log-any: license
07:02 Ticket #31738 (deluge cannot install universal because libtorrent-rasterbar is not ...) closed by devans@…
fixed: After testing of universal builds and resulting binaries, I see no reason …
07:01 Changeset [86321] by jmr@…
p5-class-container: license
06:57 Changeset [86320] by jmr@…
p5-libxml-enno: license
06:56 Changeset [86319] by jmr@…
p5-parse-yapp: license
06:53 Changeset [86318] by jmr@…
p5-lingua-en-inflect-number: license
06:47 Changeset [86317] by devans@…
libtorrent-rasterbar, libtorrent-rasterbar-devel: enable universal …
06:42 Changeset [86316] by jmr@…
p5-mac-propertylist: license
06:40 Changeset [86315] by jmr@…
p5-mail-pop3client: license
06:38 Changeset [86314] by jmr@…
p5-mime-charset: license
06:37 Changeset [86313] by jmr@…
p5-mldbm: license
06:35 Changeset [86312] by jmr@…
p5-mp3-info: license
06:33 Changeset [86311] by jmr@…
p5-perl-tidy: license
06:20 Ticket #27805 (openconnect @2.25_1 gconf is not necessary to build the port) closed by ryandesign@…
fixed: Dealt with by updating the port; see #31237.
06:19 Ticket #31237 (openconnect new version 3.12 - portfile update) closed by ryandesign@…
fixed: I applied the patch in r86308. Also added libproxy dependency, and changed …
06:18 Changeset [86310] by ryandesign@…
openconnect: remove unused patchfile
06:18 Changeset [86309] by yeled@…
this supports IPv6 and works on Lion
06:17 Changeset [86308] by ryandesign@…
openconnect: update to 3.12; see #31237
05:54 Changeset [86307] by mww@…
autogen: whitespace changes only
05:53 Changeset [86306] by easieste@…
abcl-1.0.0 released at ECLM 2011 Amsterdam.
05:46 Ticket #27670 (xgsch2pcb: python module pygtk is required) closed by jmr@…
fixed: No response; assuming fixed.
05:34 Ticket #31749 ([Port Abandoned] boxes) closed by ryandesign@…
fixed: Thanks for letting us know. r86305.
05:34 Changeset [86305] by ryandesign@…
boxes: nomaintainer; see #31749
05:28 Changeset [86304] by jmr@…
xmlpatch: add pkgconfig dep
05:26 Changeset [86303] by ryandesign@…
rewrite master_sites to avoid redirects
05:19 Changeset [86302] by devans@…
libgnome: add build dependencies.
05:17 Ticket #27647 (python32: undefined symbols ___moddi3 ___divdi3) closed by jmr@…
fixed
05:11 Changeset [86301] by ryandesign@…
mod_mono: add pkgconfig dep
05:10 Ticket #27634 (Build of gengetopt-2.22.4 fails with source-highlight installed) closed by jmr@…
fixed: r86300
05:10 Changeset [86300] by jmr@…
gengetopt: disable use of source-highlight (#27634)
05:06 Changeset [86299] by ryandesign@…
fsharp: noarch
05:03 Changeset [86298] by ryandesign@…
gecko-sharp: disable universal variant; use port:-style dependencies
05:02 Changeset [86297] by ryandesign@…
gnome-sharp2: disable universal variant
05:01 Changeset [86296] by ryandesign@…
gtk-sharp2: disable universal variant
05:01 Changeset [86295] by ryandesign@…
gtk-sharp: disable universal variant
05:00 Ticket #31611 (qt4-mac @4.7.4_0+debug+quartz fails to leave debug symbols in the ...) closed by michaelld@…
fixed: Yes, you do need to -k(eep) the source when using dwarf2 symbols; see < …
04:59 Changeset [86294] by ryandesign@…
pgsqlclient: use port:-style dependency for mono
04:58 Changeset [86293] by ryandesign@…
ndesk-dbus: disable universal variant
04:57 Changeset [86292] by ryandesign@…
mono-basic: explain why universal variant is disabled
04:56 Changeset [86291] by ryandesign@…
mono-addins: disable universal variant
04:55 Changeset [86290] by ryandesign@…
mod_mono: disable universal variant
04:54 Changeset [86289] by ryandesign@…
gecko-sharp2: disable universal variant
04:53 Changeset [86288] by ryandesign@…
dbus-glib-sharp: disable universal variant
04:53 Changeset [86287] by ryandesign@…
dbus-sharp: disable universal variant
04:52 Changeset [86286] by ryandesign@…
cocoa-sharp: use port:-style dependency for mono; disable universal …
04:40 Ticket #31749 ([Port Abandoned] boxes) created by wgrzemski@…
Hello, please do take over maintenance of boxes. It has been a long …
04:36 Changeset [86285] by ryandesign@…
xsp: disable universal variant
04:23 Ticket #27632 (rb-daemons 1.1.0_0 install failure) closed by jmr@…
worksforme: Can't reproduce. Could have been fixed by a ruby update.
04:17 Changeset [86284] by ryandesign@…
autopsy: rewrite master_sites to avoid redirects; fix livecheck
04:11 Changeset [86283] by ryandesign@…
avarice: update to 2.11, fix livecheck, rewrite master_sites to avoid …
04:04 Changeset [86282] by ryandesign@…
phpmyadmin: update to 3.4.7
03:55 Ticket #31189 (wireshark-devel: update to 1.6.2 (security issues fixed)) closed by ryandesign@…
fixed: Updated to 1.6.2 in r86281. #29968 can be dealt with later.
03:54 Changeset [86281] by ryandesign@…
wireshark-devel: update to 1.6.2; see #31189
03:47 Changeset [86280] by and.damore@…
port repo: updated executable to make it work with new Android repository …
03:25 Ticket #30230 (wireshark-devel: update to 1.6.1) closed by ryandesign@…
duplicate: Superseded by #31189.
03:18 Changeset [86279] by ryandesign@…
rewrite master_sites to avoid redirects
03:07 Ticket #31748 (gtkwave @ 3.3.15: fails to build on Mac OS X Lion with Xcode 4.2 (clang) ...) created by Torsten.Maehne@…
The current version 3.3.15 of gtkwave available in MacPorts fails to build …
02:52 Changeset [86278] by ryandesign@…
p5-gtk2: update to 1.240
02:51 Ticket #27616 (erlang @R14A build failure - 'TRAP' undeclared) closed by jmr@…
worksforme: Closing as per comment:12.
02:48 Ticket #27600 (atlas takes a long time to build) closed by jmr@…
wontfix: Later comments in this ticket have nothing to do with the description …
02:46 Changeset [86277] by ryandesign@…
p5-cairo: update to 1.081
02:45 Changeset [86276] by ryandesign@…
p5-glib: update to 1.240
02:41 Changeset [86275] by ryandesign@…
p5-extutils-depends: update to 0.304; switch to CPAN hosting
02:36 Changeset [86274] by ryandesign@…
rewrite master_sites to avoid redirects
02:33 Changeset [86273] by jmr@…
postfix: update to 2.8.6
02:07 Ticket #31747 (SQLite3 + libedit: ESC + Backspace behaves wrong) created by elzhov@…
In the past, the sequent typing of ESC and Backspace deleted the last …
01:52 Ticket #31746 (icewm: error: use of undeclared identifier 'getItem') created by pf15@…
Hi, OS MacOS 10.7.2 Xcode 4.2 See the attached log …
01:37 Changeset [86272] by easieste@…
Update SLIME to 20111022
01:35 Ticket #31745 (ipe-tools: Please update pdftoipe to version 20110916 and apply patch for ...) created by Torsten.Maehne@…
The ipe-tools port fails currently to build due to a compiler error in …
01:29 Changeset [86271] by stromnov@…
py-regex: update to version 0.1.20111014
01:21 Changeset [86270] by mww@…
autogen: add license
01:15 Changeset [86269] by stromnov@…
py-amqplib: update to version 1.0.2
01:09 Ticket #31744 (libdevil: error: invalid argument '-std=gnu99' not allowed with ...) created by spam@…
I received my new iMac. Installed macports 2.0.3 […] here is the …

10/23/11:

23:14 Changeset [86268] by ryandesign@…
zsh: rewrite master_sites to avoid redirects
23:13 Changeset [86267] by ryandesign@…
graphviz-devel, graphviz-gui-devel, gvedit-devel: update to …
22:03 Changeset [86266] by ryandesign@…
py-crypto: ensure we're UsingTheRightCompiler
21:51 Ticket #31615 (wireshark: Segmentation fault: 11) reopened by ricci@…
reverted in r86265 as it breaks on the svn server.
21:50 Changeset [86265] by ricci@…
revert r86264, it breaks on the MP version on the svn server.
21:47 Ticket #31615 (wireshark: Segmentation fault: 11) closed by ricci@…
fixed: Fixed in r86264 by adding 'configure.compiler=llvm-gcc-4.2' for Lion.
21:46 Changeset [86264] by ricci@…
wireshark: on Lion (platform darwin 10), use llvm-gcc-4.2 as the compiler …
21:37 Ticket #31743 (Case of (sub)port names needs to be canonicalized before use) created by ryandesign@…
Ports should be recorded in the registry (and display status messages and …
20:38 Changeset [86263] by rmstonecipher@…
audio/mpd upgraded version from 0.16.3 to 0.16.5
20:38 Changeset [86262] by rmstonecipher@…
x11/sawfish fixed broken livecheck
20:33 Changeset [86261] by rmstonecipher@…
net/pidgin fixed non-working livecheck
20:20 Ticket #31742 (librsync doesn't correctly export inlined functions when compiled with ...) created by mzch@…
rdiff-backup can successfully be built and installed, but doesn't work. …
20:12 Changeset [86260] by ryandesign@…
pngcrush: rewrite master_sites to avoid redirects
20:08 Changeset [86259] by rmstonecipher@…
audio/audiofile, downgraded to 0.2.7 due to issue with 3.x headers, …
20:01 Changeset [86258] by ryandesign@…
deluge is noarch; see #31738
19:51 Changeset [86257] by ryandesign@…
wxWidgets-devel: explain why deployment target is set to 10.6 on Lion
18:18 Changeset [86256] by adfernandes@…
py-mpi4py : better error checking (no errors thrown in body of port)
18:12 Changeset [86255] by adfernandes@…
revbump due to commit r86254
18:10 Changeset [86254] by adfernandes@…
cloog: remove unneeded configure.args for ppl
17:32 Ticket #29398 (transmission: cannot find protocol declaration for 'NSNetServiceDelegate') closed by ryandesign@…
wontfix: r86253
17:32 Changeset [86253] by ryandesign@…
transmission: building requires 10.7 or later; see #29398
17:30 Ticket #31731 (transmission: cannot find protocol declaration for 'NSPopoverDelegate') closed by ryandesign@…
duplicate: I'll handle this in #29398.
16:30 Ticket #31741 (py-crypto doesn't allow multiple versioned module installs) closed by ram@…
fixed: Thanks, patch committed in r86252
16:30 Changeset [86252] by ram@…
python/py-crypto: install docs in subport directory, closes #31741
16:18 Ticket #31741 (py-crypto doesn't allow multiple versioned module installs) created by blb@…
The unified py-crypto installs docs under just ${name} instead of …
15:46 Changeset [86251] by mmoll@…
py-shiboken: version bump
15:40 Ticket #31740 (tftp-hpa: use notes instead of ui_msg) created by ryandesign@…
tftp-hpa should use the notes feature instead of manually printing …
15:34 Changeset [86250] by ryandesign@…
xmlpatch: fix typo in long description; move depends_build above …
15:32 Ticket #31733 (xmlpatch @0.3.3 Initial submission) closed by ryandesign@…
fixed: Committed in r86249 with these changes: * Instead of setting distfiles …
15:32 Changeset [86249] by ryandesign@…
xmlpatch: new port, version 0.3.3; see #31733
14:26 Ticket #31739 (AppKiDo: upgrade to 0.986sp4, fetch from git) created by michael.klein@…
AppKiDo is currently at 0.986sp4, also sources have moved to git
14:26 Changeset [86248] by ryandesign@…
deluge: disable universal variant; see #31738
13:58 ram edited by ram@…
(diff)
13:49 Ticket #31735 (unify py*crypto and update to 2.4) closed by ram@…
fixed: Patches commited in r86246 and r86247.
13:48 Changeset [86247] by ram@…
py-crypto: update to 2.4, add python31 and python32 versions
13:48 Changeset [86246] by ram@…
python/py*-crypto: unify
13:42 Ticket #31376 (Failed configuring ppl) closed by adfernandes@…
fixed: I've refactored ppl and cloog in recent checkins - I believe, given your …
13:37 Ticket #31675 (Problems finding symbols in mpi4py) closed by adfernandes@…
fixed: I cannot install nor test mpich2 because all my tools are …
13:32 Ticket #29367 (py27-cx_Freeze does not actually create universal) closed by adfernandes@…
wontfix: I refactored cx_Freeze into a subport, but still can't reproduce. …
13:32 Changeset [86245] by adfernandes@…
py-cx_Freeze: refactored into subport, still can't diagnose …
13:04 Changeset [86244] by adfernandes@…
py-mpi4py : forgot to bump revision
13:04 Changeset [86243] by adfernandes@…
py-mpi4py : consolidated into subport system, made openmpi the default …
12:47 Changeset [86242] by ciserlohn@…
parallel: update to version 20111022 - use ${prefix}/bin/perl instead of …
12:46 Changeset [86241] by adfernandes@…
devel/cloog : updated to latest, removes dependency on devel/ppl
12:45 Ticket #31689 (Boost 1.47 won't compile when the 'go' port is installed) closed by adfernandes@…
duplicate: Duplicate of #30203.
12:34 Changeset [86240] by adfernandes@…
math/glpk : trivial version bump to 4.47
12:29 Ticket #30414 (ppl, cloog: error: C compiler cannot create executables) closed by adfernandes@…
fixed
12:29 Changeset [86239] by adfernandes@…
devel/ppl: use -mtune=native for universal builds only with more recent …
12:24 Ticket #31738 (deluge cannot install universal because libtorrent-rasterbar is not ...) created by cmays2315@…
I've tried off and on for a few months now to install Deluge 1.3.3 on my …
11:24 Ticket #31737 (tftp-hpa: Starting and stopping seems flaky) created by kimmo.sundqvist@…
I installed tftp-hpa +server and it started automatically. I see it has …
11:21 Ticket #31736 (gcc44, gcc45 precompiled headers broken on lion) created by spolitov@…
OS: Mac OS X 10.7.2 (Lion), Xcode: 4.2 When I try to use precompiled …
10:56 Changeset [86238] by pixilla@…
sysutils/timespan: - Update to version 2.2.
10:38 Changeset [86237] by devans@…
avahi: patch configure to correctly set PYTHON_PREFIX, PYTHON_EXEC_PREFIX …
09:33 Changeset [86236] by ram@…
python/py-matplotlib: fix livecheck
09:27 Ticket #31735 (unify py*crypto and update to 2.4) created by ram@…
The attached patches unify the existing py*-crypto into a new unified port …
09:27 Ticket #31726 (dialog: update to 20111020) closed by jwa@…
fixed: done in r86235
09:24 Changeset [86235] by jwa@…
version bump to 20111020, closes #31726
09:21 Ticket #31732 (mecab-base: mecab is being used by the active mecab port) closed by hum@…
fixed: Thank you for your pointing out, and I owe you a lot! I committed in …
09:05 Changeset [86234] by hum@…
mecab: try to install the corresponding port to a deprecated variant in …
09:01 Changeset [86233] by hum@…
mecab-base: deactivate any old mecab port before activating; see #31732.
07:30 Ticket #31734 (VirtualBox 4.1.6 doesn't work with Lion and Xcode 4.2) created by jk@…
Virtualbox is unable to find libvncserver. Reinstalling LibVNCServer …
06:50 Ticket #31733 (xmlpatch @0.3.3 Initial submission) created by twic@…
I have put together a port for the xmlpatch library: …
05:24 Ticket #31721 (svndigest 0.9.4) closed by ryandesign@…
fixed: Committed in r86232 with a couple changes.
05:24 Changeset [86232] by ryandesign@…
svndigest: maintainer update to 0.9.4; see #31721
05:21 Ticket #31723 (add Gifshuffle) closed by ryandesign@…
fixed: r86231
05:21 Changeset [86231] by ryandesign@…
gifshuffle: new port, version 2.0; see #31723
04:30 Ticket #31732 (mecab-base: mecab is being used by the active mecab port) created by ryandesign@…
Upgrading from mecab 0.98_0 to 0.98_1 is problematic: […] Looks like …
04:15 Ticket #31731 (transmission: cannot find protocol declaration for 'NSPopoverDelegate') created by ryandesign@…
I have transmission 2.33 installed on Snow Leopard with Xcode 3.2.6 but I …
04:11 Changeset [86230] by ryandesign@…
wine-devel: update to 1.3.31
00:35 Ticket #31730 (opendx: running opendx only shows error boxes) created by thimo@…
I've installed opendx on my Lion machine. When I start it everything seems …
00:09 Ticket #31729 (kdepimlibs4 @4.7.2: configure fails to find Soprano & Nepomuk) created by kk1987@…
kdepimlibs4 fails to configure with: […] (please refer to attached …

10/22/11:

21:24 Changeset [86229] by takeshi@…
fgsl: updated for 0.9.4. Set cc. Use HTML doc
20:18 Changeset [86228] by takeshi@…
cdo: updated for 1.5.3
19:58 Ticket #31728 (fuse4x: update to 0.8.13) created by anatol.pomozov@…
Subj!
18:49 Ticket #31727 (weechat: update to 0.3.6) created by nefar@…
[…]
15:54 Ticket #31726 (dialog: update to 20111020) created by vaa@…
dev/dialog - 1.1-20111018 is buggy - base funcionality is not work - …
15:47 Ticket #31716 (LIBXML2 - multiple versions on my Mac) closed by ryandesign@…
invalid: Great, so as suspected, you don't have MacPorts php installed. Install it …
15:44 Ticket #31725 (apiextractor @0.10.8 (devel) uses ...) created by litzomatic@…
This seems like it's due to CMAKE, and I can't seem to get it working with …
15:37 Ticket #31715 (failed to build latexml) closed by ryandesign@…
invalid
15:20 Ticket #31719 (opencv: error: non-const static data member must be initialized out of ...) closed by ryandesign@…
duplicate: Duplicate of #30693.
15:20 Ticket #31686 (opencv: error: non-const static data member must be initialized out of ...) closed by ryandesign@…
duplicate: Duplicate of #30693.
15:20 Ticket #31602 (opencv: error: non-const static data member must be initialized out of ...) closed by ryandesign@…
duplicate
13:26 Ticket #30309 (geos @3.3.0: Undefined symbols ...) closed by ryandesign@…
fixed
12:54 Ticket #31724 (New Port(?): gtk-mac-integration) created by royliu@…
On my way to fixing another bug, I've had to introduce a new(?) port, …
11:12 Ticket #31723 (add Gifshuffle) created by fyodor.vassiley@…
GIF colourmap steganography The program gifshuffle is used to conceal …
10:30 Ticket #31722 (gimp2 now depends on aspell (via enchant) which conflicts with ispell) created by scrutarius@…
Apparently gettext @0.18.1.1 now depends on aspell. Now I am sure there …
10:02 Ticket #31721 (svndigest 0.9.4) created by pj31042@…
New version released.
09:58 Ticket #31720 (python27: Segmentation fault during build) created by tioguerra@…
See the attached log file. I got lots of warnings, starting with some …
09:38 Changeset [86227] by devans@…
gnome-applets: patch configure to correctly set PYTHON_PREFIX and …
09:37 Ticket #31719 (opencv: error: non-const static data member must be initialized out of ...) created by jens.is.located@…
Hi, opencv fails to build with the following error and error log: …
08:26 Ticket #31701 (Mac Lion py26-game build error) closed by jmr@…
fixed: Committed in r86226.
08:23 Changeset [86226] by jmr@…
py-game: fix build with clang (#31701)
07:23 howto/SetupXymonServer edited by fclaire@…
(diff)
07:15 Ticket #31718 (Xymon update to v4.3.5) created by fclaire@…
Please find attached the Portfile patches for Xymon version 4.3.5 (port …
06:02 Ticket #31717 (postgresql91 segfaults on OS X 10.7 when built with clang) created by francis@…
== Steps to reproduce: == 1. On OS X 10.7.1 or 10.7.2 install Xcode 4.2 …
05:45 Ticket #31716 (LIBXML2 - multiple versions on my Mac) created by sexonthedex@…
Hi I have been using Macports to keep all my software up-to-date, but …
04:55 Changeset [86225] by ciserlohn@…
nodejs-devel: update to version 0.5.10
04:43 Ticket #31715 (failed to build latexml) created by hcastorp@…
Got the following error message: […]
03:18 Ticket #31714 (sbcl 1.0.51 doesn't build on 10.7.2) created by Martin.Buchmann@…
Hi all, I just upgrade to Lion from Snow Leopard. I uninstalled all my …
03:16 Ticket #22094 (kstars buitl without indi interface?) closed by nicos@…
fixed: The support for indi has been added (in a variant) to the kstars port in …
03:11 Changeset [86224] by nicos@…
kstars: adding indi support in a variant (ticket #22094)
01:33 Ticket #31389 (hexfiend change from svn to tarball) closed by ryandesign@…
fixed: Replying to and.damore@…: > I'm attaching a diff that …
01:33 Changeset [86223] by ryandesign@…
hexfiend: update to 2.0, now fetching from distfile instead of svn …
01:06 Ticket #29692 (SVN checkout fails for netpbm) closed by ryandesign@…
invalid: The idea expressed here that changing netpbm's fetch from https to http …
00:34 Ticket #31713 (honeyd @1.5c fails to build against libevent 2.x) created by zzzee.me@…
honeyd fails to build on mac os x 10.6.8 giving error […] log : …

10/21/11:

23:52 Changeset [86222] by hum@…
mecab-jumandic-eucjp: modify obsolete error message according to Portfile …
23:51 Changeset [86221] by hum@…
mecab-ipadic*: add mecab-ipadic for eucjp; obsolete mecab-ipadic-eucjp; …
23:28 Changeset [86220] by devans@…
alacarte: correct patch-configure.diff to correctly configure Python paths …
22:52 Changeset [86219] by hum@…
erase sandbox for mecab; see r86218.
22:40 Ticket #31540 (Enhance mecab family) closed by hum@…
fixed: Committed in r86218 (maintainer timeout). Let me know if you have any …
22:36 Changeset [86218] by hum@…
mecab, mecab-sjis, mecab-utf8, mecab-base, mecab-ipadic*, mecab-jumandic*, …
21:53 Ticket #31712 (cairo, cairo-devel: build on Lion for previous SDKs fails) created by spolitov@…
Cairo port introduces patch when building on Mac OS X Lion. The patch …
21:16 Ticket #31711 (py26-twisted build fails on Lion / Xcode 4.2) created by dizel@…
[…]
19:34 Changeset [86217] by hum@…
mecab-naist-jdic*: update to 0.6.3b-20111013.
19:32 Ticket #31543 (livecheck and maintainership of tinycdb) closed by hum@…
fixed: Committed in r86216 (maintainer timeout).
19:30 Changeset [86216] by hum@…
tinycdb: add livecheck; take joint maintainership; see #31543.
17:31 Changeset [86215] by ryandesign@…
metasploit3: simplify: distfiles + worksrcdir => distname
16:19 PortfileRecipes edited by ryandesign@…
set configure.cxx when depending on apple-gcc42 to work around #31709 (diff)
16:00 Ticket #31710 (obby 0.4.7_0 fails to build with clang) created by alkobottle@…
building error in obby-0.4.7_0, error message: […] Attached the logfile
15:58 Changeset [86214] by ryandesign@…
geos: set configure.cxx to work around MacPorts base bug; see #30309
15:33 Ticket #31709 (configure.compiler apple-gcc40 and apple-gcc42 don't set configure.cxx) created by ryandesign@…
When you set configure.compiler to apple-gcc40 or apple-gcc42, …
15:25 Changeset [86213] by ryandesign@…
portfile-phase.xml: update the list of default compilers
15:17 Ticket #29392 (metasploit3: checksum mismatch) closed by ryandesign@…
fixed: I've just received the reply that they've fixed their server. Their …
15:14 Changeset [86212] by ryandesign@…
metasploit3: update commented-out master_sites location to match upstream …
15:08 Changeset [86211] by ryandesign@…
portfile-phase.xml: remove reference to compilers apple-gcc-3.3, …
15:05 Changeset [86210] by ryandesign@…
portconfigure.tcl: remove apple-gcc-3.3 compiler option; the apple-gcc33 …
14:28 Ticket #31705 (calcurse: update to 2.9.2) closed by ryandesign@…
fixed: Committed in r86209. with these changes: * kept the whitespace …
14:27 Changeset [86209] by ryandesign@…
calcurse: update to 2.9.2; new maintainer; license; #31705
14:26 Ticket #31708 (Subversion with serf: qop="auth" authentication not supported) created by ryandesign@…
I'm using MacPorts Subversion 1.6.17 to commit to the MacPorts Subversion …
14:09 Ticket #31707 (redland: No rule to make target -lltdl) created by pf15@…
Hi, I am using MacOs 10.7 and Xcode 4.2. I am trying to …
14:02 Ticket #31704 (Install of mp4v2 failed: "Error: Status 1 encountered during processing") closed by ryandesign@…
duplicate: Duplicate of #31547.
13:41 Ticket #31706 (xtermcontrol port submission) created by michael.klein@…
Enables Dynamic Control of XFree86 xterm Properties xtermcontrol makes it …
13:15 Ticket #31705 (calcurse: update to 2.9.2) created by michael.klein@…
I also volunteer to adopt this currently unmaintained port
11:55 Ticket #31704 (Install of mp4v2 failed: "Error: Status 1 encountered during processing") created by jens.is.located@…
Hi, mp4v2 installation failed with the following error message. See log …
11:52 Ticket #31664 (g95 configure build failure with OSX Lion and Xcode 4.2) closed by takeshi@…
fixed: fixed in r86208. Thanks.
11:51 Changeset [86208] by takeshi@…
g95: does not build with clang. force llvm-gcc-4.2. fixes #31664
11:15 Changeset [86207] by ciserlohn@…
fossil: update to version 1.20; don't try to install files which have been …
10:26 Changeset [86206] by ciserlohn@…
npm: update to version 1.0.101
09:22 Ticket #31703 (gimp2 +quartz build fails at plugin file-uri looking for gtk2 x11) created by fleason@…
Currently gimp2 @2.6.11_7+help_browser+python27 (active). Wanted to …
09:02 Ticket #31702 (port select fails if symlink already exists from earlier installation) created by gunnlaugur@…
This command: […] is failing with the output: […] The timestamp …
08:58 Changeset [86205] by krischik@…
Update to android sdk 14.
08:54 Changeset [86204] by krischik@…
Add distfile for android
08:53 Changeset [86203] by krischik@…
New Startup bundles for android.
08:16 Changeset [86202] by royliu@…
transmission: upgrade to 2.42
07:21 Changeset [86201] by mmoll@…
pyside toolchain: version bump
06:20 Ticket #31701 (Mac Lion py26-game build error) created by melb-roscoe@…
Any help greatly appreciated with, from what i can tell from hours of …
04:14 Ticket #31678 (gst-plugins-base @0.10.35 build failure) closed by ryandesign@…
fixed: libidl was updated in r85340, jasper in r86141, and libtheora in r86199. …
04:08 Ticket #31682 (libvorbis: use unversioned docdir) closed by ryandesign@…
fixed: r86200.
04:08 Changeset [86200] by ryandesign@…
libvorbis: use an unversioned docdir; see #31682
04:01 Ticket #31681 (libogg, libtheora: remove doc variant) closed by ryandesign@…
fixed: Fixed libtheora in r86199.
04:00 Changeset [86199] by ryandesign@…
libtheora: remove doc variant and instead always install documentation, …
03:51 Changeset [86198] by ryandesign@…
libogg: remove doc variant and instead always install documentation, and …
03:28 Ticket #31700 (geos: update to 3.3.1) created by ryandesign@…
geos should probably be updated to 3.3.1.
02:59 Changeset [86197] by jmr@…
always mention port name in verbose output of …
02:20 Ticket #23561 (apache2, apache20: envvars should not be registered to port) closed by ryandesign@…
fixed: Fixed in r86196.
02:19 Ticket #22371 (apache2 owns /opt/local/apache2/htdocs/index.html) closed by ryandesign@…
fixed: Fixed in r86196.
02:19 Ticket #30566 (apache2: libtool: compile: unable to infer tagged configuration) closed by ryandesign@…
fixed: Fixed in r86196.
02:17 Changeset [86196] by ryandesign@…
apache2: * fix build error "unable to infer tagged configuration" …
02:10 Ticket #23418 (apache2 +openldap trouble) closed by ryandesign@…
worksforme: No response; assuming the user fixed it using the above instructions.
01:15 Ticket #24994 (php52: apache2 +preforkmpm depdency test fails when apache modules ...) closed by ryandesign@…
invalid: Replying to info@…: > > > How does one compile MacPorts …
01:14 Ticket #29555 (Apache2 2.2.19 Checksum error) closed by ryandesign@…
fixed: I believe this got resolved.
01:08 Changeset [86195] by ryandesign@…
SSHKeychain: update homepage and source fetching to use SourceForge since …

10/20/11:

23:32 Changeset [86194] by dports@…
fuse4x*: fix livecheck
20:49 Ticket #31699 (subversion: enable libmagic support) created by ryandesign@…
Subversion 1.7 adds a new feature where it can use libmagic to guess file …
20:07 Changeset [86193] by ryandesign@…
wxWidgets-devel: fix universal build on non-Lion; simplify getting …
16:38 Ticket #31698 (erlang @R14B04 build hangs in Lion, in beam.smp, no cpu usage) created by gunnlaugur@…
The erlang build seems to be hung indefinitely, in a fresh macports on a …
16:18 Changeset [86192] by cal@…
www/nginx: Update to 1.0.8 (openmaintainer)
16:13 Changeset [86191] by cal@…
www/nginx: Fix livecheck
15:59 Changeset [86190] by nicos@…
djview: correcting license syntax
15:51 Changeset [86189] by mww@…
abcMIDI: version 2011-10-19
15:07 nicos edited by nicos@…
(diff)
15:00 Changeset [86188] by devans@…
empathy: add license.
14:13 Ticket #31697 (python25 @2.5.6 build fails with subversion 1.7 installed) created by gunnlaugur@…
python25 build fails on a fresh Lion/Xcode 4.2 setup (new MacBook Pro, …
14:07 Changeset [86187] by devans@…
qjackctl: fix typo in maintainer.
14:06 Changeset [86186] by devans@…
qjackctl: add license, relinquish maintainership.
13:47 Ticket #31696 (kerberos5: linker command failed with exit code 1) created by pf15@…
I don't know if it's really a bug but here's my problem : I began to …[…]
13:45 Changeset [86185] by dluke@…
p5-fcgi: version bump, update to 0.74
13:41 Changeset [86184] by devans@…
dbus-python2[456]: add license to match dbus-python27.
13:36 Changeset [86183] by blair@…
keychain: use MacPorts' ssh-agent if it is installed.
13:33 Ticket #30744 (apache2: unable to infer tagged configuration) closed by ryandesign@…
duplicate: Duplicate of #30566.
13:29 Changeset [86182] by blair@…
keychain: update to 2.7.1.
13:29 Ticket #31687 (apache2 fails to build) closed by ryandesign@…
duplicate: Duplicate of #30744.
13:23 Ticket #31695 (xorg-libxcb @1.7_0+python26 Nested evaluations (infinite loop?)) created by kurt.heumiller@…
Running SnowLeopard, upgraded XCode and reinstalled latest version of …
13:21 Changeset [86181] by devans@…
py27-atspi: new port based on py26-atspi.
13:14 Changeset [86180] by devans@…
py26-atspi: add license, remove redundant dependency on python26.
13:14 Ticket #31691 (Memory leak during compile - osX10.7.2 - xcode 4.2 - port 2.0.3) closed by ryandesign@…
duplicate: Duplicate of #31604.
10:46 Changeset [86179] by ciserlohn@…
npm: update to version 1.0.100
08:48 Changeset [86178] by devans@…
upnp-inspector: add variants python26, python27, default python27, add …
08:46 Changeset [86177] by devans@…
coherence: add variants python26, python27, default python27, add license, …
08:43 Ticket #31694 (gcc44 +universal fails at building java compiler) created by david.w.watson@…
gcc44 build fails at building java compiler
08:26 Ticket #31693 (py27-pyqt4 destroot fails: libpythonplugin.dylib: no such file or ...) created by david.w.watson@…
py27-pyqt4 install in destroot fails with: {{{Error: Target …
08:21 Changeset [86176] by nicos@…
djview: adding license, taking port as nomaintainer
08:16 Ticket #31692 (Generating the MacPorts Guide as PDF) created by ak.ml@…
It would be nice to have this reference as a PDF document. I've …
08:02 Changeset [86175] by jmr@…
mpab: log reasons for archives not being distributable
07:54 Changeset [86174] by jwa@…
version bump to 20111018
07:41 Changeset [86173] by eborisch@…
py-sip: Add PSF-like license and notice.
07:28 Changeset [86172] by jmr@…
mpd: use add_users
07:27 Changeset [86171] by ram@…
science/lalapps: build using correct python
07:27 Changeset [86170] by ram@…
science/lalstochastic: build using correct python (no rev-bump as build …
07:25 Changeset [86169] by ram@…
science/lalpulsar: build using correct python (no rev-bump as build …
07:24 Changeset [86168] by ram@…
science/lalinspiral: build using correct python (no rev-bump as build …
07:23 Changeset [86167] by ram@…
science/lalburst: build using correct python (no rev-bump as build …
07:22 Changeset [86166] by ram@…
science/lalxml: build using correct python (no rev-bump as build product …
07:22 Changeset [86165] by ram@…
science/lalmetaio: build using correct python (no rev-bump as build …
07:21 Changeset [86164] by ram@…
science/lalframe: build using correct python (no rev-bump as build …
07:18 Changeset [86163] by ram@…
science/lal: build using correct python (no rev-bump as build product …
07:14 Ticket #27562 (mathomatic @15.0.4 Please update to latest version) closed by jmr@…
fixed: This was updated in r83914.
07:00 Ticket #31691 (Memory leak during compile - osX10.7.2 - xcode 4.2 - port 2.0.3) created by thrabe@…
Hi all, I found a memory leak during compilation on the afore mentioned …
06:04 Changeset [86162] by nicos@…
kstars: replacing no_x11 variant with x11, as no_ variants are deprecated
05:19 Ticket #31690 (ardour2: can't find MIDI library and FFTW) created by drmoriarty.0@…
The file …
04:54 Ticket #31689 (Boost 1.47 won't compile when the 'go' port is installed) created by akim.demaille@…
On neither this machine (Lion), nor the other at work (Snow Leopard) the …
03:52 Ticket #31688 (bind9 @9.8.1: Undefined symbols _krb5_gss_register_acceptor_identity on ...) created by webmaster@…
Hello, my 1st time here, so excuse me if the question is dumb :) I did …
02:20 Ticket #31687 (apache2 fails to build) created by conradwt@…
The apache2 port (i.e. Apache 2.2.21) fails to build on lion. I have …
01:48 Changeset [86161] by jmr@…
rlwrap: rev bump to ensure linking against macports ncurses, see #27500
01:24 Ticket #31686 (opencv: error: non-const static data member must be initialized out of ...) created by genegraphy@…
[…]
01:15 Changeset [86160] by devans@…
sofia-sip: add license.
01:06 Changeset [86159] by and.damore@…
port wxwidgets-devel: removed hardcoded cpp, using the right one selected …
01:02 Changeset [86158] by and.damore@…
gmp: fixed typo
00:12 Ticket #31680 (xemacs- build failed on 10.7.2 & xcode 4.2) closed by ryandesign@…
duplicate: Duplicate of #31679.
Note: See TracTimeline for information about the timeline view.