New Ticket     Tickets     Wiki     Browse Source     Timeline     Roadmap     Ticket Reports     Search

Timeline


and

11/24/11:

23:58 Ticket #32253 (ld64@85.2.1 Unable to verify file checksums) created by desmond_toa@…
[…]
22:23 Ticket #32215 (ledger build fails with clang) closed by ryandesign@…
fixed: Thanks. r87548.
22:23 Changeset [87548] by ryandesign@…
ledger: use llvm-gcc-4.2 instead of clang; see #32215
22:20 Changeset [87547] by ryandesign@…
unison: avoid error 'library not found for -lstr' when building +aqua …
22:09 Ticket #32252 (unison fails to build) closed by ryandesign@…
duplicate: Duplicate of #25981.
22:08 Ticket #28028 (unison 2.40.61 upgrade proposal) closed by ryandesign@…
fixed: r87546.
22:07 Changeset [87546] by ryandesign@…
unison: update to 2.40.63; see #28028
21:51 Ticket #32250 (firefox-x11, firefox-x11-devel, and gcc-4.2) closed by ryandesign@…
invalid: Oh. So the problem would only be with gcc-4.2 on Leopard, where gcc-4.0 is …
21:26 Ticket #32252 (unison fails to build) created by vishketan@…
[…]
21:19 Ticket #31173 (net-snmp @5.7 "Cannot find module (SNMPv2-SMI)" noise) closed by ryandesign@…
fixed
21:18 Ticket #32167 (p5-test-simple: update to 0.98) closed by ryandesign@…
fixed: Updated to 0.98 in r87544 and reformatted in r87545.
21:18 Changeset [87545] by ryandesign@…
p5-test-simple: whitespace changes / reformatting / add modeline; see …
21:17 Changeset [87544] by ryandesign@…
p5-test-simple: update to 0.98; see #32167
20:52 Ticket #32251 (MyPaint needs to be updated to python 2.7) created by ryandesign@…
http://build.macports.org/builders/buildports-snowleopard-x86_64/builds/328
20:10 Ticket #32250 (firefox-x11, firefox-x11-devel, and gcc-4.2) created by ryandesign@…
The firefox-x11 portfile contains this block: […] It says gcc-4.2 has …
20:04 Changeset [87543] by ryandesign@…
MyPaint: update to 1.0.0
20:02 Changeset [87542] by ryandesign@…
hicolor-icon-theme: whitespace changes / reformatting
19:00 Ticket #32249 (clutter: update to 1.8.2) created by ryandesign@…
clutter should probably be updated to 1.8.2. Maybe this would fix #32217.
18:57 Ticket #32248 (json-glib: update to 0.14.2) created by ryandesign@…
Here is a patch attempting to update json-glib to 0.14.2. It doesn't build …
18:43 Ticket #32247 (gobject-introspection: update to 1.30.0) created by ryandesign@…
Any reason why we shouldn't update gobject-introspection to 1.30.0? It …
18:37 Ticket #28472 (gobject-introspection should be using ${configure.cc}) closed by ryandesign@…
fixed: r87541
18:37 Changeset [87541] by ryandesign@…
gobject-introspection: update to 0.10.8; ensure we're …
18:17 Ticket #32232 (Failed Initialization and Failed port extract) closed by ryandesign@…
invalid: File a new ticket about glib2, if none of the existing tickets about glib2 …
17:41 Ticket #32246 (fossil needs readline dependency) created by ryandesign@…
fossil links with readline but does not declare a dependency on it. …
17:33 Ticket #32234 (poppler build fails because pango is not compatible with glib 2.30.2) closed by ryandesign@…
duplicate: Please use WikiFormatting. Thanks for the main.log. That confirms this is …
17:20 Ticket #32244 (upgrade gtk2 failure) closed by ryandesign@…
duplicate: Please remember to use WikiFormatting and to fill in the Port field. As …
16:45 Ticket #32245 (openal: error: redefinition of parameter 'inBuffer') created by bernard@…
The penal port fails to build with errors like the following. […]
14:49 Ticket #32244 (upgrade gtk2 failure) created by qingyun.oracle@…
[…]
14:33 Changeset [87540] by mww@…
polyml: fix build on 10.7 by only building the portable interpreter
14:29 Ticket #32243 (fossil 1.20 stealth update) created by dmttding@…
When trying to install fossil with sudo port install fossil I recieved …
13:45 Ticket #32239 (Error installing glib2 on a G5 xserver OS X 10.5.8) closed by ryandesign@…
duplicate: Duplicate of #32222. Selfupdate, clean glib2, and try again.
13:42 Ticket #32242 (pango: expected declaration specifiers or ‘...’ before ‘G_CONST_RETURN’) created by gardnermj@…
When building gconf, I get build errors from pango, relating to …
13:42 Ticket #32236 (inkscape @0.48.2 fails configuring xorg-libXau dependency) closed by ryandesign@…
duplicate: Duplicate of #32227.
13:40 Ticket #32241 (atk build fails) closed by ryandesign@…
duplicate: Duplicate of #32203.
13:39 Ticket #32237 (failed to install xorg-libXau) closed by ryandesign@…
duplicate: Duplicate of #32227.
13:37 Ticket #32235 (makedepend: configure fails) closed by ryandesign@…
duplicate: Duplicate of #32227.
13:37 Ticket #32240 (makedepend 1.0.3 configure failure - shell command failed) closed by ryandesign@…
duplicate: Duplicate of #32227.
13:33 Ticket #32233 (sshfs crashes in glib2's g_thread_init_glib) closed by ryandesign@…
duplicate: Duplicate of #32202.
13:29 Ticket #32238 (cliclick @1.3.1 fails to install) closed by ryandesign@…
duplicate: Duplicate of #21117.
12:37 Ticket #32204 (gtk2: GLib-ERROR (recursed) **: The thread system is not yet initialized.) closed by ryandesign@…
duplicate
12:37 Ticket #32202 (glib2, glib2-devel built with clang: GLib-ERROR (recursed) **: The thread ...) closed by ryandesign@…
fixed: Fixed glib2 in r87537 and glib2-devel in r87539.
12:35 Changeset [87539] by ryandesign@…
glib2-devel: use llvm-gcc-4.2 instead of clang; see #32202
12:30 Ticket #32241 (atk build fails) created by tanner@…
Help, how do i fix this ?? […] Thanks
12:23 Ticket #32240 (makedepend 1.0.3 configure failure - shell command failed) created by danielson.paul@…
I am using OS X Lion 10.7.2 and XCode 4.2.1. I'm new to most of this and …
12:08 Ticket #32185 (glib2, glib2-devel: build fails when pkgconfig is not installed) closed by ryandesign@…
fixed: This ticket is about glib2/glib2-devel failing to build when pkgconfig is …
12:07 Changeset [87538] by ryandesign@…
glib2-devel: patch configure not configure.ac; no longer need to autoconf; …
12:03 Ticket #32239 (Error installing glib2 on a G5 xserver OS X 10.5.8) created by brad_ward@…
I am very new to using port and I am trying to install glib2 and keep …
11:59 Ticket #32238 (cliclick @1.3.1 fails to install) created by nonstop.server@…
Port cliclick fails to install due to a permission denied exception during …
11:26 Ticket #32237 (failed to install xorg-libXau) created by william1121@…
When I try to install py26-pymvpa, in the dependencies list, I have to …
11:20 Changeset [87537] by ryandesign@…
glib2: use llvm-gcc-4.2 instead of clang; see #32202
11:19 Ticket #32236 (inkscape @0.48.2 fails configuring xorg-libXau dependency) created by cluesome@…
Mac OS X Lion 10.7.2 Xcode Version 4.2 (4D199) Issued command: …
11:13 Ticket #32228 (installing sshfs fails due to missing dependency to glib/gthread) closed by ryandesign@…
duplicate: Duplicate of #32227.
11:13 Ticket #32229 (ffmpeg 0.7.8 fails to configure) closed by ryandesign@…
duplicate: Duplicate of #32227.
11:12 Ticket #32230 (qt4-mac does not build) closed by ryandesign@…
duplicate: Duplicate of #32227.
11:01 Ticket #32231 (cannot upgrade ffmpeg +nonfree to 0.7.8_0) closed by ryandesign@…
duplicate: Duplicate of #32229.
10:37 Changeset [87536] by dports@…
p5-libwww-perl: use ${subport} instead of ${name} to name the doc …
10:34 Ticket #32235 (makedepend: configure fails) created by ghashsnaga@…
Morning all. I was trying to install arb through macports and I keep …
10:31 Changeset [87535] by dports@…
p5-xml-sax-base: license
09:34 Ticket #32234 (poppler build fails because pango is not compatible with glib 2.30.2) created by stan1313@…
[…] Made a selfupdate before. My configuration: […]
08:58 Ticket #32233 (sshfs crashes in glib2's g_thread_init_glib) created by dernic9@…
Ports build correctly, but the sshfs binary crashes immediately, even when …
07:57 Changeset [87534] by jwa@…
version bump to 20111115
07:31 Ticket #32232 (Failed Initialization and Failed port extract) created by Aegershen@…
I keep attempting to install a port that is local and it gives me the …
07:03 Changeset [87533] by hum@…
libzookeeper: update to 3.3.4.
06:43 Ticket #32231 (cannot upgrade ffmpeg +nonfree to 0.7.8_0) created by f.calboli@…
I cannot upgrade ffmpeg +nonfree. I read a complaint about dirac, but: …
06:38 Changeset [87532] by hum@…
pficommon: mark various postgresql variants as conflicting with one …
06:16 Changeset [87531] by hum@…
py-jubatus-client: update to the latest git.branch.
05:56 Ticket #32230 (qt4-mac does not build) created by winter@…
Does not build, variants +universal +no_x11 Seems that it does not find …
03:49 Ticket #32229 (ffmpeg 0.7.8 fails to configure) created by j_mach_wust@…
The new ffmpeg 0.7.8 fails to configure. If I read the main.log
03:02 Ticket #32228 (installing sshfs fails due to missing dependency to glib/gthread) created by obensonne@…
Installing sshfs fails: […] The referenced log file reports this: …
02:51 Ticket #32227 (pkgconfig runtime crashes) created by pauljamesadams@…
OSX: 10.7.2 | Xcode: 4.2.1 From mail.log (also attached): […] This …
02:14 Changeset [87530] by dports@…
p5-xml-sax: update to v0.99, add dependency on p5-xml-sax-base
02:13 Ticket #32165 (p5-module-corelist: update to version 2.58) closed by dports@…
fixed: r87529
02:13 Changeset [87529] by dports@…
p5-module-corelist: update to v2.58 (see #32165)
02:13 Changeset [87528] by dports@…
p5-params-check: update to v0.32
02:12 Changeset [87527] by dports@…
p5-html-tableextract: update to v2.11
02:12 Changeset [87526] by dports@…
p5-module-load: update to v0.22
02:12 Changeset [87525] by dports@…
p5-version: update to v0.95
02:11 Changeset [87524] by dports@…
p5-cpan-meta-yaml: update to v0.004
02:11 Changeset [87523] by dports@…
p5-net-ssleay: update to v1.42
02:10 Changeset [87522] by dports@…
p5-number-compare: update to v0.03
02:10 Changeset [87521] by dports@…
p5-log-log4perl: update to v1.34
02:10 Changeset [87520] by dports@…
p5-module-load-conditional: update to v0.46
02:09 Changeset [87519] by dports@…
p5-ipc-run: update to v0.90
02:09 Changeset [87518] by dports@…
p5-text-glob: update to v0.09
02:08 Changeset [87517] by dports@…
p5-list-moreutils: update to v0.33
02:08 Changeset [87516] by dports@…
p5-file-find-rule: update to v0.33
02:08 Changeset [87515] by dports@…
p5-libwww-perl: update to v6.03
02:07 Changeset [87514] by dports@…
p5-ipc-cmd: update to v0.72
02:07 Changeset [87513] by dports@…
p5-module-metadata: update to v1.000007
02:06 Changeset [87512] by dports@…
p5-pod-simple: update to v3.19
02:06 Changeset [87511] by dports@…
p5-data-dump: update to v1.21
02:06 Changeset [87510] by dports@…
p5-datemanip: update to v6.25
02:05 Ticket #24710 (p5-xml-sax and p5-xml-sax-base conflict) closed by dports@…
fixed: Should be fixed by r87509.
02:05 Changeset [87509] by dports@…
p5-xml-sax-base: * update to v1.08 * add pre-activate hook to avoid …
02:03 Changeset [87508] by dports@…
p5-html-parser: update to v3.69
02:03 Changeset [87507] by dports@…
p5-unicode-collate: update to v0.86
02:01 Changeset [87506] by dports@…
biblatex-biber: downgrade to v0.9.3 to ensure compatibility with the …
01:41 Ticket #32226 (py-svn fails to build with subversion 1.7.x) created by blueml@…
build fails with following error messages: […]
01:14 Changeset [87505] by ryandesign@…
graphviz-devel, graphviz-gui-devel, gvedit-devel: update to …
01:00 Changeset [87504] by ryandesign@…
youtube-dl: update to 2011.11.23
00:02 Changeset [87503] by ryandesign@…
glib2: patch configure not configure.ac; no longer need to autoconf; fixes …

11/23/11:

23:25 Ticket #32225 (dbus-glib fails to build on lion) created by sewebster@…
Tried both clang (default) and llvm-gcc-4.2 and got the same segfault: …
22:55 Ticket #32224 (apple-gcc42: error: '_Unwind_Ptr' undeclared (first use in this function)) created by timdiab@…
After updating Xcode to 4.2.1 I got the following error when trying: …
21:15 Ticket #32222 (glib2 2.30.2 build fails when pkgconfig is not installed) closed by ryandesign@…
duplicate: Duplicate of #32185.
21:11 Ticket #27264 (qtoctave-mac build fails when non-MacPorts Qt is in /Library/Frameworks) closed by ryandesign@…
invalid: Invalid because it was caused by user-installed 3rd-party libraries. …
20:41 Ticket #32213 (pdftk fails to build) closed by ryandesign@…
duplicate: Duplicate of #30299.
20:38 Ticket #32214 (Installing Wine) closed by ryandesign@…
invalid: The log says: […] Remove /usr/local/lib/libintl.8.dylib and anything …
20:22 Ticket #32223 (qtoctave-mac: unable to find file /Users/x/.qtoctave/1322102127.variables) created by jeet.chem@…
I installed qtoctave (GUI based octave) on Lion OSX. Installation was …
17:47 Ticket #32222 (glib2 2.30.2 build fails when pkgconfig is not installed) created by philcuddy@…
Hi all, during install of amarok I get the following error message …
15:15 Changeset [87502] by dports@…
p5-term-vt102: new port via cpan2port, v0.91
15:08 Ticket #32221 (uzbl: gdk/gdkx.h: No such file or directory) created by rudloff@…
uzbl has no quartz variant: […]
15:04 Ticket #32220 (TrailBlazer: fetch time out) created by rudloff@…
[…]
14:53 Changeset [87501] by devans@…
ffmpeg: update to version 0.7.8.
14:48 Ticket #32219 (ffmpeg-devel: use librtmp) created by marcin.operacz@…
Enhacement to use librtmp in ffmpeg to address issue with connecting to …
14:42 Ticket #32218 (nodejs: OpenTransportProviders.h:108: error: parse error before numeric ...) created by rudloff@…
[…]
14:35 Ticket #32217 (clutter: Makefile:3407: *** Need to define glib_marshal_list and ...) created by rudloff@…
[…]
14:07 Ticket #32216 (elinks: lib.o non-external symbol 757 (___i686.get_pc_thunk.bx) can't be a ...) created by rudloff@…
[…]
13:40 Ticket #32058 (ipe-tools: python variants fail to select the correct python version) closed by devans@…
fixed: Committed in r87500, maintainer timeout.
13:39 Changeset [87500] by devans@…
ipe-tools: fix python configuration in variants, add livecheck, #32058, …
13:26 Ticket #32212 (glib2 fails to build for kmymoney) closed by ryandesign@…
duplicate: Duplicate of #32204.
13:18 Ticket #32215 (ledger build fails with clang) created by vishketan@…
Please see attached log file.
12:57 Ticket #32214 (Installing Wine) created by olgashort@…
Trying to install wine. Kept having prob with gettext so cleaned and then …
12:34 Ticket #32213 (pdftk fails to build) created by vishketan@…
Please see attached log for build failure.
11:50 Ticket #32212 (glib2 fails to build for kmymoney) created by mk@…
I just noticed that in …
11:24 Migration edited by Deil.Christoph@…
(diff)
11:12 Ticket #32211 (Port self update failed on OS Lion 10.7.2 and Xcode 4.2) created by peterever@…
Somehow selfupdate does not work on my Mac. Below is the output. No …
10:43 Changeset [87499] by mk@…
libalkimia: fix license
10:41 Changeset [87498] by mk@…
kmymoney, kmymoney4, kmymoney4-devel, libalkimia: update licenses
10:09 Ticket #32210 (glib2 build error) closed by macsforever2000@…
duplicate: Duplicate of #32185.
10:02 Ticket #32210 (glib2 build error) created by stuffsamlikes@…
I'm trying to install wine on my macbook air, using Lion OS X. I have …
08:21 Ticket #32209 (dragonegg-devel +gcc45 fails to build on Lion 10.7.2) created by russell.jones@…
gcc45 installs OK. Build log says something about an unclosed double quote …
08:07 Changeset [87497] by jmr@…
p5-mac-glue: license
08:07 Changeset [87496] by jmr@…
p5-time-epoch: license
08:05 Changeset [87495] by jmr@…
p5-mac-errors: license
08:01 Changeset [87494] by jmr@…
p5-mac-apps-launch: license
07:59 Ticket #32208 (Pease upgrade port svn2cl from 0.11 to 0.13) created by Torsten.Maehne@…
Please upgrade port svn2cl from 0.11 to 0.13. The attached Portfile patch …
07:58 Ticket #32207 (mjpegtools-2.0.0: error: use of undeclared identifier 'DeleteRegion') created by arthur@…
Build fails. The problem seems to be: […]
07:58 Changeset [87493] by jmr@…
p5-mac-sysprofile: license
07:44 Changeset [87492] by jmr@…
p5-mail-imapclient: license
07:41 Changeset [87491] by jmr@…
p5-mail-spamassassin: license
07:40 Changeset [87490] by jmr@…
p5-mail-spf: license
07:40 Changeset [87489] by jmr@…
p5-net-dns-resolver-programmable: license
07:36 Changeset [87488] by jmr@…
p5-netaddr-ip: license
07:30 Changeset [87487] by jmr@…
p5-mail-dkim: license
07:30 Changeset [87486] by jmr@…
p5-crypt-openssl-rsa: license
07:29 Ticket #32206 (olena) created by z@…
Software platform for efficient and generic image processing. It is …
07:29 Changeset [87485] by jmr@…
p5-crypt-openssl-bignum: license
07:27 Changeset [87484] by jmr@…
p5-crypt-openssl-random: license
07:23 Changeset [87483] by jmr@…
p5-ip-country: license
07:23 Ticket #29927 (nodejs 0.4.8 build failed) closed by ciserlohn@…
fixed
07:22 Ticket #28562 (nodejs @0.4.1_0: Undefined symbols: "_ev_loop") closed by ciserlohn@…
fixed
07:20 Changeset [87482] by jmr@…
p5-mail-audit: license
07:15 Changeset [87481] by jmr@…
p5-math-random-isaac: license
07:11 Changeset [87480] by jmr@…
p5-memoize-expirelru: license
07:10 Changeset [87479] by jmr@…
p5-mime-encwords: license
07:07 Changeset [87478] by jmr@…
p5-mouse: license
07:03 Changeset [87477] by royliu@…
redis: upgrade to 2.4.3
06:39 Changeset [87476] by nicos@…
chicken: adding modelines and license
06:38 Ticket #31545 (port chicken update to version 4.7.0) closed by nicos@…
fixed: I could got rid of the linking problems, which were due to my system. …
06:31 Ticket #28066 (nodejs: Headers from the c-ares port conflict with the bundled c-ares ...) closed by jmr@…
fixed: Fixed, r87475. Upstream really needs to make sure their internal include …
06:31 Changeset [87475] by jmr@…
nodejs: avoid using headers from installed ports when internal ones should …
06:30 Changeset [87474] by nicos@…
chicken: update to 4.7.0 (ticket #31545, maintainer timeout)
05:33 Ticket #31418 (pypy shouldn't need gcc45) closed by jmr@…
fixed: The default gc root finder is now shadowstack rather than asmgcc on …
05:32 Changeset [87473] by jmr@…
pypy: update to 1.7
04:23 Changeset [87472] by nicos@…
qtiplot: upgrade to 0.9.8.9
03:54 Ticket #32205 (libgsf: error: expected ‘=’, ‘,’, ‘;’, ‘asm’ or ‘__attribute__’ before ...) created by christoph.kindl@…
I tried to install gimp2 but it failed because macports couldn't build …
03:10 Ticket #32204 (gtk2: GLib-ERROR (recursed) **: The thread system is not yet initialized.) created by paradox924x@…
While updating using sudo port selfupdate and then `sudo port upgrade …
02:48 Ticket #32203 (atk @1.32.0 Build failure: unknown type name 'G_CONST_RETURN'27) created by fx.payet@…
Hello, when trying to build atk, I've got the following error : […]
02:47 Ticket #29401 (stellarium @0.10.5 Build error - file not found) closed by raimue@…
fixed
02:25 Changeset [87471] by ryandesign@…
mc: update to 4.8.0; fix license to GPL-3+ based on source headers
02:22 Ticket #30185 (gource: update to 0.35) closed by ryandesign@…
fixed: This ticket was about updating gource to 0.35. That was accomplished in …
02:08 Ticket #32201 (install glib2 shell command failed) closed by ryandesign@…
duplicate: The error looks different, but I believe this is a duplicate of #32185. …
01:23 Ticket #32202 (glib2, glib2-devel built with clang: GLib-ERROR (recursed) **: The thread ...) created by bernhard.fisseni@…
after updating glib2 to 2.30.2, mc does not work any more; it takes some …
00:47 Ticket #28268 (scrypt package needs updating) closed by ryandesign@…
fixed: r87470.
00:47 Changeset [87470] by ryandesign@…
scrypt: update to 1.1.6 (#28268); BSD license; update homepage; add …
00:07 Ticket #32201 (install glib2 shell command failed) created by xdamman@…
[…] The log returns: […] I did try sudo port selfupdate but …

11/22/11:

23:40 Ticket #30185 (gource: update to 0.35) reopened by s.veer@…
Gource 0.35 build error please update to 0.37 […] $vi …
22:38 Ticket #32200 (Symbol not found: _modperl_handler_anon_add failing apache2 startup) created by mauritz.lovgren@…
I am getting the following error while starting port apache2 after having …
21:47 Changeset [87469] by ryandesign@…
glib2: update to 2.30.2; use xz distfile; add libffi dependency
20:28 Changeset [87468] by ryandesign@…
youtube-dl: update to 2011.11.22
18:46 Ticket #32046 (mjpegtools: update to 2.0.0) closed by ryandesign@…
fixed: r87467 (maintainer timeout)
18:46 Changeset [87467] by ryandesign@…
mjpegtools: * update to version 2.0.0 * update master_sites to avoid …
18:36 Ticket #32199 (memcached: update to 1.4.10) created by ryandesign@…
[…]
18:18 Ticket #32198 (hub uses an unversioned distfile) created by ryandesign@…
The hub port fetches a distfile called "standalone", which is an …
17:50 Mirrors edited by lynxluna@…
(diff)
17:47 Ticket #28388 (webkit-gtk: update to 1.2.7) closed by ryandesign@…
duplicate: Duplicate of #28624.
17:44 Ticket #32197 (bittorrent 5.2.0 build failure: Permission denied: ...) created by aednichols@…
BitTorrent fails to build with the following error: […] I've tried …
16:27 Ticket #32196 (MacPorts_Framework: parse error before ‘NSUInteger’) created by rudloff@…
[…] Does this mean that it can't be built on Tiger ? If so, it …
16:10 Ticket #32195 (Can't build MPlayer on 10.4) created by rudloff@…
[…]
15:55 Changeset [87466] by devans@…
libcroco: update to version 0.6.3, add mode line.
15:42 Changeset [87465] by devans@…
hicolor-icon-theme: fix livecheck.
15:08 Changeset [87464] by ciserlohn@…
nodejs: add license
15:01 Changeset [87463] by ciserlohn@…
ejabberd: add license
15:00 Changeset [87462] by ciserlohn@…
yaws: add license
14:52 Changeset [87461] by ciserlohn@…
parallel: update to version 20111122; add license
14:27 Ticket #32194 (webkit-gtk: update to 1.8.0) created by rudloff@…
The webkit-gtk port is quite old and renders incorrectly some websites, so …
14:17 Ticket #32193 (couchdb 1.1.1 local.ini installed with root ownership, should be couchdb) created by erik@…
The local.ini file (/opt/local/etc/couchdb/local.ini) should be installed …
12:01 Ticket #32192 (new port: py-pygrib) created by jswhit@…
python interface to the grib_api library (pygrib.googlecode.com)
12:00 Ticket #32191 (new port: py-netcdf4) created by jswhit@…
python interface to the netcdf library (netcdf4-python.google.com)
11:10 Ticket #32190 (couchdb 1.1.1 preserve local.ini between installs) created by erik@…
I would argue that the local.ini, or at least a modified local.ini, should …
11:03 Ticket #32189 (mariadb, mysql5, mysql5-devel: add percona conflict) created by pixilla@…
The mariadb, mysql5, mysql5-devel and percona ports all share conflicting …
10:50 Ticket #32188 (pythonNN: Move openssl support/dep to a (non-default) variant) created by eborisch@…
A proposal for discussion; this may not be the best idea, but I thought …
09:17 Ticket #31961 (php5-pear: build/libexec/php/bin/pear: No such file or directory) closed by pixilla@…
fixed
09:14 Changeset [87460] by pixilla@…
databases/mysql4: - Add percona conflict.
08:21 Ticket #29499 (Percona 5.5.11-rel20.2 Percona database port, drop in replacement for ...) closed by pixilla@…
fixed: Commit r87459
08:21 Ticket #29500 (Percona Server 5.5.11-rel20.2 Percona database port, drop in replacement ...) closed by pixilla@…
fixed: Commit r87459
08:19 Changeset [87459] by pixilla@…
databases/percona: - Add percona database ports.
07:33 Ticket #32184 (An error) closed by macsforever2000@…
invalid
07:03 Changeset [87458] by royliu@…
git-core: upgrade to 1.7.7.4
06:36 Ticket #32187 (checkstyle: Update to 5.5) created by s.veer@…
[…] http://sourceforge.net/projects/checkstyle/files/checkstyle/
06:30 Ticket #32186 (pmd: Update to 4.3) created by s.veer@…
[…] http://sourceforge.net/projects/pmd/files/pmd/4.3/
06:16 Ticket #28061 (p5-pango: Can't locate Glib.pm in @INC) closed by ryandesign@…
worksforme
06:12 Ticket #32185 (glib2, glib2-devel: build fails when pkgconfig is not installed) created by jerkejacobs@…
Dear all: The glib2-devel (glib-2.29.92) port fails on autoconf/automake …
06:00 Ticket #32184 (An error) created by foxtian@…
Traceback (most recent call last): File "./scripts/BuildApplet.py", line …
05:58 Changeset [87457] by ryandesign@…
bonniexx: fix typo in notes
05:56 Ticket #32156 (port selfupdate freeze os x 10.7 dock) closed by ryandesign@…
invalid: I hope you mean /opt/local; It's very unsupported to have MacPorts in …
05:55 Changeset [87456] by ryandesign@…
jlint: fix primary category
05:49 Changeset [87455] by ryandesign@…
jlint: whitespace changes / reformatting / add modeline
05:47 Ticket #32183 (jlint: error: cast from ‘void*’ to ‘int’ loses precision) closed by ryandesign@…
fixed: I updated jlint to 1.23 in r87454, which seems to resolve the problem.
05:45 Changeset [87454] by ryandesign@…
jlint: update to 1.23 (#32183); MIT license; update homepage and …
05:32 Ticket #32183 (jlint: error: cast from ‘void*’ to ‘int’ loses precision) created by s.veer@…
$ sudo vi …
04:53 Ticket #30198 (ksh93 2010-06-21 update to 2011-02-08) closed by ryandesign@…
fixed: Replying to ikawnoclast@…: > ksh93 was updated to …
04:52 Changeset [87453] by ryandesign@…
ksh93: update to 2011-02-08 (#30198); CPL license
04:52 Ticket #32182 (ksh93: compiler, arch flags) created by ryandesign@…
ksh93 doesn't ensure it's UsingTheRightCompiler nor using the right …
04:04 Changeset [87452] by ryandesign@…
ksh93: remove unused patchfile; see #30198
03:51 Ticket #32178 (p5-zeromq: update to 0.18) closed by ryandesign@…
fixed: r87451.
03:50 Changeset [87451] by ryandesign@…
p5-zeromq: update to 0.18 (#32178); disable livecheck in subports
00:56 Ticket #32172 (pkgconfig: Library not loaded: /opt/local/lib/libglib-2.0.0.dylib) closed by ryandesign@…
invalid: Hmm, it should not have been possible for you to install pkgconfig without …
00:41 Changeset [87450] by ryandesign@…
net-snmp: update to 5.7.1 and fix livecheck
00:12 Changeset [87449] by takanori@…
bonniexx: add livecheck, minor fix in notes

11/21/11:

23:42 Changeset [87448] by takanori@…
bonniexx: add notes about memory detection
20:37 Changeset [87447] by takanori@…
bonniexx: whitespace changes
20:23 Changeset [87446] by ryandesign@…
aacgain, cmus, easytag, easytag-devel, gtkpod, ices0, mpeg4ip: Allow …
19:02 Changeset [87445] by jeremyhu@…
xorg-server-devel: Bump to 1.11.99.1 (1.12 beta1)
18:34 Ticket #32179 (libsdl_ttf needs libsdl instead of libsdl-devel) closed by ryandesign@…
invalid: You have misunderstood how MacPorts uses -devel ports. Please read #14540. …
17:47 Ticket #32181 (expat: +CONTENTS: Not found in archive) created by elizabeth.anne.stock@…
This is my first time using macports, so I might not have my directories …
17:30 Ticket #32180 (rvm: Undefined symbols: __ZL9min_limitIdEKT_v, __ZL9max_limitIdEKT_v) created by sstoddard@…
rvm fails compilation on 10.6.8 with 2.0.3. Log attached.
17:26 Ticket #32177 (wine-devel fetch failed on wine_gecko-1.4-x86.msi) closed by ryandesign@…
invalid: Ok, glad you figured it out.
17:05 Ticket #32070 (bonniexx: update to 1.96) closed by takanori@…
fixed: committed in 87444 with several improvements (patches obtained from …
17:01 Changeset [87444] by takanori@…
bonniexx: version 1.96 (#32070)
16:31 Ticket #32179 (libsdl_ttf needs libsdl instead of libsdl-devel) created by seba.szwarc@…
I cannot build libsdl_ttf because it needs libsdl instead of libsdl-devel. …
15:53 Ticket #32178 (p5-zeromq: update to 0.18) created by jpo@…
The attached patch updates p5-zeromq to version 0.18.
15:41 Ticket #31761 (jython: Unable to access jarfile jython_installer-2.5.2.jar) closed by ryandesign@…
duplicate: Ok, the log says "Unable to access jarfile jython_installer-2.5.2.jar". …
15:15 Ticket #32155 (geos, undefined symbols for ...) closed by ryandesign@…
fixed: r87443.
15:15 Changeset [87443] by ryandesign@…
geos: use clang instead of llvm-gcc-4.2; see #32155
14:52 Ticket #30031 (python27 @2.7.2_2 has broken exponentiation) closed by jmr@…
fixed: r87442
14:46 Changeset [87442] by jmr@…
python2*: make sure we compile with -fwrapv (#30031)
14:37 Ticket #31444 (MacPorts Python decimal module broken; Python installed from source works ...) closed by jmr@…
duplicate: #30031
13:24 Ticket #32177 (wine-devel fetch failed on wine_gecko-1.4-x86.msi) created by dersh@…
I have wine-devel 1.3.32_0 installed and I am trying to upgrade to …
12:57 Ticket #32072 (Python: powers of two are screwed up starting at 2**63) closed by jmr@…
duplicate: #30031
12:34 Ticket #32176 (mercurial: missing files) created by erg@…
I have installed mercurial but when I run it I get: […] I have tried …
11:53 Ticket #30632 (redland: No rule to make target -lltdl) closed by pixilla@…
fixed
09:46 Changeset [87441] by pixilla@…
www/redland: - Add patch for src/Makefile.am to Fix Lion/Xcode4.2 build. …
09:19 Ticket #30031 (python27 @2.7.2_2 has broken exponentiation) reopened by jmr@…
Definitely a bug in the python build. On 10.6 built with Xcode 3.2.6: …
09:15 Ticket #31923 (pypy @1.6 fails to build using macport and apple python27) closed by jmr@…
duplicate
08:52 Changeset [87440] by mmoll@…
math/slepc: update to 3.2-p2, add error message saying that port needs to …
08:49 Ticket #32175 (jython: Unable to access jarfile jython_installer-2.5.2.jar) created by richard.lynch@…
I don't even know what all this means, and can't puzzle it out... I'm …
08:11 Changeset [87439] by snc@…
py-requests: update to 0.8.2
08:06 Changeset [87438] by snc@…
depot_tools: update to 110932
06:37 Ticket #32174 (gnudatalanguage install fails with "shell command failed") created by bonomo@…
After all "dependencies" are installed, the installation of the …
06:12 Ticket #32173 (CamlP4 META doesn't contains reference to dynlink) created by ontologiae@…
ocamlfind query -p-format -recursive camlp4.lib give : […] It …
05:04 Changeset [87437] by snc@…
pspp-devel: update to g4fd6cf
04:36 Ticket #32172 (pkgconfig: Library not loaded: /opt/local/lib/libglib-2.0.0.dylib) created by PetSchul@…
MAC OSC 10.6.8 while configuring soprano for a kdenlive …
04:07 Changeset [87436] by ryandesign@…
feh: whitespace changes / reformatting / add modeline
04:06 Changeset [87435] by ryandesign@…
feh: update to 2.1, update homepage and master_sites, MIT license
03:41 Changeset [87434] by ryandesign@…
giblib: MIT license
03:36 Changeset [87433] by ryandesign@…
BibTool: update to 2.53
03:31 Ticket #29808 (Ports abandoned: aacgain, BibTool, feh, giblib) closed by ryandesign@…
fixed: r87432
03:31 Changeset [87432] by ryandesign@…
aacgain, BibTool, feh, giblib: ports abandoned; see #29808
03:19 Ticket #32171 (perl5.8, perl5.10, perl5.12, perl5.14: startperl is wrong) created by ryandesign@…
In e.g. /opt/local/lib/perl5/5.8.9/darwin-2level/Config_heavy.pl appears …
02:26 Changeset [87431] by ciserlohn@…
npm: fix checksums, add dist_subdir, increase revision after stealth …
02:23 Changeset [87430] by ryandesign@…
goffice: update to 0.8.17, update homepage
01:58 Ticket #30870 (New version of mp4v2-dev available) closed by ryandesign@…
fixed: r87429.
01:57 Changeset [87429] by ryandesign@…
mp4v2-devel: new port, based on mp4v2-dev, updated to r479 (#30870), …
01:45 Ticket #32170 (gnome-session @2.30.2 +devkit-power: No package 'devkit-power-gobject' ...) created by giovanni@…
Mac OS X 10.7.2 XCode 4.1 gnome-session 2.30.2 checks …
01:29 Ticket #31547 (mp4v2 fails to build in Lion) closed by ryandesign@…
fixed: r87358
00:57 Ticket #18985 (easytag-devel 2.1.6 lacks a dependency on libid3tag) closed by ryandesign@…
fixed: Thanks. Committed in r87428. When the patch is in the files directory, …
00:56 Ticket #32169 (easytag-devel: mp4.h: No such file or directory) closed by ryandesign@…
duplicate
00:56 Changeset [87428] by ryandesign@…
easytag-devel: add libid3tag dependency in mp3 variant; fix compilation …

11/20/11:

23:20 Changeset [87427] by ryandesign@…
digikam: use llvm-gcc-4.2 instead of clang; see …
23:15 Ticket #31958 (Digikam does not start on Lion) closed by ryandesign@…
invalid
23:14 Changeset [87426] by blair@…
ice-cpp: prefer llvm-gcc-4.2 instead of gcc-4.2 when clang is the default …
19:10 Ticket #32154 (octave installation fails because of missing dependency on atlas) closed by macsforever2000@…
duplicate: #32113
18:17 Changeset [87425] by devans@…
transcode: update to version 1.1.7, correct license.
17:21 Ticket #32169 (easytag-devel: mp4.h: No such file or directory) created by neukomp@…
Tried to install easytag-devel on SL 10.6.8 using command: […] It …
17:16 Ticket #32168 (wireshark 1.6.x: several requests) created by jpo@…
This ticket was created in order to make several requests/comments …
16:36 Changeset [87424] by ryandesign@…
abiword: fix 'libole2/ms-ole.h: No such file or directory'; see #32164
16:24 Ticket #32167 (p5-test-simple: update to 0.98) created by jpo@…
The attached patch updates p5-test-simple to version 0.98 (the same one …
16:17 Ticket #32166 (claws-mail+quartz) created by rudloff@…
These patches allow claws-mail to build with gtk2+quartz.
16:12 Ticket #32164 (abiword: ‘struct png_info_struct’ has no member named ‘trans’) closed by ryandesign@…
fixed: r87422. It still doesn't build though, now complaining …
16:11 Changeset [87423] by ryandesign@…
abiword: add pkgconfig build dep
16:10 Changeset [87422] by ryandesign@…
abiword: fix libpng 1.4 incompatibility; see #32164
15:59 Changeset [87421] by ryandesign@…
abiword: only default to use_binary variant if use_source variant has not …
15:57 Ticket #32165 (p5-module-corelist: update to version 2.58) created by jpo@…
The attached patch updates p5-module-corelist to version 2.58. Note: the …
15:55 Changeset [87420] by ryandesign@…
abiword: use applications_dir
15:31 Changeset [87419] by ryandesign@…
pure: update to 0.49; add upstream patch for gcc 4.2 compatibility; remove …
15:22 Changeset [87418] by ryandesign@…
dtrx: update to 7.1
15:06 Ticket #31069 (ice-cpp build fails with clang++) closed by blair@…
fixed: Fixed in r87417 by using g++ if clang++ is the default compiler.
15:05 Changeset [87417] by blair@…
ice-cpp: do not compile with clang++, use c++ instead. Closes #31069. …
14:53 Ticket #32164 (abiword: ‘struct png_info_struct’ has no member named ‘trans’) created by rudloff@…
I get a lot of errors like this when trying to build Abiword: […]
14:46 Ticket #32163 (Bundle and desktop entry for Bluefish) created by rudloff@…
This patch adds a bundle and a desktop entry for Bluefish.
14:36 Ticket #32162 (compare @1.16_2 fails to build) created by nonstop.server@…
Port compare @1.16, Revision 2 fails to build. I have tried …
14:35 Ticket #32152 (gtk2: gdk_drag_begin: assertion failed:) closed by ryandesign@…
fixed: r87416.
14:34 Changeset [87416] by ryandesign@…
gtk2: fix drag and drop crash; see #32152
14:33 Ticket #32161 (gdb @7.3 fails to build with clang) created by gunnlaugur@…
Salient bit from main.log: […] The compiler has a point there, and …
13:51 Ticket #32160 (goffice: syntax error near unexpected token `"$arg"') created by rudloff@…
[…]
13:22 Ticket #32159 (iTerm: CGSConnection.h:33: error: parse error before ...) created by rudloff@…
[…]
13:15 Ticket #32158 (iTerm2: BookmarkListView.h:81: error: parse error before ‘@’ token) closed by ryandesign@…
fixed: iTerm 2 requires Leopard or newer. Added message for Tiger on r87415.
13:15 Changeset [87415] by ryandesign@…
iTerm2: fail early on unsupported Tiger; see #32158
13:04 Ticket #32158 (iTerm2: BookmarkListView.h:81: error: parse error before ‘@’ token) created by rudloff@…
[…]
12:58 Ticket #32157 (Maude v2.6 build failure: error: '_Data_allocate' is not a member of ...) created by cosinepi@…
I tried 'sudo port install maude'. After dependencies are installed, the …
12:52 Ticket #32153 (dsniff-devel @2.4b1 - Build failure) closed by macsforever2000@…
duplicate: Duplicate of #32124. Please search before filing new tickets.
12:21 Ticket #30254 (Error building arb on 10.7) closed by macsforever2000@…
fixed
12:21 Ticket #30406 (arb: ld: in WETC/WETC.a, section not found for address 0x000002CD) closed by macsforever2000@…
worksforme
11:35 Ticket #32156 (port selfupdate freeze os x 10.7 dock) created by fotak@…
I have big problem with Macports and OS X 10.7 if start `port -d …
10:59 Ticket #32155 (geos, undefined symbols for ...) created by ram@…
geos-3.3.1_0 is failing to build on Snow Leopard with Xcode-4.0.2 with the …
10:24 Ticket #32154 (octave installation fails because of missing dependency on atlas) created by vishketan@…
[…]
09:04 Ticket #32153 (dsniff-devel @2.4b1 - Build failure) created by anonjoe@…
OS : MacOSX Lion 10.7.2 […]
07:15 Ticket #32152 (gtk2: gdk_drag_begin: assertion failed:) created by rudloff@…
Could we include [https://bugzilla.gnome.org/show_bug.cgi?id=664238 this …
05:13 Changeset [87414] by mk@…
uncrustify: update to 0.59
00:23 Ticket #32149 (Portfile for installing bbdb) closed by ryandesign@…
fixed: Added port in r87413 with the above changes.
00:23 Changeset [87413] by ryandesign@…
bbdb: new port, version 2.35; see #32149
Note: See TracTimeline for information about the timeline view.