New Ticket     Tickets     Wiki     Browse Source     Timeline     Roadmap     Ticket Reports     Search

Timeline


and

12/11/11:

20:48 Changeset [87914] by devans@…
gimp-gap: update embedded ffmpeg to 0.5.6, disable non-free options, …
18:27 Changeset [87913] by devans@…
gimp-gap-devel: update to latest git master, disable non-free ffmpeg …
18:22 Changeset [87912] by devans@…
gimp2, gimp2-devel: add missing dependencies xorg-libXmu, xpm.
17:45 Ticket #28705 (Fix to build libiconv with clang) closed by ryandesign@…
fixed: Actually, libiconv's build with clang was problematic, and was fixed in …
17:44 Changeset [87911] by michaelld@…
fltk-devel: upgrade to r9204.
17:38 Changeset [87910] by cal@…
rev-upgrade: Merge from trunk
17:35 Changeset [87909] by cal@…
signing-party: All of the licenses are applicable, there is no choice …
16:57 Ticket #32511 (openjpeg @1.4-r697 openjpeg/ffmpeg/libjasper symbol collision) created by marin.saric@…
The purpose of this ticket is to point out a serious issue with OpenJPEG …
16:21 Ticket #32507 (net-snmp-config should not include -arch flags) closed by ryandesign@…
fixed: Replying to jeremyhu@…: > It looks like …
16:20 Changeset [87908] by ryandesign@…
net-snmp: remove -arch flags from net-snmp-create-v3-user too; see #32507
16:15 Ticket #32503 (clang-2.9 on Tiger) closed by jeremyhu@…
fixed: I pushed a similar change yesterday. Please sync and try again […] If …
16:15 Ticket #32510 (scite: non-default build_arch not supported) created by one2001boy@…
"the scite software does not use autoconf or cmake or Xcode or any other …
16:09 Ticket #32248 (json-glib: update to 0.14.2) closed by jeremyhu@…
fixed: r87905 addressed the build failure reported, but 0.12.4 had other …
16:05 Changeset [87907] by jeremyhu@…
json-glib: Bump to version 0.14.2 because the previous version fails to …
15:43 Ticket #32509 (dmapd: Update to 0.0.45) created by mike@…
Update dmapd to 0.0.45.
15:41 Ticket #32508 (libdmapsharing: Update to 2.9.14) created by mike@…
Update libdmapsharing to 2.9.14.
15:37 Changeset [87906] by ram@…
python/py-pyfftw3: update to 0.2.2
15:33 Ticket #32507 (net-snmp-config should not include -arch flags) created by jeremyhu@…
If perl5.12 is built +universal, then sane-backends will fail to build …
15:18 Ticket #26783 (gobject-introspection build error) closed by jeremyhu@…
fixed: Actually, it looks like it got changed from disabled by default to …
15:18 Changeset [87905] by jeremyhu@…
Set GI_SCANNER_DISABLE_CACHE when building, see #26783
14:12 Changeset [87904] by cal@…
signing-party: License
13:23 Changeset [87903] by ryandesign@…
root: remove graphviz dependency from global depend_lib since it's now a …
13:21 Changeset [87902] by ryandesign@…
root: make commented-out cling variant require clang31; remove note about …
13:19 Changeset [87901] by ryandesign@…
root: rewrite graphviz dependency so graphviz-devel can satisfy it
12:25 Ticket #32506 (x264: Update to 20111210 and add static library) created by marin.saric@…
A simple version update including an addition of a compile flag to create …
11:51 Changeset [87900] by pixilla@…
databases/percona: - Fix typo.
11:34 Ticket #32505 (jsonval - JSON validator) created by dargo@…
this is a commandline JSON validator which can be called by editors …
09:35 Changeset [87899] by snc@…
py-requests: update to 0.8.4
09:30 Changeset [87898] by snc@…
py-pyopencl: update to 2011.2
09:17 Changeset [87897] by jwa@…
version bump to 2.6.3
09:14 Changeset [87896] by snc@…
depot_tools: update to 113965
08:51 Ticket #32504 (luarocks @2.0.4.1 Patch to upgrade to 2.0.7) created by chad@…
Attached patch upgrades the port to the newest release of luarocks. …
08:46 Ticket #32494 (npm not working with node 0.6.5) closed by macsforever2000@…
invalid
08:42 Ticket #32497 (ghostscript: checksum mismatch because HTML file) closed by macsforever2000@…
invalid
08:41 Ticket #32491 (Update root to fix GLEW issue + other minor improvements) closed by macsforever2000@…
fixed: r87895.
08:41 Changeset [87895] by macsforever2000@…
root: glew fix. added graphviz, soversion, gcc43 and avahi variants. …
02:59 Changeset [87894] by mww@…
gcc47: version 4.7-20111210
02:32 Ticket #32503 (clang-2.9 on Tiger) created by rudloff@…
--enable-shared causes rpath errors on Tiger.
01:05 Ticket #32502 (Virtuoso fails to update) created by hobbsilla@…
I'm running Macports 2.0.3 using Xcodes 4.2.1 on Lion OS X 10.7.2 on a MBP …

12/10/11:

23:02 Ticket #32501 (erlang @R14B04 +odbc Patch for bug in Erlang ODBC configure scripts) created by chad@…
Following is an email exchange which clearly describes the issue this …
22:04 Ticket #32500 (libplist does not configure when Python 3.x has been selected) created by gcrosswhite@…
The configuration script for libplist uses code that is not Python 3.x …
21:08 Changeset [87893] by jeremyhu@…
{clang,llvm}-*: Update released versions to use tarballs, use 'port …
18:47 Ticket #32267 (duplicity 0.6.17 released) closed by singingwolfboy@…
fixed: Fixed in r87892. Sorry for the delay -- I don't use duplicity personally, …
18:44 Changeset [87892] by singingwolfboy@…
duplicity: updated to 0.6.17, fixes #32267
18:36 Ticket #32499 (replace py26-flask with unified py-flask port) created by singingwolfboy@…
I'd like to replace the py26-flask port with a unified py-flask port …
18:33 Ticket #32498 (py*-werkzeug: update and unify ports) created by singingwolfboy@…
the py-werkzeug, py25-werkzeug, and py26-wekzeug ports are fragmented and …
18:28 Changeset [87891] by ryandesign@…
jake: new port, version 0.1.22
18:26 Changeset [87890] by hum@…
ux-trie: change dynamic shared library install name.
16:26 Changeset [87889] by ryandesign@…
yudit: license
16:25 Changeset [87888] by ryandesign@…
yudit: whitespace changes / reformatting / add modeline
16:23 Ticket #32461 (yudit: error: extra qualification "SImage::" on member "getID") closed by ryandesign@…
fixed: r87887.
16:22 Changeset [87887] by ryandesign@…
yudit: update to 2.9.2; see #32461
15:55 Ticket #32489 (ghostscript directory missing from ...) closed by ryandesign@…
invalid: We'll handle this in #32497 then.
15:51 Changeset [87886] by ryandesign@…
free42: add xorg-libXmu dependency
15:43 Changeset [87885] by ryandesign@…
mutt-devel: add http master_sites
13:52 Ticket #32497 (ghostscript: checksum mismatch because HTML file) created by l.digaspero@…
Ghostscript installation fails: it tries to fetch …
13:05 Changeset [87884] by ryandesign@…
pure: use llvm-3.0
12:31 Ticket #32496 (apple-gcc42 build error) created by bulleso57@…
I try to install the last version of ufraw by using port file as indicated …
12:25 Ticket #30687 (mutt-devel @1.5.21 Build failure: Undefined symbols for architecture ...) closed by ryandesign@…
fixed: The patch in the +compress variant is modifying Makefile.am so we need to …
12:25 Changeset [87883] by ryandesign@…
mutt-devel: run autoreconf in +compress variant to prevent build failure; …
12:22 Ticket #32489 (ghostscript directory missing from ...) reopened by l.digaspero@…
12:08 Ticket #32488 (mutt-devel +sidebar fails to build on x86_64) closed by ryandesign@…
fixed: The patch in the +sidebar variant modifies Makefile.am, so we need to be …
12:08 Changeset [87882] by ryandesign@…
mutt-devel: run autoreconf in +sidebar variant to prevent build failure; …
11:48 Ticket #32492 (isightcapture @1.1, Revision 2 - hdiutil: attach failed - Resource Busy) closed by ryandesign@…
duplicate: Duplicate of #21117.
11:46 Ticket #32493 (OpenCV 2.3.1 build fails) closed by ryandesign@…
invalid: The log says: […] Please remove that file. It is not a part of OS X …
11:44 Ticket #32489 (ghostscript directory missing from ...) closed by ryandesign@…
invalid: That's not a problem in the slightest. When MacPorts doesn't find a …
11:39 Ticket #32495 (mark llvm as replaced_by llvm-2.9) created by ryandesign@…
llvm 3.0 final was released December 1 so maybe the clang-3.0 and llvm-3.0 …
11:39 Ticket #32494 (npm not working with node 0.6.5) created by digitalrinaldo@…
[…]
11:25 Ticket #32490 (apache2: upgrading overwrites index.html) closed by ryandesign@…
duplicate: Duplicate of #22371 which is already fixed. It won't happen again with …
11:18 Ticket #32493 (OpenCV 2.3.1 build fails) created by orgicus@…
Hello, I am trying to install OpenCV via macports and have ran into …
10:53 Ticket #32492 (isightcapture @1.1, Revision 2 - hdiutil: attach failed - Resource Busy) created by mmdonley@…
MacBook Core2Duo Mid2007; Leopard 10.5.8; Xcode 3.1.4 Appears that .dmg …
10:48 Ticket #32491 (Update root to fix GLEW issue + other minor improvements) created by jonesc@…
Main aim is to fix a problem with the opengl variant in the last update, …
10:41 Changeset [87881] by jeremyhu@…
{clang,llvm}_select: New ports to be used to select default version of …
10:39 Ticket #32490 (apache2: upgrading overwrites index.html) created by magill@…
Lion 7.2 - Macports 2.0.3 Doing "sudo port update outdated" when Apache2 …
10:32 Ticket #32063 (Build llvm on Tiger) closed by jeremyhu@…
fixed: r87880, thanks.
10:31 Changeset [87880] by jeremyhu@…
llvm-*, clang-*: Bump svn revision for 3.0 and 3.1, fix building on tiger …
10:22 Changeset [87879] by jeremyhu@…
firefox-x11*: Set supported_archs i386 x86_64
09:11 Changeset [87878] by jwa@…
version bump to 10.05.5.1
08:39 Ticket #32489 (ghostscript directory missing from ...) created by l.digaspero@…
It's a few days that I am trying to install texlive and among the …
08:17 Ticket #32488 (mutt-devel +sidebar fails to build on x86_64) created by andrea.veri@…
Hi, port install mutt-devel +sidebar takes in the fail to build outlined …
05:35 Ticket #32288 (lion fullscreen patch for emacs-app) closed by hum@…
fixed: Committed in r87876 and r87877 with additional changes: * fetch 23.3b …
05:33 Changeset [87877] by hum@…
emacs-app: set revision to 4; see #32288, r87876.
05:25 Changeset [87876] by hum@…
emacs-app: add lion fullscreen patch; fetch 23.3b source tarball and add …
04:27 Changeset [87875] by hum@…
cutter: avoid redirects; fix dependecies of glib2, pkgconfig, intltool. …
04:14 Changeset [87874] by ryandesign@…
php54: update to 5.4.0RC3; fix apache2handler module activation …
04:13 Changeset [87873] by krischik@…
I am open to improvements.
04:04 Changeset [87872] by jwa@…
py27-robotframework-selenium2library: new port, a drop-in replacement for …
04:01 Ticket #32487 (dialog: checksum mismatch because HTML file) created by kevin.paulus@…
[…]
03:17 Changeset [87871] by ryandesign@…
php54: update to 5.4.0RC2
03:15 Changeset [87870] by ryandesign@…
ImageMagick, p5-perlmagick: update to 6.7.4-0; switch to xz distfile since …
03:00 Ticket #32486 (objectmarker fails to build) created by mail@…
[…]
00:59 raimue-gnupg-pubkey.txt attached to raimue by raimue@…
My GnuPG public key (0x244289AE)
00:35 Ticket #32466 (firefox-x11@7.0.1 doesn't build: 10.5.8, ppc) reopened by ryandesign@…
Then please fix the port so it errors out early with a friendly message. …
00:08 FAQ edited by ryandesign@…
mention subports in dependonvariant section (diff)

12/09/11:

23:23 Ticket #32481 (py27-svn @1.7.0 install on port 2.0.3 failed) closed by ryandesign@…
duplicate
23:21 Ticket #31679 (xemacs: build failed on 10.7.2 & xcode 4.2 (clang)) closed by ryandesign@…
fixed
20:37 Ticket #32483 (nano: update to version 2.2.6) created by feranick@…
Currently nano is in version 2.2.3 in MacPorts. However upstream is now in …
17:56 Ticket #32482 (rtmpdump: update to 2.4) created by dargo@…
2.4 adds support for RTMPE type 9 handshakes. this is needed for sites …
17:02 Ticket #32481 (py27-svn @1.7.0 install on port 2.0.3 failed) created by qingyun.oracle@…
[…]
16:59 Changeset [87869] by cal@…
signing-party: Note about example configuration files
16:51 Changeset [87868] by cal@…
signing-party: Adjust dependency list to match …
16:48 Changeset [87867] by cal@…
signing-party: update to 1.1.4, fix CC=configure.compiler
16:43 Changeset [87866] by cal@…
signing-party: UsingTheRightCompiler
16:01 Changeset [87865] by cal@…
signing-party: Take maintainership
16:00 Changeset [87864] by cal@…
signing-party: whitespace-only
14:04 Ticket #32480 (gcc47: Segmentation fault in build/genattrtab) created by dougmencken@…
I'm trying to build GCC 4.7 with MacPorts. That's what I've got: […] …
12:30 Changeset [87863] by pixilla@…
users/pixilla/base: - Update configure to reflect new configure.ac output.
12:29 Ticket #31679 (xemacs: build failed on 10.7.2 & xcode 4.2 (clang)) reopened by revenu@…
Thanks a lot. I used the solution you proposed (modify the compiler on the …
12:27 Changeset [87862] by pixilla@…
users/pixilla/base: - Use getversion.sh script to get MacPorts version.
10:57 Changeset [87861] by pixilla@…
users/pixilla/base: - Add svn revision to port version.
10:09 Ticket #32262 (Cannot install Perl via MacPorts on Lion) closed by cal@…
worksforme: There's been a problem regarding the gdbm port recently concerning …
10:03 Changeset [87860] by pixilla@…
Branching from trunk to users/pixilla/base at 87859
09:07 Ticket #32479 (TOra: toconfiguration.cpp:763: internal compiler error: in lower_stmt, at ...) created by rudloff@…
[…]
08:33 Ticket #32478 (libvpx: configure fails) created by shazaum@…
[…]
08:18 Ticket #32477 (Root upgrade from 5.30.03_0 to 5.32.0_0 fails) created by david.w.watson@…
Root upgrade from 5.30.03_0 to 5.32.0_0 fails with: […]
08:13 Ticket #32476 (mcl @08-312 build failure) created by claudio.martella@…
The build fails like this: […] You can find the log file attached …
06:15 Ticket #32460 (beanstalkd failed to build) closed by nick@…
fixed: Replying to ryandesign@…: > The config log shows the not …
06:15 Changeset [87859] by nick@…
Bump the forced compiler from gcc to llvm-gcc, as this is the preferred …
05:46 Ticket #32475 (openssh @5.9p1 New variant adding GSSAPITrustDNS keyword) created by david.abdurachmanov@…
The patch included with the ticket modified openssh Portfile by adding an …
05:28 Ticket #32474 (sshguard-ipfw @1.4_0 livecheck fails to extract latest version) created by nonstop.server@…
The livecheck for this port fails to extract the latest available version. …
05:21 Ticket #32473 (phonon: error: "gluOrtho2D" was not declared in this scope) created by rousseau@…
I'm trying to install kate and it stops when installing/building phonon. …
04:52 Ticket #32472 (Root compiles with qt4-mac but does not work) created by martin.zeman@…
Dear all, I was able to compile the root package with qt_mac variant on …
04:35 Changeset [87858] by stromnov@…
py-celery: update to version 2.4.5
04:33 Changeset [87857] by stromnov@…
py-pymongo: update to version 2.1
03:27 Ticket #32471 (cpio: wrong symbolic link) created by jpo@…
The current cpio Portfile creates a cpio symbolic link pointing to gnutar. …
02:40 Ticket #32456 (npm executable not found after installing nodejs port) closed by ciserlohn@…
fixed: Replying to ryandesign@…: > It seems that for some reason, on …
02:29 Changeset [87856] by ciserlohn@…
npm: simplify destroot phase (fixes #32456)
02:17 Changeset [87855] by ryandesign@…
librsync: whitespace changes / reformatting only
02:13 Ticket #32467 (GraphicsMagick: needs libtool library dependency) closed by ryandesign@…
fixed: I think on your system for some reason GraphicsMagick was dynamically …
02:11 Changeset [87854] by ryandesign@…
GraphicsMagick: force use of libtool port instead of included ltdl; see …
02:02 Changeset [87853] by ryandesign@…
librsync: add forgotten bzip2 popt zlib dependencies and increase …

12/08/11:

23:56 Ticket #32469 (gcc46: fix installation probrem of +cloog variant) created by dtakahashi42@…
Due to the small typo in portfile, the installation of gcc46 with variant …
23:55 Ticket #27237 (gcc46: checking for -exported_symbols_list linker flag... configure: ...) closed by dports@…
fixed: This should be fixed by r87835.
23:52 Ticket #21699 (Check that BibTool's dep on texlive is actually needed) closed by dports@…
fixed: r87851
23:52 Changeset [87852] by dports@…
bibtool: license
23:51 Changeset [87851] by dports@…
bibtool: remove texlive dependency; see #21699
23:07 Ticket #32466 (firefox-x11@7.0.1 doesn't build: 10.5.8, ppc) closed by jeremyhu@…
wontfix: Nope, and it won't.
18:23 Changeset [87850] by ryandesign@…
graphviz-devel, graphviz-gui-devel, gvedit-devel: update to …
18:01 Ticket #31679 (xemacs: build failed on 10.7.2 & xcode 4.2 (clang)) closed by ryandesign@…
fixed: r87849.
18:00 Changeset [87849] by ryandesign@…
xemacs: use llvm-gcc-4.2 instead of clang; see #31679
17:58 Ticket #32462 (xemacs on mac osx lion) closed by ryandesign@…
duplicate: Duplicate of #31679.
17:51 Ticket #32468 (zorba @1.4.0 Compile error - build failure) closed by ryandesign@…
duplicate: Duplicate of #26592.
17:32 Changeset [87848] by ryandesign@…
youtube-dl: update to 2011.12.08; also install readme
17:03 Changeset [87847] by devans@…
upower: update to version 0.9.15.
17:03 Changeset [87846] by devans@…
policykit: update to version 0.103.
15:50 Changeset [87845] by raimue@…
devel/qbzr: Update to version 0.21.2
13:46 Ticket #32468 (zorba @1.4.0 Compile error - build failure) created by sshannin@…
Error when trying to build zorba @1.4.0 port. Error seems to be in build …
13:11 Ticket #32383 (root @5.30.03_0+fftw3 doesn't install libFFT.so) closed by pixilla@…
fixed: Changeset r87844
13:10 Ticket #32400 (update root to 5.32.00) closed by pixilla@…
fixed: Changeset r87844
12:33 Changeset [87844] by pixilla@…
science/root: - Maintainer patches. - Update version to 5.32.00. - If …
12:29 Ticket #32467 (GraphicsMagick: needs libtool library dependency) created by gentoo.integer@…
Small fix for GraphicsMagick mdmg building.
12:25 Changeset [87843] by devans@…
poppler: update to version 0.18.2, correct license.
12:23 Ticket #32466 (firefox-x11@7.0.1 doesn't build: 10.5.8, ppc) created by punch@…
The make gets to building config/nsinstall.c using clang but then fails on …
11:52 Ticket #32465 (py-pyquery @1.1.1 submission) created by larry.velazquez@…
As per #31083. It has subports for python25 through python32.
10:45 Ticket #32458 (py27-pytools port (new)) closed by macsforever2000@…
duplicate
10:10 Ticket #32464 (SymPy) created by sognat@…
SymPy is a Python library for symbolic mathematics. It aims to become a …
09:00 Ticket #32463 (ocaml: add X11 support) created by cedric.pasteur@…
Some libraries such as Graphics (eg. graphics.cma) are thus missing
08:52 Changeset [87842] by mmoll@…
graphics/ogre: don't use /opt/local in patches
08:28 Changeset [87841] by jwa@…
version bump to 0.39.1, adding a note, how to run in 32bit mode
07:41 Ticket #32462 (xemacs on mac osx lion) created by revenu@…
Hi all, the installation of xemacs-21.4 failed on my mac osx 10.7.2 I am …
07:41 main.log attached to TitleIndex by revenu@…
main.log after trying to install xemacs
07:32 Changeset [87840] by adfernandes@…
cross/arm-none-eabi-binutils: use llvm-gcc if clang is selected
07:29 Ticket #31525 (boost @1.47.0_0: shouldn't be compiled by clang++ 3.0) closed by adfernandes@…
fixed: Ghaaa - sorry. I was sure that I had tested using your sample.cpp
07:23 Changeset [87839] by adfernandes@…
devel/boost: just cannot use clang (#31525)
05:18 Ticket #31525 (boost @1.47.0_0: shouldn't be compiled by clang++ 3.0) reopened by takanori@…
This problem flared up again if Boost was upgraded to @1.48.0_1. ;-( How …
03:50 Ticket #32461 (yudit: error: extra qualification "SImage::" on member "getID") created by msz@…
MacOS X 10.6.8 Xcode 3.2.6 macport self-updated and upgraded all …
02:08 Ticket #32460 (beanstalkd failed to build) created by conradwt@…
beanstalkd failed to build on Mac OS 10.7.2 using Xcode 4.2.1.

12/07/11:

22:57 Ticket #32459 (py27-pytools port (new)) created by juhauser@…
Portfile for pytools <http://mathema.tician.de/software/pytools>.
22:53 Ticket #32458 (py27-pytools port (new)) created by juhauser@…
Portfile for pytools <http://mathema.tician.de/software/pytools>
22:00 Ticket #32456 (npm executable not found after installing nodejs port) reopened by conradwt@…
OK, I just installed it as a separate port and I'm getting the following …
21:48 Ticket #32447 (tortoisehg @2.1.2_0 does not work with mercurial @2.0_0) closed by ryandesign@…
duplicate
21:44 Ticket #32456 (npm executable not found after installing nodejs port) closed by ryandesign@…
invalid: npm is a separate port. Install that if you want npm.
21:33 Ticket #32457 (sphinx: update to current stable version) created by 2ge@…
Hi sphinx-search maintainer, on http://sphinxsearch.com/downloads/ is …
20:19 Changeset [87838] by singingwolfboy@…
browserlauncher2: switch to cvs checkout
18:35 Ticket #32456 (npm executable not found after installing nodejs port) created by conradwt@…
After installing nodejs, I noticed that the associated package manager, …
18:19 Ticket #32455 (glade3 +quartz variant doesn't build) created by garrigue@…
Currently the glade3 +quartz variant is disabled since ige-mac-integration …
16:24 Ticket #30731 (arm-none-eabi-binutils doesn't compile with newest Xcode (4D151a)) reopened by ryandesign@…
r87830 changes the compiler unconditionally to llvm-gcc-4.2. Did you not …
16:22 Ticket #31426 (arm-none-eabi-binutils install fails) reopened by ryandesign@…
r87830 changes the compiler unconditionally to llvm-gcc-4.2. The log shows …
15:01 Ticket #32454 (py27-twisted update to 11.1.0) created by larry.velazquez@…
This patch updates the py27-twisted port to 11.1.0 and adds a second …
14:54 Ticket #32453 (Add postgresql91 variant to py-psycopg2 port) created by shirshegsm@…
PostgreSQL 9.1 support.
14:51 Ticket #32452 (Use postgresql91 by default in py26-mapnik port) created by shirshegsm@…
Makes sense as 9.1 is default in most other places as far as I've checked.
14:48 Ticket #32451 (Add postgresql91 variant to gdal port) created by shirshegsm@…
PostgreSQL 9.1 support.
14:35 Ticket #32450 (openmpi: mpif90 doesn't work) created by totofg@…
When I run mpif90, I have the message: Unfortunately, this installation of …
14:25 Changeset [87837] by markd@…
Update to 0.8.7h.
13:31 Ticket #32449 (vcellid @0.1 port submission) created by abush84@…
depends on submitted port cell-id (Ticket #32448)
13:28 Ticket #32448 (cell-id @1.4.6 port submission) created by abush84@…
13:12 Ticket #32447 (tortoisehg @2.1.2_0 does not work with mercurial @2.0_0) created by athundt@…
Output of my shell session and the errors: […]
12:40 Ticket #32446 (txt2regex @0.8._0 update to 0.8_1) created by grrr@…
Update per ticket #32387.
12:30 Ticket #32302 (OGRE (Object-Oriented Graphics Rendering Engine) Static Port) closed by mmoll@…
fixed: I committed marin.saric's Portfile and patches in r87836, but installed …
12:29 Changeset [87836] by mmoll@…
graphics/ogre: static build, many patches. See #32302 and #30688.
12:16 Ticket #31169 (boost needs a new build system) closed by adfernandes@…
wontfix: Okay - I've played and played and played with this. The majority of it …
12:11 Ticket #32445 (ncdc 1.6 update) created by projects@…
A new version of ncdc has been released. Attached is my attempt at a patch …
12:06 Ticket #31171 (Don't build gcc ports with --enable-fully-dynamic-string) closed by adfernandes@…
fixed: I've now built and tested much code with gcc-4.6.2 on 10.6 and removing …
12:05 Changeset [87835] by adfernandes@…
lang/gcc46: remove --enable-fully-dynamic-string as per #31171 and …
12:03 Ticket #31844 (gcc46 fails to upgrade from 4.6.1 to 4.6.2) closed by adfernandes@…
duplicate: duplicates #31171
12:01 Ticket #32443 (Please update boost to 1.48.0) closed by adfernandes@…
fixed: fixed in r87834
12:01 Ticket #31864 (Boost @1.47.0 rev. 2 fails to build with openmpi variant on Mac OS X Lion ...) closed by adfernandes@…
fixed: fixed in r87834
12:00 Changeset [87834] by adfernandes@…
devel/boost: revbump to 1.48.0, should retroactively fix #31525 and close …
10:35 Ticket #31911 (py27-scientific @2.8 build error: numpy/arrayobject.h: No such file or ...) closed by adfernandes@…
fixed: This should be fixed in 2.9.1 - the scientificpython team is really bad …
10:34 Changeset [87833] by adfernandes@…
python/py-scientific: revbump to 2.9.1 and convert to subport system
10:33 Ticket #21286 (ppl build fails on Leopard) closed by adfernandes@…
fixed: should have been fixed quite a while ago with recent versions of the ppl …
10:29 Ticket #32444 (p5.12-net-ssleay: fails to create Makefile when perl's configured cc is ...) created by jonstef1667@…
I have been getting the following error when I run port upgrade outdated. …
10:09 Ticket #32388 (PPL @0.11.2 configure error need M4 >= 1.4.5) closed by adfernandes@…
fixed: fixed in r87832
10:08 Changeset [87832] by adfernandes@…
devel/ppl: added build dependency on m4 for #32388
10:06 Changeset [87831] by adfernandes@…
cross/arm-elf-gcc: version bump to 4.6.1
10:02 Ticket #30731 (arm-none-eabi-binutils doesn't compile with newest Xcode (4D151a)) closed by adfernandes@…
fixed: fixed in r87830
10:02 Ticket #31426 (arm-none-eabi-binutils install fails) closed by adfernandes@…
fixed: fixed in r87830
10:01 Changeset [87830] by adfernandes@…
cross/arm-none-eabi-binutils: build with llvm-gcc-4.2 to close #30731 and …
09:35 Ticket #32443 (Please update boost to 1.48.0) created by william@…
It would be great to have the latest version of Boost available via …
07:20 Changeset [87829] by adfernandes@…
devel/astyle: minor version bump to 2.02.1
05:40 Ticket #26783 (gobject-introspection build error) reopened by billmcn@…
This just started happening for me. OS X version 10.7.2 (Lion), Mac Ports …
04:57 Ticket #32442 (unison does not show manpage) created by veedeehjay@…
"unison -doc all" should show its complete documenation (a.k.a. …
04:10 Ticket #32441 (samba3 build failed on Lion) created by zoleg@…
build failed with this: […] build log is attached
04:06 Changeset [87828] by jmr@…
p5-html-stripscripts-parser: license
04:04 Changeset [87827] by jmr@…
p5-html-tiny: license
04:03 Changeset [87826] by jmr@…
p5-image-info: license
04:01 Changeset [87825] by jmr@…
p5-java: license
03:59 Changeset [87824] by jmr@…
p5-lingua-en-inflect-phrase: license
03:57 Changeset [87823] by jmr@…
p5-lingua-en-tagger: license
03:55 Changeset [87822] by ryandesign@…
py27-prettytable: modeline
03:54 Changeset [87821] by jmr@…
p5-lockfile-simple: license
03:54 Changeset [87820] by ryandesign@…
py27-prettytable: noarch
03:52 Changeset [87819] by jmr@…
p5-lwp-useragent-determined: license
01:08 Ticket #32440 (port install upx @3.07_0 failure with clang) created by qingyun.oracle@…
[…]
01:05 Changeset [87818] by ryandesign@…
p5-html-lint: update to 2.10, disable livecheck on subports
00:21 Ticket #32411 (glib2 compilation fails when /usr/local/include is unreadable) closed by ryandesign@…
invalid
00:04 Changeset [87817] by ryandesign@…
KoLmafia: copy instead of move in destroot phase
00:00 Changeset [87816] by ryandesign@…
KoLmafia: rewrite master_sites to avoid redirects
Note: See TracTimeline for information about the timeline view.