Timeline



Nov 6, 2013:

11:59 PM Ticket #41222 (Ports can't install tightvnc on Mac Os X 10.9) closed by ryandesign (Ryan Schmidt)
duplicate: Duplicate of #40862.
11:52 PM Ticket #41152 (strigi @0.7.8: error: reference to 'mutex' is ambiguous) closed by ryandesign (Ryan Schmidt)
fixed: Replying to ryandesign@…: > I will commit the first patch …
11:52 PM Changeset [113010] by ryandesign@…
strigi: fix build failure on Mavericks by renaming "mutex" variable …
11:52 PM Changeset in macports-ports [b914a8c0fee691044ab93fc27679854de2f58050]boost_1.72.0_update by ryandesign (Ryan Schmidt)
strigi: fix build failure on Mavericks by renaming "mutex" variable …
11:42 PM Changeset [113009] by ryandesign@…
fityk: append to, rather than overwriting, depends_build
11:42 PM Changeset in macports-ports [8c4887a004a755ea82008b2a5b057a0cc22e38a8]boost_1.72.0_update by ryandesign (Ryan Schmidt)
fityk: append to, rather than overwriting, depends_build git-svn-id: …
11:35 PM Ticket #41240 (umbrello @4.11.2 - build failure) created by crazyhorse671@…
Umbrello fails to build on Mavericks.
11:29 PM Ticket #41237 (selfupdate 2.2.0 -> 2.2.1 failing) closed by ryandesign (Ryan Schmidt)
invalid: ProblemHotlist#tclConfig
11:28 PM Ticket #41236 (selfupdate to 2.2.1 fails: configure: error: cannot run C compiled ...) closed by ryandesign (Ryan Schmidt)
invalid
11:16 PM Ticket #41214 (libpaper 1.1.24 checksum mismatch) reopened by arademacher@…
10:07 PM Changeset [113008] by mk@…
makeicns: apply patch for Mavericks (see issue #40869)
10:07 PM Changeset in macports-ports [b1206a9c236f1d291cf46f71854897cf3c5f4211]boost_1.72.0_update by mkae (Marko Käning)
makeicns: apply patch for Mavericks (see issue …
9:52 PM Changeset [113007] by dluke@…
bind9: version bump, update to 9.9.4-P1
9:52 PM Changeset in macports-ports [d81b74768cba2ecb81b6acd0a9b74e3a8e2130fe]boost_1.72.0_update by danielluke (Daniel J. Luke)
bind9: version bump, update to 9.9.4-P1 git-svn-id: …
9:23 PM Ticket #41214 (libpaper 1.1.24 checksum mismatch) closed by ci42
invalid: Replying to arademacher@…: > I'm not sure what the …
9:06 PM Ticket #41239 (Guide: section "2.1. Install X11" is out of date) created by zhimingwangpublic@…
The section "2.1. Install X11" of MacPorts Guide (guide.macports.org) …
9:01 PM Ticket #41228 (netcdf build failure) closed by tenomoto (Takeshi Enomoto)
fixed: Thanks for reporting this problem. This is due to the patch that …
8:53 PM Changeset [113006] by takeshi@…
netcdf: fix build failure due to the patch introduced in r112984, …
8:53 PM Changeset in macports-ports [8355bc360174fa45458dacfa7eec7c56fc5014a6]boost_1.72.0_update by Takeshi Enomoto <takeshi@…>
netcdf: fix build failure due to the patch introduced in …
8:46 PM Ticket #41238 (Octave parcellfun panics) created by trolin421
I updated MacPorts yesterday, and now the parcellfun function from the …
8:31 PM Ticket #41237 (selfupdate 2.2.0 -> 2.2.1 failing) created by jaccovanbuuren
Xcode (5.0.1 5A2053) is installed, including Commandline tools. […]
8:26 PM Changeset [113005] by jwa@…
TexShop3: version bump to 3.26, modifying the build for 10.9, changing …
8:26 PM Changeset in macports-ports [3fd48bce06d4ff6d2e513cc621658f68659d2347]boost_1.72.0_update by jyrkiwahlstedt
TexShop3: version bump to 3.26, modifying the build for 10.9, changing …
7:50 PM Ticket #41236 (selfupdate to 2.2.1 fails: configure: error: cannot run C compiled ...) created by paul@…
I'm on OSX 10.9.0 (13A603) with MacPorts 2.2.0 installed, and …
7:40 PM Ticket #41214 (libpaper 1.1.24 checksum mismatch) reopened by arademacher@…
7:09 PM Ticket #41217 (m4 @1.4.16: C compiler cannot create executables) closed by ryandesign (Ryan Schmidt)
invalid: m4 builds fine on Mavericks. You haven't installed the Xcode command …
7:06 PM Ticket #41197 (perl5.8 : Error while installing perl5.8 fetch failed) closed by ryandesign (Ryan Schmidt)
duplicate
7:01 PM Ticket #40749 (highlight: update to 3.16) closed by ryandesign (Ryan Schmidt)
fixed: r113004 (maintainer timeout)
7:01 PM Changeset [113004] by ryandesign@…
highlight: update to 3.16.1 (#40749, maintainer timeout)
7:01 PM Changeset in macports-ports [c8f67a4d8da06635ac8a7f9b31b0558926d064b2]boost_1.72.0_update by ryandesign (Ryan Schmidt)
highlight: update to 3.16.1 (https://trac.macports.org/ticket/40749, …
6:50 PM Changeset [113003] by michaelld@…
gr-fosphor: new port.
6:50 PM Changeset in macports-ports [d983a82e0e214e7b237aeeb9e13457bb6dc43680]boost_1.72.0_update by michaelld (Michael Dickens)
gr-fosphor: new port. git-svn-id: …
6:47 PM Changeset [113002] by ryandesign@…
fping: whitespace changes; add modeline
6:47 PM Changeset in macports-ports [26d899230a2abf93f7d7a4a9e0f2540cbfcea719]boost_1.72.0_update by ryandesign (Ryan Schmidt)
fping: whitespace changes; add modeline git-svn-id: …
6:45 PM Ticket #41233 (fping: update to 3.7) closed by ryandesign (Ryan Schmidt)
fixed: Committed in r113001 with these changes: * removed revision * fixed …
6:44 PM Changeset [113001] by ryandesign@…
fping: update to 3.7 (#41233)
6:44 PM Changeset in macports-ports [d9c3aaa0e10ca9f0766d139614b96538d914392f]boost_1.72.0_update by ryandesign (Ryan Schmidt)
fping: update to 3.7 (https://trac.macports.org/ticket/41233) …
6:38 PM Ticket #41235 (Macports PHP IPC enhancement) closed by ryandesign (Ryan Schmidt)
duplicate: Duplicate of #38316.
6:34 PM Ticket #41225 (Error: Processing of port strigi failed when trying to install kde4-kile) closed by ryandesign (Ryan Schmidt)
duplicate: Duplicate of #41152
5:57 PM Changeset [113000] by eborisch@…
mpich-devel and sub-ports: Update to 3.1rc1
5:57 PM Changeset in macports-ports [d2b0b5e590977b7f2483e593072368944afd375c]boost_1.72.0_update by Eric A. Borisch <eborisch@…>
mpich-devel and sub-ports: Update to 3.1rc1 git-svn-id: …
5:20 PM Ticket #41235 (Macports PHP IPC enhancement) created by mantas@…
Currently, only main php5 package allows +ipc to be specified. The …
5:19 PM Ticket #41234 (port request: 'unoconv') created by KurtPfeifle (Kurt Pfeifle)
unoconv (Universal Office Converter) is a command line tool to …
4:57 PM Ticket #41233 (fping: update to 3.7) created by Schamschula (Marius Schamschula)
MacPorts is still building the abandoned branch of fping. The current …
4:55 PM Ticket #41232 (port request: 'fntsample' with 'pdfoutline') created by KurtPfeifle (Kurt Pfeifle)
'fntsample' is a commandline tool that lets you create sample PDF …
4:50 PM Changeset [112999] by michaelld@…
gnuradio: + rearrange wxWidgets.use to be at top; + make pkgconfig a …
4:50 PM Changeset in macports-ports [c26283e5e763c62174ac4e413fa416480f16df6d]boost_1.72.0_update by michaelld (Michael Dickens)
gnuradio: + rearrange wxWidgets.use to be at top; + make pkgconfig a …
4:45 PM Changeset [112998] by michaelld@…
uhd: + remove top-level include path, such that internal headers are …
4:45 PM Changeset in macports-ports [e40a0186169161237ab62f4e616be1264393984f]boost_1.72.0_update by michaelld (Michael Dickens)
uhd: + remove top-level include path, such that internal headers are …
3:50 PM Ticket #41231 (highlight 3.15 build fails under Mavericks) created by Schamschula (Marius Schamschula)
While building highlight 3.15 under Mavericks I get the following link …
3:10 PM Ticket #41230 (port request: pdfresurrect) created by KurtPfeifle (Kurt Pfeifle)
pdfresurrect is a commandline tool to analyze PDF documents. It's main …
3:06 PM Ticket #41173 (Bash 4.2.25 Causes Kernel Panic) closed by raimue (Rainer Müller)
invalid: With this assertion message, I found similar bug reports against …
2:42 PM Ticket #41229 (easytag @2.1.7 Building fails on Mavericks) created by jochen@…
Building of easytag fails on Mavericks. All needed dependencies were …
2:41 PM Ticket #41228 (netcdf build failure) created by mf2k (Frank Schima)
I'm not sure if this is a Mavericks specific error: […]
2:35 PM Changeset [112997] by michaelld@…
hackrf: remove top-level library path, such that internal libraries …
2:35 PM Changeset in macports-ports [17df53f99e315f4a2c74ce73e921547fbbf78bb1]boost_1.72.0_update by michaelld (Michael Dickens)
hackrf: remove top-level library path, such that internal libraries …
2:34 PM Changeset [112996] by michaelld@…
gr-osmosdr: remove top-level library path, such that internal …
2:34 PM Changeset in macports-ports [a5ceda8a97da2b2e898ba412696dfbf04994a3ba]boost_1.72.0_update by michaelld (Michael Dickens)
gr-osmosdr: remove top-level library path, such that internal …
2:33 PM Changeset [112995] by michaelld@…
rtl-sdr: + add comment about removing the top-level include path; + …
2:33 PM Changeset in macports-ports [62f7ecf9a9ac172812ccc73ee2016dc0e1dd6d98]boost_1.72.0_update by michaelld (Michael Dickens)
rtl-sdr: + add comment about removing the top-level include path; + …
2:32 PM Ticket #41227 (New port: po4a and missing depends) created by odyx@…
Hi, in the course of the colobot [0] packaging for MacOS, I've come …
2:32 PM Changeset [112994] by michaelld@…
gnuradio: + remove top-level include path, such that internal headers …
2:32 PM Changeset in macports-ports [470533fc1a4ce2b2b3238e06d83c027c31d5e631]boost_1.72.0_update by michaelld (Michael Dickens)
gnuradio: + remove top-level include path, such that internal headers …
2:06 PM Ticket #41226 (gmt4 @4.5.9_0: update to 4.5.11) created by florian@…
Attached is the Portfile patch to upgrade gmt4 from 4.5.9 to 4.5.11.
2:01 PM Changeset [112993] by michaelld@…
gr-osmosdr: + update port to 8b3f711f (20131105); + update legacy to …
2:01 PM Changeset in macports-ports [e1d144a37eaf84d6537ccfce6444fff68752bf1c]boost_1.72.0_update by michaelld (Michael Dickens)
gr-osmosdr: + update port to 8b3f711f (20131105); + update legacy to …
1:58 PM Changeset [112992] by michaelld@…
hackrf: remove -I${prefix}/include from configure flags, such that the …
1:58 PM Changeset in macports-ports [34e8bb856faa3423f32296d5604152695bcb86c3]boost_1.72.0_update by michaelld (Michael Dickens)
hackrf: remove -I${prefix}/include from configure flags, such that the …
1:52 PM Changeset [112991] by michaelld@…
rtl-sdr: + update to c5b8a213 (20131105); + remove -I${prefix}/include …
1:52 PM Changeset in macports-ports [30bebe40dd2a03a41fe5d2bb17b2d5594014b6a4]boost_1.72.0_update by michaelld (Michael Dickens)
rtl-sdr: + update to c5b8a213 (20131105); + remove -I${prefix}/include …
1:46 PM Ticket #41179 (wemux @2.2.0_0 points to file in /etc instead of ${prefix}/etc) closed by g5pw (Aljaž Srebrnič)
fixed: Fixed in r112990, thanks.
1:45 PM Changeset [112990] by g5pw@…
devel/wemux: patch wemux to look for configuration in $prefix revbump
1:45 PM Changeset in macports-ports [aff450d9f5ddc5b149f2f732d5bb4260fd80f41d]boost_1.72.0_update by g5pw (Aljaž Srebrnič)
devel/wemux: patch wemux to look for configuration in $prefix …
1:45 PM Changeset [112989] by michaelld@…
hackrf: update to 3ed01126 (20131105).
1:45 PM Changeset in macports-ports [43241e46b4a9ffbdff4786fa465103e574334d4c]boost_1.72.0_update by michaelld (Michael Dickens)
hackrf: update to 3ed01126 (20131105). git-svn-id: …
1:39 PM Ticket #41225 (Error: Processing of port strigi failed when trying to install kde4-kile) created by david.halpern@…
I received an error when trying to install kde4-kile: […] See …
1:31 PM Ticket #40139 (frescobaldi @2.0.10) closed by g5pw (Aljaž Srebrnič)
fixed: Commited in r112987, thanks for the patience.
1:30 PM Changeset [112988] by takeshi@…
sam2p: updated for 0.49.2
1:30 PM Changeset in macports-ports [b395ca5b142fa42093dc2760b34086aa4e84d01d]boost_1.72.0_update by Takeshi Enomoto <takeshi@…>
sam2p: updated for 0.49.2 git-svn-id: …
1:30 PM Changeset [112987] by g5pw@…
editors/frescobaldi: new port, #40139
1:30 PM Changeset in macports-ports [6ffad7b2b294581e52362326a145ad40a73c28d6]boost_1.72.0_update by g5pw (Aljaž Srebrnič)
editors/frescobaldi: new port, …
12:37 PM Ticket #41224 (emacs-app @24.3_1 default-directory on Mavericks) created by bouttier__macports@…
I just upgraded from Lion to Mavericks and, after reinstalling …
10:25 AM Ticket #41223 (vineserver: Undefined symbols _setKeyModifiers) created by bukovskiy.k@…
Log-> […]
10:06 AM Ticket #41222 (Ports can't install tightvnc on Mac Os X 10.9) created by bukovskiy.k@…
Error: Processing of port tightvnc failed Log -> […]
9:37 AM Ticket #41221 (py33-pyopencl does not install on Mavericks) created by russel@…
MacPorts has successfully updated for Mountain Lion -> Mavericks, all …
9:27 AM Ticket #41220 (gwenview @4.11.2 importer/fileutils.cpp:133:10: error: use of ...) created by wahspilihp (Philip Shaw)
Gwenview won't build on Mavericks, I believe the following is the …
9:20 AM Ticket #41219 (zeroc-ice35 fails to build on Mavericks) created by patrick.sizun@…
The zero-ice35 fails to build on OS X 10.9 Mavericks. The resulting …
9:16 AM Changeset [112986] by takeshi@…
gnudatalangauge: terminate if port:antlr is installed
9:16 AM Changeset in macports-ports [85eb59eb2f696f9de27681248f5c11d7d7f023ef]boost_1.72.0_update by Takeshi Enomoto <takeshi@…>
gnudatalangauge: terminate if port:antlr is installed git-svn-id: …
9:15 AM Ticket #41218 (fityk @1.2.1_1 +universal compile error - build failure) created by uvw2@…
The building of fityk failed in OS X 10.9. […]
8:48 AM Ticket #41214 (libpaper 1.1.24 checksum mismatch) closed by ci42
invalid: The distfile fetched from the location mentioned in your log as well …
6:02 AM Changeset [112985] by takeshi@…
nco: delete antlr from depends_lib and add it to depends_build
6:02 AM Changeset in macports-ports [d1e5f28a0d685170dd91e700e0de2ee20650c350]boost_1.72.0_update by Takeshi Enomoto <takeshi@…>
nco: delete antlr from depends_lib and add it to depends_build …
4:48 AM Ticket #41217 (m4 @1.4.16: C compiler cannot create executables) created by kc5tja@…
After installing Mavericks (MacOS 10.9) on a MacBook Air, XCode 5.0.1, …
4:27 AM Ticket #41207 (netcdf @4.3.0: build fails on snow leopard) closed by tenomoto (Takeshi Enomoto)
fixed: It seems that this has been a known but unaddressed issue …
4:25 AM Ticket #41216 (openjpeg: build fails when openjpeg15 is active) created by drkatastro@…
openjpeg 2.0.0 is unable to upgrade since the move to Mavericks.
4:23 AM Changeset [112984] by takeshi@…
netcdf: fix build failure in libdap2, closing #41207
4:23 AM Changeset in macports-ports [40eab5b5ea10b1d584d03586571d5a0dd33e8ec0]boost_1.72.0_update by Takeshi Enomoto <takeshi@…>
netcdf: fix build failure in libdap2, closing …
1:57 AM Ticket #41215 (Port upgrade fails after OS upgrade to Mavericks) created by christopherbalz@…
Either: […] or […] produces: […] Checking the log: […] …
12:12 AM Changeset [112983] by devans@…
inkscape-devel: update to bzr 12779, improved plotter support, …
12:12 AM Changeset in macports-ports [5e502715957b1aae963a5f224e6b3036e7aa84f1]boost_1.72.0_update by dbevans (David B. Evans)
inkscape-devel: update to bzr 12779, improved plotter support, …

Nov 5, 2013:

11:51 PM Ticket #41214 (libpaper 1.1.24 checksum mismatch) created by arademacher@…
Checksum mismatch when attempting to install libpaper […]
11:30 PM Changeset [112982] by sean@…
dmd-tools: update to 2.064
11:30 PM Changeset in macports-ports [8f717fea86fdd7b0ab103226b5feff72ac6e5f1f]boost_1.72.0_update by seanfarley (Sean Farley)
dmd-tools: update to 2.064 git-svn-id: …
11:30 PM Changeset [112981] by sean@…
dmd-doc: update to 2.064
11:30 PM Changeset in macports-ports [5f75f7d57dfe40fc6d0b355f357c618a46d3a185]boost_1.72.0_update by seanfarley (Sean Farley)
dmd-doc: update to 2.064 git-svn-id: …
11:30 PM Changeset [112980] by sean@…
phobos: update to 2.064
11:30 PM Changeset in macports-ports [b5181b0b7f54856ffd8c6696334d9b7f0fb8dae1]boost_1.72.0_update by seanfarley (Sean Farley)
phobos: update to 2.064 git-svn-id: …
11:30 PM Changeset [112979] by sean@…
druntime: update to 2.064
11:30 PM Changeset in macports-ports [f5981ecb33f1009632587953bb5467e6072a058b]boost_1.72.0_update by seanfarley (Sean Farley)
druntime: update to 2.064 git-svn-id: …
11:30 PM Changeset [112978] by sean@…
dmd: update to 2.064
11:30 PM Changeset in macports-ports [f606966872efed7a4d982b50ccf13f6f3f0b017a]boost_1.72.0_update by seanfarley (Sean Farley)
dmd: update to 2.064 git-svn-id: …
11:30 PM Changeset [112977] by sean@…
mercurial-devel: update to 2.8
11:30 PM Changeset in macports-ports [1fa35ab2014d00959cbd8720a23cdaa095d2b7dd]boost_1.72.0_update by seanfarley (Sean Farley)
mercurial-devel: update to 2.8 git-svn-id: …
11:30 PM Changeset [112976] by sean@…
mercurial: update to 2.8
11:30 PM Changeset in macports-ports [4b914da60dd0e14c710171b49c40ecd58f6636a6]boost_1.72.0_update by seanfarley (Sean Farley)
mercurial: update to 2.8 git-svn-id: …
10:44 PM Ticket #41213 (jigdo: use of undelared identifier 'setenv' in compat.hh) created by whcordis@…
Got the below error when attempting to compile the current version of …
10:18 PM Changeset [112975] by mk@…
skrooge: update to 1.8.0
10:18 PM Changeset in macports-ports [ad53efaff2268b1194366c4e06066453398cebb2]boost_1.72.0_update by mkae (Marko Käning)
skrooge: update to 1.8.0 git-svn-id: …
10:18 PM Changeset [112974] by mk@…
qjson: upgrade to version 0.8.1
10:18 PM Changeset in macports-ports [49576202125adef04abbbcc3100d590292ec988c]boost_1.72.0_update by mkae (Marko Käning)
qjson: upgrade to version 0.8.1 git-svn-id: …
9:51 PM Ticket #41212 (cmake: CMAKE_OSX_DEPLOYMENT_TARGET is '10.9' but the matching SDK does ...) created by h.ee@…
when I tried to install macports, it showed error as: […] my …
9:30 PM Ticket #41211 (Octave isn't supported under Mavericks) created by mohammed.mahfoudh@…
I am attaching the log here: […]
8:40 PM Ticket #41210 (netcdf @4.3.0_0+dap+netcdf4: make fails) closed by larryv (Lawrence Velázquez)
duplicate: Duplicate of #41207.
8:18 PM Ticket #40985 (rdfind 1.3.0 fails to build on Mavericks) closed by nerdling (Jeremy L)
fixed: Fixed the checksums, and added upstream's sha1. r112973.
8:17 PM Changeset [112973] by snc@…
rdfind: * maintainer timeout * update to 1.3.4 * fixes mavericks …
8:17 PM Changeset in macports-ports [053e7449823f61b96c49508b4ca3d8af445a8125]boost_1.72.0_update by nerdling (Jeremy L)
rdfind: * maintainer timeout * update to 1.3.4 * fixes mavericks …
8:07 PM Ticket #41210 (netcdf @4.3.0_0+dap+netcdf4: make fails) created by phildobbin@…
Whilst updating ports netcdf fails at the make stage. Enclosed is main.log
8:07 PM Ticket #41209 (octave-nnet: update to 0.1.13) created by Schamschula (Marius Schamschula)
The octave-nnet package is out of date: current version = 0.1.13 …
8:05 PM Changeset [112972] by jeremyhu@…
gnuradio: Error out early on Mavericks
8:05 PM Changeset in macports-ports [fc5a6a9867d6c1baf583d0d8ea6d78693918585b]boost_1.72.0_update by jeremyhu (Jeremy Huddleston Sequoia)
gnuradio: Error out early on Mavericks git-svn-id: …
7:31 PM Ticket #41208 (rx: extract fails) created by basmac
rx fails, debug attached
7:26 PM Ticket #41207 (netcdf @4.3.0: build fails on snow leopard) created by mndavidoff (Monte Davidoff)
Building netcdf 4.3.0 fails on Mac OS X 10.6.8. The previous version …
7:21 PM Ticket #41205 (openocd: Add ti-icdi support) closed by nerdling (Jeremy L)
fixed: Added in r112971.
7:21 PM Changeset [112971] by snc@…
openocd: add Tiva and Stellaris Launchpad support, #41205
7:21 PM Changeset in macports-ports [a0c792464097306254c064c13bcf6380f38203ed]boost_1.72.0_update by nerdling (Jeremy L)
openocd: add Tiva and Stellaris Launchpad support, …
7:13 PM Changeset [112970] by ryandesign@…
fontforge: remove legacy compatibility variant
7:13 PM Changeset in macports-ports [8eb302292048834ad683c12f99b02dc8c7b0d42e]boost_1.72.0_update by ryandesign (Ryan Schmidt)
fontforge: remove legacy compatibility variant git-svn-id: …
7:10 PM Ticket #41198 (salt: PortGroup Python 1.0 could not be located. Python-1.0.tcl does ...) closed by ryandesign (Ryan Schmidt)
fixed: r112969
7:09 PM Changeset [112969] by ryandesign@…
salt: fix incorrect case in portgroup name (#41198)
7:09 PM Changeset in macports-ports [5007023212210c13f47c7c2288aff7e9d3939aad]boost_1.72.0_update by ryandesign (Ryan Schmidt)
salt: fix incorrect case in portgroup name …
7:06 PM Ticket #41206 (Kismet 2011-01-R1 does not compile and is dated.) created by marcus@…
Kismet 2011-01-R1, the current MacPort version, does not compile under …
6:54 PM Ticket #41204 (graphite2 @1.2.3+universal configure failure) closed by ryandesign (Ryan Schmidt)
duplicate: Duplicate of #41142, which is already fixed. Run "sudo port selfupdate".
6:26 PM Changeset [112968] by stromnov@…
py-scikit-image: update to version 0.9.3
6:26 PM Changeset in macports-ports [0c764811ea6df814bd3a7dbd3ea18cdcce7e487e]boost_1.72.0_update by stromnov (Andrew Stromnov)
py-scikit-image: update to version 0.9.3 git-svn-id: …
6:21 PM Ticket #41192 (rcs @5.8.2 / OSX 10.9 build failure) closed by ryandesign (Ryan Schmidt)
fixed: MacPorts does not support specifying a version at install time; you'll …
6:13 PM Changeset [112967] by stromnov@…
py-kombu: update to version 3.0.3
6:13 PM Changeset in macports-ports [1476cfe968fe6845c9fe6e6f6fed91a6e49ccf3a]boost_1.72.0_update by stromnov (Andrew Stromnov)
py-kombu: update to version 3.0.3 git-svn-id: …
6:11 PM Ticket #41205 (openocd: Add ti-icdi support) created by hardwhack
Add variant to openocd port to add support for ti-icdi (Tiva and …
6:11 PM Changeset [112966] by stromnov@…
py-billiard: update to version 3.3.0.1
6:11 PM Changeset in macports-ports [6c7692307dc1266318193167ad94934b484cb1d0]boost_1.72.0_update by stromnov (Andrew Stromnov)
py-billiard: update to version 3.3.0.1 git-svn-id: …
6:09 PM Changeset [112965] by stromnov@…
py-amqp: update to version 1.3.2
6:09 PM Changeset in macports-ports [d96c32b136fbdd47c0c5c994e083f4e32fac7c7a]boost_1.72.0_update by stromnov (Andrew Stromnov)
py-amqp: update to version 1.3.2 git-svn-id: …
5:26 PM Ticket #41192 (rcs @5.8.2 / OSX 10.9 build failure) reopened by inyeollee
I still have the same failure. Attempting to install rcs 5.9.1 still …
4:47 PM Changeset [112964] by raimue@…
x11/xdaliclock: Update to version 2.39
4:47 PM Changeset in macports-ports [5c527cd8b62021fc50532fefa3f8c08bac22ea88]boost_1.72.0_update by raimue (Rainer Müller)
x11/xdaliclock: Update to version 2.39 git-svn-id: …
4:20 PM Ticket #41204 (graphite2 @1.2.3+universal configure failure) created by glacial.abyss@…
OS 10.9 Mavericks, Xcode 5.0.1 (5A2053). graphite2 fails in the …
4:05 PM Changeset [112963] by michaelld@…
gnuradio: update devel to 466c218e and next to 3139daa3, both 20131104.
4:05 PM Changeset in macports-ports [7a21b030e22f2c5b73b873ae9e66d683a4c6472e]boost_1.72.0_update by michaelld (Michael Dickens)
gnuradio: update devel to 466c218e and next to 3139daa3, both …
3:07 PM Ticket #41203 (gmt5 update to 5.1.0 and related packages) created by florian@…
I have two updates and one submission here: * gmt5 5.0.0b -> 5.1.0 * …
2:57 PM Ticket #41201 (Can't install SciPy stack on Mavericks) closed by ci42
worksforme: This is was not clean atttempt. Please try again: […] Reopen the …
2:13 PM Ticket #41202 (qtiplot @0.9.8.9_7 crashes with segmentation fault: 11) created by michel.rickhaus@…
After sucessfully compiling qtiplot I get a segmentation fault: 11 and …
2:03 PM Ticket #41201 (Can't install SciPy stack on Mavericks) created by richard.stephens@…
I get and error when I try to install the SciPy stack using the …
1:56 PM Changeset [112962] by eborisch@…
py-spyder-devel: convert UTF-8 to en_US.UTF-8 on startup; handle unset …
1:56 PM Changeset in macports-ports [7206e9f7b786d6c73ea243c11519d990f5393698]boost_1.72.0_update by Eric A. Borisch <eborisch@…>
py-spyder-devel: convert UTF-8 to en_US.UTF-8 on startup; handle unset …
12:40 PM Changeset [112961] by takeshi@…
netcdf-fortran: Fortran variants a la PortfileRecipes#fortran
12:40 PM Changeset in macports-ports [6bd72eb635aa018dd2d74994be81d9a5901ce907]boost_1.72.0_update by Takeshi Enomoto <takeshi@…>
netcdf-fortran: Fortran variants a la PortfileRecipes#fortran
12:35 PM Changeset [112960] by takeshi@…
netcdf: revamped for 4.3.0
12:35 PM Changeset in macports-ports [ff95a6763fff3fdaa2e5c2a673e284e54e7a6aa7]boost_1.72.0_update by Takeshi Enomoto <takeshi@…>
netcdf: revamped for 4.3.0 git-svn-id: …
12:11 PM Ticket #41200 (poppler 0.24.3_0 does not build because of missing symbol ...) created by ballapete (Peter Dyballa)
This is the error on Mac OS X 10.6.8: […] It certainly is related …
11:41 AM Ticket #41199 (gconf @2.32.4_3 does not build because of missing symbol ...) created by ballapete (Peter Dyballa)
During the build process on Mac OS X 10.6.8 this happens: […]
11:27 AM Ticket #41198 (salt: PortGroup Python 1.0 could not be located. Python-1.0.tcl does ...) created by ballapete (Peter Dyballa)
At the end of 'port selfupdate' port complains: […] This happens …
10:10 AM Ticket #41197 (perl5.8 : Error while installing perl5.8 fetch failed) created by killian@…
Hello, After upgrade on OSX 10.9 Mavericks the "port upgrade outdated" …
10:09 AM Ticket #41196 (py27-keybinder @0.3.0_1: No rule to make target ...) created by marc.cortinas@…
Everytime i've tried: […] I see this error message: […]
9:52 AM Ticket #41195 (py27-keybinder: build fails) closed by ci42
invalid: This report is useless. Please try a clean install. If it fails reopen …
9:17 AM Ticket #41195 (py27-keybinder: build fails) created by marc.cortinas@…
I've tried install terminator but i can do it because i've this …
9:14 AM Ticket #39568 (VTK @4.4.2 fetch failed: VTK-4.4.2.tar.gz doesn't seem to exist) closed by ryandesign (Ryan Schmidt)
fixed: r112959 (maintainer timeout)
9:14 AM Changeset [112959] by ryandesign@…
VTK: clear distfiles so that the message about this port being …
9:14 AM Changeset in macports-ports [4a2472c6f5ddc779685593a2b57d5a5e978de6a7]boost_1.72.0_update by ryandesign (Ryan Schmidt)
VTK: clear distfiles so that the message about this port being …
9:09 AM Ticket #41149 (vtk5: error: expected "FILENAME" or <FILENAME>) closed by ryandesign (Ryan Schmidt)
fixed: Should be fixed in r112958.
9:08 AM Changeset [112958] by ryandesign@…
vtk5: fix build failure when freetype's ft2build.h is found instead of …
9:08 AM Changeset in macports-ports [120f89f4e1e1718863e6da5c95a394f6a632b814]boost_1.72.0_update by ryandesign (Ryan Schmidt)
vtk5: fix build failure when freetype's ft2build.h is found instead of …
8:51 AM Ticket #41194 (vtk-devel: replace by vtk5) created by ryandesign (Ryan Schmidt)
Can the vtk-devel port be marked replaced_by vtk5? It appears to be …
8:37 AM Ticket #41143 (ffmpeg STILL does not build under PPC Tiger!) closed by neverpanic (Clemens Lang)
fixed
6:17 AM Ticket #41124 (graphviz uses a fuzzy check whether alloca(3) uses malloc(3), which ...) closed by ryandesign (Ryan Schmidt)
fixed: Upstream has applied your patch.
5:49 AM Ticket #41193 (Atlas could not detect any fortran compiler) closed by ryandesign (Ryan Schmidt)
invalid: Replying to gorkemozkaya@…: > I am trying to install …
4:25 AM Ticket #41193 (Atlas could not detect any fortran compiler) created by gorkemozkaya@…
I am trying to install octave, but it gets stuck at installing atlas, …
3:49 AM Changeset [112957] by ryandesign@…
synfigstudio: add intltool build dependency
3:49 AM Changeset in macports-ports [592dc48cc5e72714b8cea3bf1b13dc6dd4297057]boost_1.72.0_update by ryandesign (Ryan Schmidt)
synfigstudio: add intltool build dependency git-svn-id: …
3:36 AM Changeset [112956] by ryandesign@…
synfig, synfigstudio: update to 0.64.1 ETL: update to 0.04.17
3:36 AM Changeset in macports-ports [6bc9838de80a0f96ef645935a38e7de23527de10]boost_1.72.0_update by ryandesign (Ryan Schmidt)
synfig, synfigstudio: update to 0.64.1 ETL: update to 0.04.17 …
3:12 AM Ticket #40886 (apple-gcc42, llvm-gcc42: build fails: build_gcc: Permission denied) closed by ryandesign (Ryan Schmidt)
fixed: r112955
3:11 AM Changeset [112955] by ryandesign@…
apple-gcc42, llvm-gcc42: don't rely on correct permissions on files in …
3:11 AM Changeset in macports-ports [14e837870ae54883af6dcf8da4578cb80897e57d]boost_1.72.0_update by ryandesign (Ryan Schmidt)
apple-gcc42, llvm-gcc42: don't rely on correct permissions on files in …
3:08 AM Ticket #41064 (nco build failure on Mac OS 10.9) closed by ryandesign (Ryan Schmidt)
worksforme
3:07 AM Changeset [112954] by ryandesign@…
phpmyadmin: update to 4.0.9
3:07 AM Changeset in macports-ports [75e21b4dce5f6948d8625bc8b7a4c7beb04b4339]boost_1.72.0_update by ryandesign (Ryan Schmidt)
phpmyadmin: update to 4.0.9 git-svn-id: …
2:45 AM Ticket #41192 (rcs @5.8.2 / OSX 10.9 build failure) closed by ryandesign (Ryan Schmidt)
fixed: r112953 seems to have fixed this, either by updating to 5.9.1 or by …
2:42 AM Changeset [112953] by ryandesign@…
rcs: update to 5.9.1; remove autoreconf because I have no recollection …
2:42 AM Changeset in macports-ports [8243fd8b65021223ae32486d6d632fbd9c96ac23]boost_1.72.0_update by ryandesign (Ryan Schmidt)
rcs: update to 5.9.1; remove autoreconf because I have no recollection …
2:25 AM Changeset [112952] by ryandesign@…
rcs: fix release date in manpages
2:25 AM Changeset in macports-ports [c3c4b23b39c7bb724b40713e7d8b95704b851c7e]boost_1.72.0_update by ryandesign (Ryan Schmidt)
rcs: fix release date in manpages git-svn-id: …
2:12 AM Ticket #41191 (Add Salt to MacPorts) closed by ryandesign (Ryan Schmidt)
fixed: Committed in r112951 with these changes: * removed unnecessary …
2:11 AM Changeset [112951] by ryandesign@…
salt: new port, version 0.17.1 (#41191)
2:11 AM Changeset in macports-ports [6cdc6f1f90fc1b4294bdbdc9968fd47dc38a193a]boost_1.72.0_update by ryandesign (Ryan Schmidt)
salt: new port, version 0.17.1 …
1:58 AM Changeset [112950] by ryandesign@…
t1utils: update to 1.38
1:58 AM Changeset in macports-ports [9a9f9a0b38f4da738b387a3d67d53f163076ca3a]boost_1.72.0_update by ryandesign (Ryan Schmidt)
t1utils: update to 1.38 git-svn-id: …
1:57 AM Changeset [112949] by ryandesign@…
t1utils: fix livecheck
1:57 AM Changeset in macports-ports [65a3886245f2f2bb134322cee691026a49a26d61]boost_1.72.0_update by ryandesign (Ryan Schmidt)
t1utils: fix livecheck git-svn-id: …
1:55 AM Ticket #41192 (rcs @5.8.2 / OSX 10.9 build failure) created by inyeollee
Error message: […] Log file attached.
1:44 AM Ticket #41189 (t1utils @1.37: license should be GPL-2+) closed by larryv (Lawrence Velázquez)
invalid
1:19 AM Changeset [112948] by cal@…
ffmpeg{,-devel}: move block calling configure.args-delete after line …
1:19 AM Changeset in macports-ports [08612533a97d786fdf5c13f0b1b9fdd7b429b367]boost_1.72.0_update by neverpanic (Clemens Lang)
ffmpeg{,-devel}: move block calling configure.args-delete after line …
1:09 AM Ticket #41143 (ffmpeg STILL does not build under PPC Tiger!) reopened by ultrajoe@…
12:49 AM Changeset [112947] by cal@…
nxproxy, nxcomp: Don't get stuck when trying to call makedepend, which …
12:49 AM Changeset in macports-ports [631092d41ce08abed854ea34a48204530491bcb6]boost_1.72.0_update by neverpanic (Clemens Lang)
nxproxy, nxcomp: Don't get stuck when trying to call makedepend, which …
12:49 AM Changeset [112946] by jeremyhu@…
cmake: Fix NDEBUG typo
12:49 AM Changeset in macports-ports [84d7804702812128aed8aeb8a9de8fbb06c6bbb2]boost_1.72.0_update by jeremyhu (Jeremy Huddleston Sequoia)
cmake: Fix NDEBUG typo git-svn-id: …
12:42 AM Ticket #41188 (port selfupdate failed: Error installing new MacPorts base: shell ...) closed by neverpanic (Clemens Lang)
wontfix: That would also explain why the selfupdate was not working before …

Nov 4, 2013:

11:41 PM Ticket #41143 (ffmpeg STILL does not build under PPC Tiger!) closed by neverpanic (Clemens Lang)
fixed: So it seems mplayer's weird configure script along with the incorrect …
11:32 PM Ticket #41191 (Add Salt to MacPorts) created by cr@…
Attached is a Portfile to add the Salt suite (SaltStack) to MacPorts. …
11:30 PM Ticket #41190 (ncarg: ncl did not built) created by gchen9@…
Ncl did not built during building ncarg port on Mac OS 10.9. […]
10:45 PM Ticket #41189 (t1utils @1.37: license should be GPL-2+) created by dliessi (Davide Liessi)
The [https://github.com/kohler/lcdf-typetools/blob/master/README#L122
10:08 PM Ticket #41188 (port selfupdate failed: Error installing new MacPorts base: shell ...) created by kelly@…
This might superficially seem similar to …
10:05 PM Ticket #41183 (gawk: update to 4.1.0) closed by ryandesign (Ryan Schmidt)
fixed: r112945
10:05 PM Changeset [112945] by ryandesign@…
gawk: maintainer update to 4.1.0 (#41183)
10:05 PM Changeset in macports-ports [802263349eafe42e6d28119af14daac6178a3ba2]boost_1.72.0_update by ryandesign (Ryan Schmidt)
gawk: maintainer update to 4.1.0 …
9:29 PM Ticket #41187 (Add port select support virtualenvwrapper) created by jasonkeene@…
Currently the shell script that you need to source for …
9:27 PM Ticket #41186 (Gource @0.39 Upgrade to 0.40) closed by ryandesign (Ryan Schmidt)
duplicate: Duplicate of #39219.
9:26 PM Ticket #41185 (Gource @0.39 Upgrade to 0.40) closed by ryandesign (Ryan Schmidt)
duplicate: Duplicate of #39219.
9:26 PM Ticket #41184 (Gource @0.39 Upgrade to 0.40) closed by ryandesign (Ryan Schmidt)
duplicate: Duplicate of #39219.
9:15 PM Ticket #41142 (cmake portgroup changes cause build failures) closed by ryandesign (Ryan Schmidt)
fixed: Looks good. Committed in r112944 with some minor changes (typos in …
9:14 PM Changeset [112944] by ryandesign@…
cmake-1.0.tcl: fix build failures with universal variants or ports …
9:14 PM Changeset in macports-ports [63ac00a0de00e8a7fc427c434e25e89f499e75dc]boost_1.72.0_update by ryandesign (Ryan Schmidt)
cmake-1.0.tcl: fix build failures with universal variants or ports …
9:00 PM Ticket #41186 (Gource @0.39 Upgrade to 0.40) created by reagan.r123@…
I have updated the portfile for Gource (attached). Forgive me if …
9:00 PM Ticket #41185 (Gource @0.39 Upgrade to 0.40) created by reagan.r123@…
I have updated the portfile for Gource (attached). Forgive me if …
9:00 PM Ticket #41184 (Gource @0.39 Upgrade to 0.40) created by reagan.r123@…
I have updated the portfile for Gource (attached). Forgive me if …
8:59 PM Ticket #41183 (gawk: update to 4.1.0) created by Schamschula (Marius Schamschula)
The current version of gawk is 4.1.0, Portfile patch attached. Note: …
8:59 PM Ticket #41168 (graphite2 @1.2.3_0 +Universal failing simple compile test on Mavericks ...) closed by ryandesign (Ryan Schmidt)
duplicate: Duplicate of #41142.
8:46 PM Ticket #41182 (mongo shell crashes on exit) created by p.perroud@…
I have installed mongodb 2.4.8 port on Mavericks. When I quit mongo …
8:28 PM Changeset [112943] by takeshi@…
nco: updated for 4.3.7
8:28 PM Changeset in macports-ports [0748e2f3027e4aedf3f710690d75ac11f029b16d]boost_1.72.0_update by Takeshi Enomoto <takeshi@…>
nco: updated for 4.3.7 git-svn-id: …
8:12 PM Ticket #20111 ("Function declaration isn't a prototype" in Erlang) closed by ci42
wontfix: The current erlang version is R16B02.
8:11 PM Ticket #41181 (gstreamer010-gst-plugins-base fails clean Mavericks) created by basmac
gstreamer010-gst-plugins-base fails to build. Attached debug file.
8:08 PM Ticket #36718 (npm failing to install) closed by ci42
worksforme: Lack of interest.
8:07 PM Ticket #40774 (erlang: upgrade to R16B02) closed by ci42
fixed: r112942
8:06 PM Ticket #37349 (erlang: +nohipe does not work) closed by ci42
fixed: r112941
8:05 PM Changeset [112942] by ciserlohn@…
erlang: update to version R16B02 (closes #40774) * disable wx …
8:05 PM Changeset in macports-ports [a8e03e5887759817e8f1efff76c53b0a4b8502f6]boost_1.72.0_update by ci42
erlang: update to version R16B02 (closes …
7:59 PM Ticket #41180 (octave-parallel: systime.h: No such file or directory) created by Schamschula (Marius Schamschula)
I've run into the following issue while building octave-parallel …
7:55 PM Ticket #41179 (wemux @2.2.0_0 points to file in /etc instead of ${prefix}/etc) created by nando@…
After a freshly-installed wemux, I copied the sample config at …
7:54 PM Changeset [112941] by ciserlohn@…
erlang: change nohipe to hipe variant and make it actually work …
7:54 PM Changeset in macports-ports [0a4a734a0655b4783d11e4133e477621cd96ff8c]boost_1.72.0_update by ci42
erlang: change nohipe to hipe variant and make it actually work …
7:46 PM Ticket #41178 (octave-image patch failure) created by Schamschula (Marius Schamschula)
While building octave image (against octave-devel on Mavericks) I get …
7:42 PM Changeset [112940] by ciserlohn@…
erlang: remove unused master_site
7:42 PM Changeset in macports-ports [5748ecf6b78261b8dc35efb17281124d8a64e318]boost_1.72.0_update by ci42
erlang: remove unused master_site git-svn-id: …
7:36 PM Ticket #40887 (erlang : port abandoned) closed by ci42
fixed: r112939
7:35 PM Changeset [112939] by ciserlohn@…
erlang: take over maintainership (port abandoned; see #40887)
7:35 PM Changeset in macports-ports [50a8655bf0f8da018a7c3bab757db8530c192384]boost_1.72.0_update by ci42
erlang: take over maintainership (port abandoned; see …
7:28 PM Changeset [112938] by ciserlohn@…
git-core: update to version 1.8.4.2
7:28 PM Changeset in macports-ports [83fac684d64ba8de0ca0a9486cb41100011c9e3f]boost_1.72.0_update by ci42
git-core: update to version 1.8.4.2 git-svn-id: …
7:22 PM Changeset [112937] by blair@…
gconf: rebuild due to library reversioning libsasl2.2 -> libsasl2. …
7:22 PM Changeset in macports-ports [35c4ba6a0bb7bc118884f1c7482edd79f0240e5f]boost_1.72.0_update by blair (Blair Zajac)
gconf: rebuild due to library reversioning libsasl2.2 -> libsasl2. …
7:21 PM Ticket #41171 (libgcc: The directory that should contain system headers does not ...) closed by ryandesign (Ryan Schmidt)
invalid: The log says: […] You must install the command line tools by …
7:20 PM Ticket #41177 (kdepimlibs4 fails to build on 10.6.8.1 / 2.2.1) created by 66j7kckg5c@…
Hi, When trying to install either konsole or kate, which depend on …
6:28 PM Ticket #41042 (openmotif on mavericks does not build) closed by ryandesign (Ryan Schmidt)
invalid: Replying to fabian@…: > It would probably be a good idea …
4:54 PM Ticket #41176 (snort 2.9.1.2_0 build failure under Mavericks) created by Schamschula (Marius Schamschula)
I get the following error when building snort under Mavericks: …
4:52 PM Changeset [112936] by jberry@…
tag: update to to v0.7.3
4:52 PM Changeset in macports-ports [98abedce48deaf5621222d16067343a542ef83f3]boost_1.72.0_update by James D. Berry <jberry@…>
tag: update to to v0.7.3 git-svn-id: …
4:48 PM Ticket #41175 (powerpc-rtems-gcc @4.2.3 doesn't compile with the default compiler in ...) created by ozaktash@…
Just updated to Mavericks and Xcode 5.0.1 and powerpc-rtems-gcc @4.2.3 …
4:21 PM Ticket #41174 (nip2 update to 7.38.3 - fixes build on mavericks ( 7.26.3_1 fails ...) created by Schamschula (Marius Schamschula)
I get the following error in building nip2 7.26.3_1 under Mavericks: …
4:13 PM Ticket #41112 (subversion: svnserve crashed in libdispatch on Mavericks) closed by danielluke (Daniel J. Luke)
invalid: As an extra data-point, make svnserveautocheck PARALLEL=1 (as …
4:10 PM Changeset [112935] by g5pw@…
devel/otx: update to r560 indent description
4:10 PM Changeset in macports-ports [d192af5565da396d69d5eff538f81f6314570d98]boost_1.72.0_update by g5pw (Aljaž Srebrnič)
devel/otx: update to r560 indent description git-svn-id: …
3:55 PM Changeset [112934] by g5pw@…
net/ostinato: fix build on Mavericks
3:55 PM Changeset in macports-ports [18eaf00b621236fc38913c970e3d4272f54a3f60]boost_1.72.0_update by g5pw (Aljaž Srebrnič)
net/ostinato: fix build on Mavericks git-svn-id: …
3:51 PM Changeset [112933] by mmoll@…
glm: update to version 0.9.4.6
3:51 PM Changeset in macports-ports [d1618f4c817b042fdf2d0cb64867e6d8a26c94d5]boost_1.72.0_update by Mark Moll <mmoll@…>
glm: update to version 0.9.4.6 git-svn-id: …
3:32 PM Ticket #41173 (Bash 4.2.25 Causes Kernel Panic) created by rpk@…
I've seen this on two different machines running the latest Mountain …
3:12 PM Ticket #41172 (thrift: error: no member named 'bind' in namespace 'std') created by vanjab@…
Assuming some change in compiler behavior related to namespaces. […]
2:07 PM Changeset [112932] by eborisch@…
py-spyder-devel: Update to 2.3.0beta1
2:07 PM Changeset in macports-ports [f1d814490b540186f422f69ace43dbc5504b7141]boost_1.72.0_update by Eric A. Borisch <eborisch@…>
py-spyder-devel: Update to 2.3.0beta1 git-svn-id: …
2:04 PM Ticket #41170 (gnuradio fails to build) closed by michaelld (Michael Dickens)
duplicate: duplicate of #41162.
2:03 PM hum edited by humem (humem)
(diff)
1:15 PM Changeset [112931] by raimue@…
science/stellarium: Fix whitespace in patch that prevented build
1:15 PM Changeset in macports-ports [d253babb42a8aaef6c4c7d312ee6909fe4b8adee]boost_1.72.0_update by raimue (Rainer Müller)
science/stellarium: Fix whitespace in patch that prevented build …
12:39 PM Changeset [112930] by michaelld@…
glfw: update to e4a87b8a (20131103).
12:39 PM Changeset in macports-ports [15e1b7b3ab1cc8c276d57c294c639ee035da9020]boost_1.72.0_update by michaelld (Michael Dickens)
glfw: update to e4a87b8a (20131103). git-svn-id: …
12:20 PM Ticket #41161 (octave-devel: error: no member named 'tr1' in namespace 'std') closed by michaelld (Michael Dickens)
duplicate: Great; thanks for reporting back!
10:47 AM Ticket #41171 (libgcc: The directory that should contain system headers does not ...) created by steve@…
The build of libgcc (a pre-requisite of any version of gcc) fails …
9:39 AM Ticket #41170 (gnuradio fails to build) created by DanielO (Daniel O'Connor)
I recently blew macports away after upgrading to 10.9 (because I hosed …
8:46 AM Changeset [112929] by raimue@…
sysutils/clog: New port
8:09 AM Changeset [112928] by ryandesign@…
libvirt: update to 1.1.4
8:09 AM Changeset in macports-ports [9d79f3804a77b9c53ce7df98a703952add798e0d]boost_1.72.0_update by ryandesign (Ryan Schmidt)
libvirt: update to 1.1.4 git-svn-id: …
7:43 AM Ticket #41169 (memcached fails to build on Mavericks) closed by ryandesign (Ryan Schmidt)
invalid: Both Xcode and the command line tools are required for MacPorts.
6:21 AM Changeset [112927] by ryandesign@…
memcached: update to 1.4.15; always remove -Werror not just on clang …
6:21 AM Changeset in macports-ports [c772c0268931dc7fd673871b4a001ee1d4e64045]boost_1.72.0_update by ryandesign (Ryan Schmidt)
memcached: update to 1.4.15; always remove -Werror not just on clang …
6:12 AM Changeset [112926] by jeremyhu@…
inkscape: Fix compiler matching, still fails to build though
6:12 AM Changeset in macports-ports [b4800676464b102f1dfa2c9350f869ad7c2f3a9d]boost_1.72.0_update by jeremyhu (Jeremy Huddleston Sequoia)
inkscape: Fix compiler matching, still fails to build though …
5:58 AM Ticket #41169 (memcached fails to build on Mavericks) created by zsolt@…
relevant logs: […] /usr/bin/cc is Apple LLVM version 5.0 …
5:27 AM Changeset [112925] by ryandesign@…
LyX: texlive doesn't provide tex; texlive-basic does
5:27 AM Changeset in macports-ports [ef854329102d657a94e13eb443ec52544d539815]boost_1.72.0_update by ryandesign (Ryan Schmidt)
LyX: texlive doesn't provide tex; texlive-basic does git-svn-id: …
4:21 AM Changeset [112924] by jmr@…
gnubg: license
4:21 AM Changeset in macports-ports [c8bbe01516043bde91af04c6cc5a88a595776c8b]boost_1.72.0_update by jmroot (Joshua Root)
gnubg: license git-svn-id: …
4:13 AM Changeset [112923] by jmr@…
gnucap: license
4:13 AM Changeset in macports-ports [c2bc6e604b5d7892f86692a9b831899572b5f7db]boost_1.72.0_update by jmroot (Joshua Root)
gnucap: license git-svn-id: …
4:11 AM Changeset [112922] by royliu@…
LyX: fix build for 10.9
4:11 AM Changeset in macports-ports [60832b5c0266734ad7c6726c0f2d09ebd05e255d]boost_1.72.0_update by Roy Liu <royliu@…>
LyX: fix build for 10.9 git-svn-id: …
4:08 AM Changeset [112921] by jmr@…
gnucash-docs: correct license
4:08 AM Changeset in macports-ports [a8825ecde07b3065ebe55582ba557949793dc1ea]boost_1.72.0_update by jmroot (Joshua Root)
gnucash-docs: correct license git-svn-id: …
4:01 AM Changeset [112920] by jmr@…
gnustep-dl2: set license, add working master_sites
4:01 AM Changeset in macports-ports [531b9224852d37f08c4a516bf16545e69ea6e1f9]boost_1.72.0_update by jmroot (Joshua Root)
gnustep-dl2: set license, add working master_sites git-svn-id: …
3:59 AM Ticket #41168 (graphite2 @1.2.3_0 +Universal failing simple compile test on Mavericks ...) created by justin@…
Following upgrade of a Macbook Pro Retina, followed the migration …
3:51 AM Changeset [112919] by jmr@…
gnustep-make-docs: license
3:51 AM Changeset in macports-ports [088622b5e73a71f787b1e8406d0924b1b1a535df]boost_1.72.0_update by jmroot (Joshua Root)
gnustep-make-docs: license git-svn-id: …
3:47 AM Changeset [112918] by jmr@…
gob1: license
3:47 AM Changeset in macports-ports [1543d6f3ea523586d21b566c17d0d60a07c20f87]boost_1.72.0_update by jmroot (Joshua Root)
gob1: license git-svn-id: …
3:31 AM Changeset [112917] by ryandesign@…
openni: update to 1.5.7.8
3:31 AM Changeset in macports-ports [4e11898ba38ca52a831facdfc634f407ff5ac91d]boost_1.72.0_update by ryandesign (Ryan Schmidt)
openni: update to 1.5.7.8 git-svn-id: …
3:30 AM Changeset [112916] by jmr@…
greed: license
3:30 AM Changeset in macports-ports [9ee6175de7ff191feedddf11467ae3464545c362]boost_1.72.0_update by jmroot (Joshua Root)
greed: license git-svn-id: …
3:26 AM Ticket #41085 (OpenNI on Mac OS X 10.9 Mavericks) closed by ryandesign (Ryan Schmidt)
fixed: Replying to cooperz@…: > …
3:25 AM Changeset [112915] by ryandesign@…
openni: fix build on Mavericks (#41085)
3:25 AM Changeset in macports-ports [73751d573fc6936a17ec704cf8e8888c1e817a81]boost_1.72.0_update by ryandesign (Ryan Schmidt)
openni: fix build on Mavericks …
3:12 AM Changeset [112914] by ryandesign@…
youtube-dl: update to 2013.11.03
3:12 AM Changeset in macports-ports [1112d7a69892b6dcdb9c862784f3c6699a5839a2]boost_1.72.0_update by ryandesign (Ryan Schmidt)
youtube-dl: update to 2013.11.03 git-svn-id: …
3:01 AM Ticket #41167 (ola: Add a +nowarnings variant to work around issues with the new compiler) created by nomis52@…
The new compiler that comes with XCode 5 is failing with : […] …
2:34 AM Ticket #41166 (gdb @7.6 Staging into destroot failed) created by nimrodomer@…
If I configure MacPorts with --prefix=$HOME/.local, gdb installs …
1:01 AM Ticket #41164 (octave-devel @3.6.4_9 "sed: RE error: illegal byte sequence" on 10.8) closed by ryandesign (Ryan Schmidt)
fixed: Fixed in r112913.
1:01 AM Ticket #41165 (octave-devel: error: use of undeclared identifier 'CGDisplayBitsPerPixel') closed by ryandesign (Ryan Schmidt)
fixed: Fixed in r112913.
1:01 AM Changeset [112913] by ryandesign@…
octave-devel: fix build failures on Lion (#41165) and Mountain Lion …
1:01 AM Changeset in macports-ports [49ca082c14f70b22012792aaf63e844eb388b92d]boost_1.72.0_update by ryandesign (Ryan Schmidt)
octave-devel: fix build failures on Lion …
12:56 AM Ticket #41165 (octave-devel: error: use of undeclared identifier 'CGDisplayBitsPerPixel') created by john.zic@…
I previously had a working version of octave-devel, but when I …
12:36 AM Ticket #41164 (octave-devel @3.6.4_9 "sed: RE error: illegal byte sequence" on 10.8) created by dale+macports@…
I'm on OS X 10.8.5. While building octave-devel I ran into the "sed: …
12:35 AM Ticket #41163 (strigi @0.7.7_5: error: use of undeclared identifier 'sleep') closed by ryandesign (Ryan Schmidt)
duplicate: No, it's the same error as #41152. The relevant part of your logfile …
12:29 AM Changeset [112912] by ryandesign@…
strigi: fix livecheck
12:29 AM Changeset in macports-ports [94ccf080ce4d1ce238302adaa969eb66769cad89]boost_1.72.0_update by ryandesign (Ryan Schmidt)
strigi: fix livecheck git-svn-id: …
12:28 AM Changeset [112911] by ryandesign@…
strigi: update to 0.7.8; update homepage and master_sites; fix livecheck
12:28 AM Changeset in macports-ports [7ac0925193730573a7e3526e4709636cd0f42f82]boost_1.72.0_update by ryandesign (Ryan Schmidt)
strigi: update to 0.7.8; update homepage and master_sites; fix …
12:00 AM Ticket #41163 (strigi @0.7.7_5: error: use of undeclared identifier 'sleep') created by wahspilihp (Philip Shaw)
The critical part appears to be […] This is a different error to …

Nov 3, 2013:

11:46 PM Changeset [112910] by jmr@…
squid3: update to 3.3.10, add workaround for one cause of compilation …
11:46 PM Changeset in macports-ports [4028ceb0ba179b5d7c5b5ea98b9340ff7e7be8c4]boost_1.72.0_update by jmroot (Joshua Root)
squid3: update to 3.3.10, add workaround for one cause of compilation …
11:31 PM Changeset [112909] by jmr@…
py-setuptools: update to 1.3
11:31 PM Changeset in macports-ports [f84b9a8ac4e61fdce1a980c6932a17a3ca969bb9]boost_1.72.0_update by jmroot (Joshua Root)
py-setuptools: update to 1.3 git-svn-id: …
11:17 PM Changeset [112908] by jmr@…
clog: disable parallel build, set license
11:17 PM Changeset in macports-ports [5ebdcfa99ec024a70d76b75ceec93fb1b5c40785]boost_1.72.0_update by jmroot (Joshua Root)
clog: disable parallel build, set license git-svn-id: …
11:07 PM Ticket #41162 (gnuradio fails to build on 10.9) created by ken@…
[…]
10:31 PM Ticket #41159 (vtk5 @5.10.1 install failure on Mavericks) closed by ryandesign (Ryan Schmidt)
duplicate: Duplicate of #41149.
10:04 PM Ticket #41161 (octave-devel: error: no member named 'tr1' in namespace 'std') created by ssim12@…
octave-devel fails to build on OS X 10.9 […]
10:01 PM Changeset [112907] by devans@…
gimp: white space only.
10:01 PM Changeset in macports-ports [319a38535de4afc48c116805c70920ed5202e586]boost_1.72.0_update by dbevans (David B. Evans)
gimp: white space only. git-svn-id: …
9:46 PM Ticket #41004 (Failed to build uhd on Mavericks) closed by jeremyhu (Jeremy Huddleston Sequoia)
fixed: Closing as fixed per above.
9:30 PM Ticket #41160 (perl5: add perl5_18 variant) created by ryandesign (Ryan Schmidt)
Please add a perl5_18 variant to the perl5 port (added in #39473), …
9:28 PM Ticket #39473 (New port: perl5.18) closed by ryandesign (Ryan Schmidt)
fixed
9:23 PM Ticket #41138 (xcrun: error: unable to exec Xcode native xcrun (Permission denied).) closed by mf2k (Frank Schima)
invalid
9:16 PM Ticket #41159 (vtk5 @5.10.1 install failure on Mavericks) created by bernard-giroux (Bernard Giroux)
This is on a clean install of Mavericks, with macports compiled from …
9:04 PM Ticket #39998 (maxima @5.28.0_7: update to 5.30.0) closed by mkae (Marko Käning)
fixed: Fixed in r112906
9:03 PM Changeset [112906] by mk@…
maxima: upgrade to version 5.30.0
9:03 PM Changeset in macports-ports [818db7eff29a0e818c17b0bf311865404bd68e0a]boost_1.72.0_update by mkae (Marko Käning)
maxima: upgrade to version 5.30.0 git-svn-id: …
8:40 PM Ticket #41008 (textmate2: build fails on Mavericks, "code object is not signed at all") closed by neverpanic (Clemens Lang)
fixed: This is fixed by updating the textmate2 port to a9495 in r112904. I …
8:39 PM Changeset [112905] by devans@…
goocanvas2: depend on py-gobject3.
8:39 PM Changeset in macports-ports [03354f1e01395a17c8f0e368bde70daa5e1668a1]boost_1.72.0_update by dbevans (David B. Evans)
goocanvas2: depend on py-gobject3. git-svn-id: …
8:37 PM Ticket #41007 (textmate2: add missing Mavericks build dependency on gnutar) closed by neverpanic (Clemens Lang)
fixed: This should be fixed by updating to a9495 in r112904, which no longer …
8:36 PM Ticket #41027 (textmate2 @2.0-alpha.9487: upgrade to 9493) closed by neverpanic (Clemens Lang)
fixed: Updated to a9495 in r112904.
8:36 PM Changeset [112904] by cal@…
textmate2: update to a9495, closes #41027, #41007, #41008 textmate as …
8:36 PM Changeset in macports-ports [7bbe1cf0f5a9558346a583b368e786cb3aa22bfb]boost_1.72.0_update by neverpanic (Clemens Lang)
textmate2: update to a9495, closes …
8:32 PM Changeset [112903] by devans@…
gimp2: add missing build dependency.
8:32 PM Changeset in macports-ports [00502cefbef0001584c23a1fb52184eb83290538]boost_1.72.0_update by dbevans (David B. Evans)
gimp2: add missing build dependency. git-svn-id: …
7:39 PM Changeset [112902] by devans@…
poppler: update to version 0.24.3, ABI compatible with previous version.
7:39 PM Changeset in macports-ports [fc999cf6c0da7d5190e24ba55f56be8e297ab3e8]boost_1.72.0_update by dbevans (David B. Evans)
poppler: update to version 0.24.3, ABI compatible with previous …
7:37 PM Ticket #41083 (makeicns-1.4.10 build fails in Mavericks 10.9) closed by mkae (Marko Käning)
duplicate
7:37 PM Ticket #41083 (makeicns-1.4.10 build fails in Mavericks 10.9) reopened by mkae (Marko Käning)
7:26 PM Ticket #41158 (gd2: grep: /opt/local/lib/libX11.la: No such file or directory) closed by ryandesign (Ryan Schmidt)
invalid: MacPorts changed how it handles .la files when it installs ports in …
7:03 PM Ticket #41158 (gd2: grep: /opt/local/lib/libX11.la: No such file or directory) created by venkyne1984@…
I am trying to install gnu radio on mavericks and I encounter the …
7:02 PM Ticket #40899 (clucene: LuceneThreads.h:58:34: error: unknown type name 'pthread_t') closed by ryandesign (Ryan Schmidt)
fixed: Those who did not follow migration instructions should do so now. …
7:02 PM Changeset [112901] by ryandesign@…
clucene: add zlib dependency; revbump because r112875 changed files …
7:02 PM Changeset in macports-ports [d50ac81d6700d6e9f3ba301af75e7be28b0714b3]boost_1.72.0_update by ryandesign (Ryan Schmidt)
clucene: add zlib dependency; revbump because …
7:01 PM Changeset [112900] by devans@…
gimp, gimp2: update to version 2.8.8.
7:01 PM Changeset in macports-ports [a842908177c9748aa3f76f81ac02fbcd55fe0c07]boost_1.72.0_update by dbevans (David B. Evans)
gimp, gimp2: update to version 2.8.8. git-svn-id: …
6:35 PM Ticket #41150 (uhd: can't read "configure.cxx_stdlib": no such variable) closed by ryandesign (Ryan Schmidt)
fixed: Replying to jamesfmarshall@…: > {{{ > Failed to parse …
6:30 PM Ticket #41013 (aalib: fatal error: 'malloc.h' file not found) closed by ryandesign (Ryan Schmidt)
invalid: Great.
6:23 PM Ticket #40875 (mongodb 2.4 branch can't install on Mavericks) closed by ryandesign (Ryan Schmidt)
fixed: Replying to p.perroud@…: > Replying to [comment:42
6:22 PM Changeset [112899] by devans@…
goocanvas2: update to version 2.0.2, fixes drawing using GTK+ 3.10.
6:22 PM Changeset in macports-ports [75e2490a640322e2bc0e238b1fa33588ee990dfa]boost_1.72.0_update by dbevans (David B. Evans)
goocanvas2: update to version 2.0.2, fixes drawing using GTK+ 3.10. …
6:21 PM Ticket #41147 (xorg-inputproto: asciidoc: FAILED: configuration file asciidoc.conf missing) closed by jeremyhu (Jeremy Huddleston Sequoia)
worksforme
6:21 PM Changeset [112898] by g5pw@…
print/scribus: update to 1.4.3
6:21 PM Changeset in macports-ports [0c4229f86dbdab90ec9007fce2acebd1bc022b35]boost_1.72.0_update by g5pw (Aljaž Srebrnič)
print/scribus: update to 1.4.3 git-svn-id: …
6:10 PM Changeset [112897] by jeremyhu@…
dragonegg-3.3: Revbump dragonegg-3.3-gcc-4.8 due to gcc48 bump
6:10 PM Changeset in macports-ports [9e9043fe8f9775ab737c7cb23848d1b55aeabd11]boost_1.72.0_update by jeremyhu (Jeremy Huddleston Sequoia)
dragonegg-3.3: Revbump dragonegg-3.3-gcc-4.8 due to gcc48 bump …
6:07 PM Changeset [112896] by jeremyhu@…
llvm-3.2: Revert accidental commit from r112895
6:07 PM Changeset in macports-ports [c585494fe42f5cadd94c3b5830efc6af5357cefd]boost_1.72.0_update by jeremyhu (Jeremy Huddleston Sequoia)
llvm-3.2: Revert accidental commit from …
6:07 PM Changeset [112895] by jeremyhu@…
{clang,dragonegg,llvm}-3.4: Bump to r193941
6:07 PM Changeset in macports-ports [0e02d5cb1efe940b8e70795387c6835cc0af588e]boost_1.72.0_update by jeremyhu (Jeremy Huddleston Sequoia)
{clang,dragonegg,llvm}-3.4: Bump to r193941 git-svn-id: …
5:53 PM Changeset [112894] by devans@…
gsettings-desktop-schemas: update to version 3.10.1.
5:53 PM Changeset in macports-ports [36379e5665744ad0f6b4c9800226929d4325dcc8]boost_1.72.0_update by dbevans (David B. Evans)
gsettings-desktop-schemas: update to version 3.10.1. git-svn-id: …
5:52 PM Changeset [112893] by devans@…
gnome-themes-standard: update to version 3.10.0.
5:52 PM Changeset in macports-ports [62fbb6c551f43ebd404c480be87d21170d0e139f]boost_1.72.0_update by dbevans (David B. Evans)
gnome-themes-standard: update to version 3.10.0. git-svn-id: …
5:49 PM Changeset [112892] by devans@…
gtkmm3: update to version 3.10.1.
5:49 PM Changeset in macports-ports [b418f219e9e9d7cd1571dca6fe8dc8b0680b1d47]boost_1.72.0_update by dbevans (David B. Evans)
gtkmm3: update to version 3.10.1. git-svn-id: …
5:46 PM Changeset [112891] by devans@…
gdl3: update to version 3.10.0.
5:46 PM Changeset in macports-ports [5042ce5ed7573e99039777fc423f3744abbf76de]boost_1.72.0_update by dbevans (David B. Evans)
gdl3: update to version 3.10.0. git-svn-id: …
5:29 PM Ticket #41157 (mail/postfix: add mysql56 variant) created by pixilla (Bradley Giesbrecht)
5:23 PM Ticket #41156 (port request: hledger) created by kevin.krouse@…
hledger is a computer program for easily tracking money, time, or …
2:52 PM Ticket #41155 (Preparing for new Octave release) created by kingcrimson@…
Hi all, Octave 3.8 is due to be released very soon so we are working …
2:45 PM Ticket #41154 (openscad: fix build with libc++) created by ecronin (Eric Cronin)
The guard in src/stl-utils.cc assumes that {{{defined(APPLE) …
2:04 PM Ticket #40949 (Update pythia to latest 8.180 version) closed by g5pw (Aljaž Srebrnič)
fixed: Thanks, commited in r112890.
2:03 PM Changeset [112890] by g5pw@…
science/pythia: update to 8.180 adapt to new header locations …
2:03 PM Changeset in macports-ports [f7d88faf917a53dcf77829e414d14e77712c754f]boost_1.72.0_update by g5pw (Aljaž Srebrnič)
science/pythia: update to 8.180 adapt to new header locations …
2:02 PM Ticket #40970 (ROOT fails to build on OS X Mavericks) closed by g5pw (Aljaž Srebrnič)
fixed: Fixed in r112889 by applying patch in #41108
2:01 PM Ticket #41108 (ROOT update to 5.34.11 (Adding support for OSX 10.9)) closed by g5pw (Aljaž Srebrnič)
fixed: Thanks, commited in r112889.
2:01 PM Changeset [112889] by g5pw@…
science/root: update to 5.34.11 closes #41108 and #40970
2:01 PM Changeset in macports-ports [7ced3dd2aec2f1f574154bf1cd4fa96f00401b9e]boost_1.72.0_update by g5pw (Aljaž Srebrnič)
science/root: update to 5.34.11 closes …
1:54 PM Changeset [112888] by ecronin@…
science/openscad: fix livecheck openmaintainer; broken in r101732
1:54 PM Changeset in macports-ports [7c82fe73cf974bffd9157d5a419ad1d9817a1dd0]boost_1.72.0_update by ecronin (Eric Cronin)
science/openscad: fix livecheck openmaintainer; broken in …
12:56 PM Changeset [112887] by raimue@…
devel/clog: Remove old port that has not been updated in almost ten …
12:56 PM Changeset in macports-ports [a1c4b6f17cc940d1c3e431facb285cf89fe6d62b]boost_1.72.0_update by raimue (Rainer Müller)
devel/clog: Remove old port that has not been updated in almost ten …
12:47 PM Changeset [112886] by michaelld@…
uhd*: configure.cxx_stdlib works with the SVN trunk, not the current …
12:47 PM Changeset in macports-ports [7f346b33e8c7a6b0930731afd7d862a487fb795d]boost_1.72.0_update by michaelld (Michael Dickens)
uhd*: configure.cxx_stdlib works with the SVN trunk, not the current …
12:11 PM Ticket #39860 (root: problems launching the Qt GUI) closed by g5pw (Aljaž Srebrnič)
wontfix: Closing as wontfix. In my opinion, we should move towards the cocoa …
11:51 AM Changeset [112885] by raimue@…
guide: More about the SQLite registry and its files, describe flat …
11:51 AM Changeset in macports-guide [8233a77c79d1cad3147a3823c4ae9e65238c9d15] by raimue (Rainer Müller)
guide: More about the SQLite registry and its files, describe flat …
11:50 AM Changeset [112884] by raimue@…
guide: Fix compilation by removing stray closing tag
11:50 AM Changeset in macports-guide [5707d7af2b7ea2764e6bd9ddc17cb6d49ea49430] by raimue (Rainer Müller)
guide: Fix compilation by removing stray closing tag git-svn-id: …
11:35 AM Changeset [112883] by raimue@…
guide: Fix a typo in mportclose
11:35 AM Changeset in macports-guide [d9af2fd74389223bf96e9709db72d6780bc7c08a] by raimue (Rainer Müller)
guide: Fix a typo in mportclose git-svn-id: …
11:34 AM Changeset [112882] by raimue@…
guide: Remove outdated registry API reference
11:34 AM Changeset in macports-guide [c7e85270acb77ccc0fedbb08490cf7f28e91c153] by raimue (Rainer Müller)
guide: Remove outdated registry API reference git-svn-id: …
11:31 AM Ticket #40899 (clucene: LuceneThreads.h:58:34: error: unknown type name 'pthread_t') reopened by egon.geerardyn@…
It is not fixed here either. I get a similar log trace when trying to …
11:27 AM Ticket #41153 (php55-apache2handler: PHP scripts not running in Apache2) created by p.perroud@…
php55-apache2handler was built successfully on Mavericks but Apache is …
11:13 AM Changeset [112881] by raimue@…
doc-new: Exclude output directories of guide and man from version control
10:59 AM Changeset [112880] by raimue@…
science/uhd: configure.cxx_stdlib is not available in a released …
10:59 AM Changeset in macports-ports [6bed1e8cccc90c9b846c1e8422727b8d673b035a]boost_1.72.0_update by raimue (Rainer Müller)
science/uhd: configure.cxx_stdlib is not available in a released …
10:16 AM Ticket #40875 (mongodb 2.4 branch can't install on Mavericks) reopened by p.perroud@…
Replying to ryandesign@…: > > I've committed the fixes …
10:14 AM Ticket #41152 (strigi @0.7.8: error: reference to 'mutex' is ambiguous) created by hjs@…
I am trying to install kmymoney4 on Mavericks. This is a dependency of …
10:03 AM Ticket #41151 (qpdf update to 5.0.1 and patch for Mavericks) created by mauricio_ville@…
The patch includes the fix from https://github.com/qpdf/qpdf/issues/19
9:59 AM Changeset [112879] by easieste@…
Use absolute paths for installation symbolic link. Suggested by Frank …
9:59 AM Changeset in macports-ports [8dd4a6086da4ece067cfee029ba2f2468407a065]boost_1.72.0_update by Mark Evenson <easieste@…>
Use absolute paths for installation symbolic link. Suggested by Frank …
9:24 AM Ticket #41150 (uhd: can't read "configure.cxx_stdlib": no such variable) created by jamesfmarshall@…
I see the following when I do a sudo port upgrade: […]
8:43 AM Ticket #41149 (vtk5: error: expected "FILENAME" or <FILENAME>) created by bricklemacho@…
Trying to compile VTK5 on OS X Mavericks. Ticket #40901 applies a …
8:13 AM Ticket #41146 (Cannot select python34) closed by jyrkiwahlstedt
fixed: done in r112878
8:10 AM Changeset [112878] by jwa@…
python34: fix files to allow python34 to be selected, closing #41146
8:10 AM Changeset in macports-ports [50cbcf606738f503efd247c54cb1383d3f12e62c]boost_1.72.0_update by jyrkiwahlstedt
python34: fix files to allow python34 to be selected, closing …
8:05 AM Changeset [112877] by ryandesign@…
libdevil: fix nutty endian detection code that was wrong on big endian …
8:05 AM Changeset in macports-ports [166e26169a98be48502a103b654d6a161d27bdef]boost_1.72.0_update by ryandesign (Ryan Schmidt)
libdevil: fix nutty endian detection code that was wrong on big endian …
7:34 AM Ticket #41133 ([bluefish] [2.0.3] [The latest stable version is Bluefish 2.2.4]) closed by ryandesign (Ryan Schmidt)
fixed: Updated to 2.2.4 in r112876. I didn't do much testing, but at least it …
7:34 AM Changeset [112876] by ryandesign@…
bluefish: update to 2.2.4 (#41133)
7:34 AM Changeset in macports-ports [62a45f38d9b440aa60cd5f87f39624d63a378f62]boost_1.72.0_update by ryandesign (Ryan Schmidt)
bluefish: update to 2.2.4 (https://trac.macports.org/ticket/41133) …
7:10 AM Ticket #40899 (clucene: LuceneThreads.h:58:34: error: unknown type name 'pthread_t') closed by ryandesign (Ryan Schmidt)
fixed: r112875
7:10 AM Changeset [112875] by ryandesign@…
clucene: fix build on Mavericks (#40899)
7:10 AM Changeset in macports-ports [067cb5c8af65a4913aa297e8b1b90d6ae39096c9]boost_1.72.0_update by ryandesign (Ryan Schmidt)
clucene: fix build on Mavericks …
7:04 AM Changeset [112874] by devans@…
zeitgeist: fix configuration check for python-rdflib.
7:04 AM Changeset in macports-ports [a015dc3b41e9e378bf291aa2ecaa601ac1fd8823]boost_1.72.0_update by dbevans (David B. Evans)
zeitgeist: fix configuration check for python-rdflib. git-svn-id: …
7:00 AM Ticket #41148 (clucene @2.3.3.4: error: unknown type name 'pthread_t') closed by ryandesign (Ryan Schmidt)
duplicate: The log is not from a clean attempt. In the future, please …
6:54 AM Changeset [112873] by royliu@…
phantomjs: fix build for 10.9
6:54 AM Changeset in macports-ports [045c2ca44f838088f1d3a16f54cfaf9c302724ba]boost_1.72.0_update by Roy Liu <royliu@…>
phantomjs: fix build for 10.9 git-svn-id: …
6:41 AM Ticket #41148 (clucene @2.3.3.4: error: unknown type name 'pthread_t') created by lodovico.ratti@…
Switched from kile to kde4-kile as suggested. Now, while installing it …
6:22 AM Changeset [112872] by devans@…
gtksourceview3: update to version 3.10.1.
6:22 AM Changeset in macports-ports [e7c36859c97ca9eaed4b247d93ca5c9d05f570d7]boost_1.72.0_update by dbevans (David B. Evans)
gtksourceview3: update to version 3.10.1. git-svn-id: …
6:15 AM Changeset [112871] by ryandesign@…
pinentry: update to 0.8.3
6:15 AM Changeset in macports-ports [09559e1c61e95f797e4c5d5a9e4fae1a59e4f2e2]boost_1.72.0_update by ryandesign (Ryan Schmidt)
pinentry: update to 0.8.3 git-svn-id: …
4:11 AM Ticket #41147 (xorg-inputproto: asciidoc: FAILED: configuration file asciidoc.conf missing) created by marty@…
I get the attached errors when trying to install latex2html on …
3:50 AM Ticket #41146 (Cannot select python34) created by murrayeisenberg@…
With python34 @3.4.0a4 installed in MacPorts 2.2.1 under OS X 10.9, …
3:30 AM Ticket #41145 (py26-pyobjc: track removal) created by ryandesign (Ryan Schmidt)
[Summary was: py26-pyobjc needs to be downgraded to a Python …
3:28 AM Changeset [112870] by ryandesign@…
namebench: fix build with older Xcode
3:28 AM Changeset in macports-ports [6eec95e418157e11f265851c766a896f9ff294c6]boost_1.72.0_update by ryandesign (Ryan Schmidt)
namebench: fix build with older Xcode git-svn-id: …
3:12 AM Changeset [112869] by michaelld@…
uhd: * patch use of boost::lexical_cast and libc++; * addresses ticket …
3:12 AM Changeset in macports-ports [0ea42b486a7ee1ada370dc242e9ddc2c03f3f5f4]boost_1.72.0_update by michaelld (Michael Dickens)
uhd: * patch use of boost::lexical_cast and libc++; * addresses ticket …
2:57 AM Changeset [112868] by devans@…
ffmpeg, ffmpeg-devel: force disable of libbluray support for Tiger and …
2:57 AM Changeset in macports-ports [f8b077b7948dcc730464f3e44c9a3ae2ced82bac]boost_1.72.0_update by dbevans (David B. Evans)
ffmpeg, ffmpeg-devel: force disable of libbluray support for Tiger and …
2:39 AM Ticket #35032 (namebench crash at Lion) closed by ryandesign (Ryan Schmidt)
worksforme: This error message means something went wrong while running the …
2:36 AM Changeset [112867] by ryandesign@…
py25-pyobjc: fix build on Mavericks
2:36 AM Changeset in macports-ports [62250f5af7aa50cfce320ced9b9069490baa53cb]boost_1.72.0_update by ryandesign (Ryan Schmidt)
py25-pyobjc: fix build on Mavericks git-svn-id: …
2:31 AM Changeset [112866] by michaelld@…
octave-devel: fix comment about requiring LANG="C" for /usr/bin/sed in …
2:31 AM Changeset in macports-ports [76835bc2b3994f930249fbe1034a9fe44256c039]boost_1.72.0_update by michaelld (Michael Dickens)
octave-devel: fix comment about requiring LANG="C" for /usr/bin/sed in …
2:28 AM Ticket #40859 (namebench fails to install on Mavericks) closed by ryandesign (Ryan Schmidt)
fixed: r112865
2:28 AM Changeset [112865] by ryandesign@…
namebench: actually use MacPorts python (#40859); add required PyObjC …
2:28 AM Changeset in macports-ports [d0cc045b04282d0f5e39aad9010f797278f4cd0a]boost_1.72.0_update by ryandesign (Ryan Schmidt)
namebench: actually use MacPorts python …
2:00 AM Ticket #40852 (qt4-mac does not build on OS X 10.9 Mavericks or later) closed by michaelld (Michael Dickens)
fixed
1:06 AM Ticket #41144 (pinentry 0.8.2_0 +qt4 fails to build on OS X Mavericks 10.9) created by robink@…
Hi- I have successfully been able to build qt4-mac for OS X 10.9 …
12:54 AM Changeset [112864] by takeshi@…
grib_api: updated for 1.11.0. provide Fortran variants a la …
12:54 AM Changeset in macports-ports [9e9e7478b1c5c72a7a3094aea65a12dc343c9b6f]boost_1.72.0_update by Takeshi Enomoto <takeshi@…>
grib_api: updated for 1.11.0. provide Fortran variants a la …
12:41 AM Ticket #41143 (ffmpeg STILL does not build under PPC Tiger!) created by ultrajoe@…
In spite of the comments in bug #39442, ffmpeg still does not …

Nov 2, 2013:

11:47 PM Changeset [112863] by cal@…
openttd: part one of the build fix for Mavericks. This will still fail …
11:47 PM Changeset in macports-ports [a27b6929fa451090ee3f0ea348e045f0f88709fa]boost_1.72.0_update by neverpanic (Clemens Lang)
openttd: part one of the build fix for Mavericks. This will still fail …
11:30 PM Ticket #41142 (cmake portgroup changes cause build failures) created by ryandesign (Ryan Schmidt)
See log.
11:20 PM Changeset [112862] by ryandesign@…
mongodb: update to 2.4.8
11:20 PM Changeset in macports-ports [6b22eafaa065ccda528a3a11f7dfdf2f1bcaf074]boost_1.72.0_update by ryandesign (Ryan Schmidt)
mongodb: update to 2.4.8 git-svn-id: …
11:17 PM Ticket #39479 (py-pytools @2012.1: build fails trying to use distribute) closed by ryandesign (Ryan Schmidt)
fixed: r112861
11:17 PM Changeset [112861] by ryandesign@…
py-pytools: update to 2013.5.6 (#39479)
11:17 PM Changeset in macports-ports [029920609ae0f1279c123c9379ec3e30d0fef396]boost_1.72.0_update by ryandesign (Ryan Schmidt)
py-pytools: update to 2013.5.6 …
11:15 PM Ticket #41141 (py33-pytools build fails) closed by ryandesign (Ryan Schmidt)
duplicate: Duplicate of #39479.
10:51 PM Ticket #40875 (mongodb 2.4 branch can't install on Mavericks) closed by ryandesign (Ryan Schmidt)
fixed: Replying to slava@…: > Hi I created patch that work on …
10:47 PM Changeset [112860] by ryandesign@…
mongodb: fix build on Mavericks (#40875)
10:47 PM Changeset in macports-ports [d2d9d6c1413287d43d7488630c0021ae3c41d830]boost_1.72.0_update by ryandesign (Ryan Schmidt)
mongodb: fix build on Mavericks …
10:38 PM Changeset [112859] by ryandesign@…
gvedit-devel: fix patch-cmd-gvedit-Makefile.in.diff
10:38 PM Changeset in macports-ports [6978568e22cf5ef03b5ef1d0a44c4de2f5aaba26]boost_1.72.0_update by ryandesign (Ryan Schmidt)
gvedit-devel: fix patch-cmd-gvedit-Makefile.in.diff git-svn-id: …
10:36 PM Ticket #41141 (py33-pytools build fails) created by avi@…
updated to 10.9 a few days ago. several ports wont build, one of them …
9:58 PM Ticket #40806 (octave-devel: error: 'CGDisplayBitsPerPixel' was not declared in this scope) closed by michaelld (Michael Dickens)
fixed: Excellent! Y'all are welcome! I'm closing this ticket as fixed.
9:56 PM Changeset [112858] by ryandesign@…
graphviz-devel: update to 2.35.20131102.0445
9:56 PM Changeset in macports-ports [6c20764eaf4024573e270d60a05b9d138cdff9f0]boost_1.72.0_update by ryandesign (Ryan Schmidt)
graphviz-devel: update to 2.35.20131102.0445 git-svn-id: …
9:34 PM Ticket #35241 (pymc: please update pymc 2.2, which has python 3 support) reopened by mf2k (Frank Schima)
In the future, you need to re-open the ticket or file a new one in …
9:33 PM Ticket #40758 (ld64 @136_2 Build error under Mavericks) reopened by help@…
While installing command line tools may have helped original reporter, …
9:19 PM Ticket #41140 (valgrind @3.9.0 fails to build on OS X 10.6.8) created by mopihopi
valgrind @3.9.0 fails to build on OS X 10.6.8: […]
9:14 PM Changeset [112857] by vince@…
Fixes spaces and typos
9:14 PM Changeset in macports-ports [2d92932d70b1d33ca24033f5accc61a650b958ae]boost_1.72.0_update by Veence (Vincent)
Fixes spaces and typos git-svn-id: …
8:38 PM Ticket #41098 (texlive-bin @2013_3 - upgrade failure) closed by drkp (Dan Ports)
invalid: Glad it's working now!
8:35 PM Ticket #41139 (Error: Unable to open port: extra characters after close-quote) closed by ryandesign (Ryan Schmidt)
fixed: I already fixed this in r112842. Run sudo port selfupdate.
8:17 PM Changeset [112856] by devans@…
gupnp-av: update to version 0.12.3.
8:17 PM Changeset in macports-ports [00eb38c8ba4078819e396d563e9b9296920dc8c2]boost_1.72.0_update by dbevans (David B. Evans)
gupnp-av: update to version 0.12.3. git-svn-id: …
8:16 PM Changeset [112855] by devans@…
gupnp: update to version 0.20.8.
8:16 PM Changeset in macports-ports [e5a4fd87e81108a4873b330e1338f81fe2ed5f51]boost_1.72.0_update by dbevans (David B. Evans)
gupnp: update to version 0.20.8. git-svn-id: …
8:13 PM Ticket #41139 (Error: Unable to open port: extra characters after close-quote) created by josephwinston (Joseph Winston)
OS X Mavericks When I try to run clean, info, or install on cgal, I …
8:09 PM Changeset [112854] by devans@…
gssdp: update to version 0.14.6.
8:09 PM Changeset in macports-ports [c08eccde563b7d2b057ee4744d57c5aa9c5036c2]boost_1.72.0_update by dbevans (David B. Evans)
gssdp: update to version 0.14.6. git-svn-id: …
8:05 PM Changeset [112853] by devans@…
lib2geom: correct livecheck.
8:05 PM Changeset in macports-ports [df1179c1a2d644488c340160f7259275d319d83d]boost_1.72.0_update by dbevans (David B. Evans)
lib2geom: correct livecheck. git-svn-id: …
7:49 PM Changeset [112852] by cal@…
ipv6calc: update to 0.94.1, ensure UsingTheRightCompiler
7:49 PM Changeset in macports-ports [3b262e10836bf9b682fa7e67353ff90f7f7d42d0]boost_1.72.0_update by neverpanic (Clemens Lang)
ipv6calc: update to 0.94.1, ensure UsingTheRightCompiler git-svn-id: …
7:40 PM Changeset [112851] by michaelld@…
glfw: update to eabbb20d (20131101).
7:40 PM Changeset in macports-ports [29af91a4fc38d183c0c50bb836322ce0b1df09d7]boost_1.72.0_update by michaelld (Michael Dickens)
glfw: update to eabbb20d (20131101). git-svn-id: …
7:40 PM Ticket #41138 (xcrun: error: unable to exec Xcode native xcrun (Permission denied).) created by mr.nice_365@…
seems like that happened before and some said that's not the reason …
7:34 PM Ticket #41044 (libproxy @0.4.11 rev-upgrade --id-loadcmd-check warning) closed by dbevans (David B. Evans)
fixed: Fixed in r112850. Thanks for catching this.
7:31 PM Changeset [112850] by devans@…
libproxy: correctly set directory component of perl extension dylib …
7:31 PM Changeset in macports-ports [e92cdf5be72756f9cf9bda0e24433fae55e42f67]boost_1.72.0_update by dbevans (David B. Evans)
libproxy: correctly set directory component of perl extension dylib …
7:07 PM Changeset [112849] by raimue@…
science/stellarium: Update to version 0.12.4 and fix build on OS X …
7:07 PM Changeset in macports-ports [c22d29fa22f943d4d76149b469dc2c73f0448df3]boost_1.72.0_update by raimue (Rainer Müller)
science/stellarium: Update to version 0.12.4 and fix build on OS X …
7:04 PM Changeset [112848] by raimue@…
devel/valgrind-devel: Update to version 3.9.0-r13710
7:04 PM Changeset in macports-ports [3f569e7e602774133eab4d77bd8b94df0282cefe]boost_1.72.0_update by raimue (Rainer Müller)
devel/valgrind-devel: Update to version 3.9.0-r13710 git-svn-id: …
6:53 PM Ticket #41094 (gtkevemon: update to 1.9) closed by neverpanic (Clemens Lang)
fixed: In r112847.
6:53 PM Changeset [112847] by cal@…
gtkevemon: update to 1.9, closes #41094, new maintainer, old …
6:53 PM Changeset in macports-ports [535626b43c5aed055098c1e0488784333585739f]boost_1.72.0_update by neverpanic (Clemens Lang)
gtkevemon: update to 1.9, closes …
6:50 PM Changeset [112846] by cal@…
ipv6calc: modeline, conform to modeline, whitespace only
6:50 PM Changeset in macports-ports [7d1e43b426175d99bd58cb9c85a69302b7aadf4f]boost_1.72.0_update by neverpanic (Clemens Lang)
ipv6calc: modeline, conform to modeline, whitespace only git-svn-id: …
6:49 PM Changeset [112845] by raimue@…
devel/valgrind: Update to version 3.9.0
6:49 PM Changeset in macports-ports [022b2c4a5e565cf6e41bbf7c90ceaa1f5fd6ecdf]boost_1.72.0_update by raimue (Rainer Müller)
devel/valgrind: Update to version 3.9.0 git-svn-id: …
6:32 PM Ticket #41115 (pidgin @2.10.7_1: Tcl development headers not found) closed by mf2k (Frank Schima)
invalid
6:20 PM Changeset [112844] by jeremyhu@…
cmake: Also use the correct C++ stdlib in +debug
6:20 PM Changeset in macports-ports [65f931f8727d947c3a7f6708948c0101cadefa8d]boost_1.72.0_update by jeremyhu (Jeremy Huddleston Sequoia)
cmake: Also use the correct C++ stdlib in +debug git-svn-id: …
6:17 PM Ticket #41134 (error configuring xorg-libX11 while installing gnuplot) closed by jeremyhu (Jeremy Huddleston Sequoia)
invalid: :info:configure Package file '/opt/local/lib/pkgconfig/xcb.pc' appears …
6:06 PM Changeset [112843] by jeremyhu@…
xorg-server: Actually provide patches
6:06 PM Changeset in macports-ports [f71e3a47cdb005631d6db237802a0735391722ab]boost_1.72.0_update by jeremyhu (Jeremy Huddleston Sequoia)
xorg-server: Actually provide patches git-svn-id: …
5:41 PM Changeset [112842] by ryandesign@…
cmake-1.0.tcl: fix "extra characters after close-quote"
5:41 PM Changeset in macports-ports [d3adf2ecfd0733bd8c0ff92cf4adc78be749c11d]boost_1.72.0_update by ryandesign (Ryan Schmidt)
cmake-1.0.tcl: fix "extra characters after close-quote" git-svn-id: …
5:27 PM Changeset [112841] by jeremyhu@…
xorg-presentproto: New port
5:27 PM Changeset in macports-ports [71720a99652ddaeb9ffe09bef9e4c948bd8da8eb]boost_1.72.0_update by jeremyhu (Jeremy Huddleston Sequoia)
xorg-presentproto: New port git-svn-id: …
5:22 PM Ticket #40648 (cmake @2.8.11.2 does not set optimization flags in release) closed by jeremyhu (Jeremy Huddleston Sequoia)
fixed: r112840 takes care of cxx_stdlib, and r112839 takes care of the port.
5:22 PM Changeset [112840] by jeremyhu@…
cmake: Honor configure.cxx_stdlib
5:22 PM Changeset in macports-ports [578e398f263bdd5c9ddc15fc454589d2c6c9b5bf]boost_1.72.0_update by jeremyhu (Jeremy Huddleston Sequoia)
cmake: Honor configure.cxx_stdlib git-svn-id: …
5:20 PM Ticket #41129 (llvm-gcc42: build fails) closed by ryandesign (Ryan Schmidt)
invalid: One issue per ticket, please. This ticket is about llvm-gcc42 failing …
5:19 PM Changeset [112839] by jeremyhu@…
Revert r110069 now that the PortGroup takes care of handling optflags.
5:19 PM Changeset in macports-ports [b92d5177aee8051fc7a39e88d958df20c64013d3]boost_1.72.0_update by jeremyhu (Jeremy Huddleston Sequoia)
Revert https://trac.macports.org/changeset/110069 now that the …
5:16 PM Ticket #41137 (Unable to open port: invalid command name "configure.cxx_stdlib") closed by ryandesign (Ryan Schmidt)
fixed: I believe this was caused by r112825 and fixed by r112828.
5:15 PM Changeset [112838] by jeremyhu@…
Consider the configure.cflags and configure.cxxflags for +debug …
5:15 PM Changeset in macports-ports [9a6bd833b8bfc50c681f12857431f46998f18b51]boost_1.72.0_update by jeremyhu (Jeremy Huddleston Sequoia)
Consider the configure.cflags and configure.cxxflags for +debug …
5:14 PM Changeset [112837] by jeremyhu@…
Change the CMAKE_BUILD_TYPE to Debug instead of debugFull for the …
5:14 PM Changeset in macports-ports [6aa70196eaf51365ed182cd3da41f7b72750b817]boost_1.72.0_update by jeremyhu (Jeremy Huddleston Sequoia)
Change the CMAKE_BUILD_TYPE to Debug instead of debugFull for the …
5:13 PM Changeset [112836] by jeremyhu@…
Improve the CMake PortGroup so that it handles the configure.*flags. …
5:13 PM Changeset in macports-ports [623d65cfbf30015d9e67c65ed88e70d5f9ca4b7a]boost_1.72.0_update by jeremyhu (Jeremy Huddleston Sequoia)
Improve the CMake PortGroup so that it handles the configure.*flags. …
5:08 PM Ticket #41137 (Unable to open port: invalid command name "configure.cxx_stdlib") created by evandrix (Lee Wei Yeong)
Running the command sudo port -f clean --all all on the latest …
4:46 PM Ticket #38959 (vim @7.3.762 +lua Adding Lua variant) closed by raimue (Rainer Müller)
fixed: Variant +lua committed for vim, vim-app, and MacVim in r112835.
4:44 PM Changeset [112835] by raimue@…
editors/vim, editors/vim-app, editors/MacVim: Add +lua variant, closes …
4:44 PM Changeset in macports-ports [da289845aef4eecb6589f74b62411dce46dfeb98]boost_1.72.0_update by raimue (Rainer Müller)
editors/vim, editors/vim-app, editors/MacVim: Add +lua variant, closes …
4:39 PM Changeset [112834] by jeremyhu@…
xorg-server: Bump to 1.14.4 and address #38993
4:39 PM Changeset in macports-ports [1de69e4e3bf7014401d59bd3bb44e2b72993e126]boost_1.72.0_update by jeremyhu (Jeremy Huddleston Sequoia)
xorg-server: Bump to 1.14.4 and address …
4:01 PM Changeset [112833] by michaelld@…
octave-devel: add forgotten patch.
4:01 PM Changeset in macports-ports [1f1d90158a52c8bbe7563c539364c3703c90d456]boost_1.72.0_update by michaelld (Michael Dickens)
octave-devel: add forgotten patch. git-svn-id: …
3:33 PM Ticket #41136 (kdelibs3 @3.5.10: error: member access into incomplete type 'ipp_t' ...) created by lodovico.ratti@…
I am trying to install kile under mavericks. While installing kdelibs3 …
3:10 PM Ticket #41135 (gsl: libgsl.0.dylib possibly uses incorrect library id.) closed by neverpanic (Clemens Lang)
invalid: Glad you got it working.
3:02 PM Ticket #40924 (GitX fails to build on OS X 10.9 Mavericks) closed by neverpanic (Clemens Lang)
fixed: Thanks, r112832.
3:02 PM Changeset [112832] by cal@…
GitX: fix build on Mavericks, closes #40924
3:02 PM Changeset in macports-ports [9fcfe8479f155440de3c25052b80061c06e8a0dd]boost_1.72.0_update by neverpanic (Clemens Lang)
GitX: fix build on Mavericks, closes …
2:30 PM Ticket #40901 (vtk5 does not build under OSX 10.9) closed by raimue (Rainer Müller)
fixed: Patch committed in r112831.
2:30 PM Changeset [112831] by raimue@…
graphics/vtk5: Fix build on OS X 10.9 Mavericks, closes #40901
2:30 PM Changeset in macports-ports [eb65300f269818f5f8647a081c52ef34b6df0943]boost_1.72.0_update by raimue (Rainer Müller)
graphics/vtk5: Fix build on OS X 10.9 Mavericks, closes …
2:17 PM Changeset [112830] by easieste@…
Update to apache-maven-3.1.1. Change the install path to the more …
2:17 PM Changeset in macports-ports [85a1acbc782f1d9d093aa4d7abe0d9f4835c27f6]boost_1.72.0_update by Mark Evenson <easieste@…>
Update to apache-maven-3.1.1. Change the install path to the more …
12:46 PM Changeset [112829] by raimue@…
editors/vim, editors/vim-app, editors/MacVim: Add configure option …
12:46 PM Changeset in macports-ports [5da741fd189e54e1b8abf805f7d9d00c951e0507]boost_1.72.0_update by raimue (Rainer Müller)
editors/vim, editors/vim-app, editors/MacVim: Add configure option …
12:32 PM Changeset [112828] by raimue@…
Make configure.cxx_stdlib optional as our buildbots do not know about …
12:32 PM Changeset in macports-ports [a97e4411aa421e20b42a0cff02293c3004a6ea2a]boost_1.72.0_update by raimue (Rainer Müller)
Make configure.cxx_stdlib optional as our buildbots do not know about …
12:28 PM Ticket #40668 (arm-none-eabi-gcc: add --disable-newlib-supplied-syscalls) closed by raimue (Rainer Müller)
fixed: Thanks for the patch! Committed in r112827.
12:28 PM Changeset [112827] by raimue@…
cross/arm-none-eabi-gcc: Add --disable-newlib-supplied-syscalls, …
12:28 PM Changeset in macports-ports [54a1f83775caed7f8ac784ad34cd3bb60756a321]boost_1.72.0_update by raimue (Rainer Müller)
cross/arm-none-eabi-gcc: Add --disable-newlib-supplied-syscalls, …
12:10 PM Changeset [112826] by raimue@…
cross/arm-none-eabi-gcc: Update to version 4.7.3
12:10 PM Changeset in macports-ports [0e262380ac42304400172e115e7baa91922bb4ee]boost_1.72.0_update by raimue (Rainer Müller)
cross/arm-none-eabi-gcc: Update to version 4.7.3 git-svn-id: …
12:09 PM Changeset [112825] by raimue@…
Fix building with crossgcc port group when configure.cxx_stdlib is set
12:09 PM Changeset in macports-ports [863877e8b642409336343a5164d9dcc5fff42d10]boost_1.72.0_update by raimue (Rainer Müller)
Fix building with crossgcc port group when configure.cxx_stdlib is set …
11:59 AM Changeset [112824] by raimue@…
Add debug output for PortGroup paths
11:59 AM Changeset in macports-base [16bbed0b4ff069f92434dc003bb2e539dcdfaa17]fix-cxx-2017-compiler-selgsoc14-cleanupgsoc14-interactivegsoc15-dependencygsoc15-portfilegsoc17-migratelibsolvportgroups-selectorrelease-2.3release-2.4release-2.5release-2.6travis-civcs-fetch by raimue (Rainer Müller)
Add debug output for PortGroup paths git-svn-id: …
9:54 AM Changeset [112823] by g5pw@…
python/py-memprof: update to 0.3.3
9:54 AM Changeset in macports-ports [98015234f03f5ecce89f28771cb092a8d57558f1]boost_1.72.0_update by g5pw (Aljaž Srebrnič)
python/py-memprof: update to 0.3.3 git-svn-id: …
9:53 AM Changeset [112822] by g5pw@…
python/py-quantities: don't overwrite categories
9:53 AM Changeset in macports-ports [0d2e8ceb68559c231cb5793894d90a34c51db265]boost_1.72.0_update by g5pw (Aljaž Srebrnič)
python/py-quantities: don't overwrite categories git-svn-id: …
8:50 AM Ticket #41135 (gsl: libgsl.0.dylib possibly uses incorrect library id.) created by mario.stief@…
I'm using MacPorts for Mavericks. After installing the package gsl and …
8:43 AM Ticket #41134 (error configuring xorg-libX11 while installing gnuplot) created by ariscampis@…
[…]
5:15 AM Ticket #41129 (llvm-gcc42: build fails) reopened by chbperso@…
Replying to ryandesign@…: > The log says: > > {{{ > …
4:26 AM Ticket #41131 (Dependencies on different variants of specific port cannot be resolved ...) closed by larryv (Lawrence Velázquez)
duplicate: Duplicate of #126.
4:09 AM Changeset [112821] by michaelld@…
qt4-mac: move libWebKitSystemInterfaceMavericks.a to a distfile; …
4:09 AM Changeset in macports-ports [b9e6c0fc2691e3dd44f899488e865a222a8d2a7e]boost_1.72.0_update by michaelld (Michael Dickens)
qt4-mac: move libWebKitSystemInterfaceMavericks.a to a distfile; …
3:54 AM Changeset [112820] by ryandesign@…
libpixman-devel: update to 0.31.2
3:54 AM Changeset in macports-ports [157e797ce3a3c84fd7d3e440f104981b85236964]boost_1.72.0_update by ryandesign (Ryan Schmidt)
libpixman-devel: update to 0.31.2 git-svn-id: …
3:26 AM Changeset [112819] by mmoll@…
py-shiboken: use sparsehash port instead of bundled sparsehash
3:26 AM Changeset in macports-ports [8c5c60bcc80a6bc323c7ea80c9bdf3b678b8e57a]boost_1.72.0_update by Mark Moll <mmoll@…>
py-shiboken: use sparsehash port instead of bundled sparsehash …
1:25 AM Ticket #40758 (ld64 @136_2 Build error under Mavericks) closed by jeremyhu (Jeremy Huddleston Sequoia)
invalid: Make sure you reinstall the command line tools after upgrading to 10.9.
12:55 AM Ticket #41133 ([bluefish] [2.0.3] [The latest stable version is Bluefish 2.2.4]) created by contact@…
Hello, this is my first ticket for macports so don't please don't tear …
12:20 AM Ticket #41132 (luajit installs differently depending on whether lua is installed) created by ryandesign (Ryan Schmidt)
luajit does not declare a dependency on lua but installs itself …
12:07 AM Ticket #41093 (gettext @0.18.3.1_1 build failure) closed by ryandesign (Ryan Schmidt)
invalid: Right, bad idea. OS X does not use GNU lib C or ELF files, so …
Note: See TracTimeline for information about the timeline view.