Timeline



Dec 5, 2013:

11:58 PM Ticket #41708 (textproc xml and sgml ports packaging and bugfixes) created by lockhart (Thomas Lockhart)
There are several textproc/ packages which rely on using and updating …
11:18 PM Ticket #41707 (tao @6.2.3 New version available) created by lockhart (Thomas Lockhart)
A new version is available. This is a simple patch to update to the …
11:17 PM Ticket #41706 (ace @6.2.3 New version available) created by lockhart (Thomas Lockhart)
A new version is available. Here is a simple Portfile patch to update …
11:00 PM Ticket #41705 (gettext: build hangs) created by info@…
Trying to install expat and/or gettext hangs. The hang prevents me …
10:20 PM Ticket #39306 (virtuoso @6.1.6_2 build failure when xnu-headers is installed) closed by nerdling (Jeremy L)
fixed: Alrighty, thanks. I'm adding error messages to direct the user to …
10:19 PM Changeset [114356] by snc@…
virtuoso: avoid build conflict with xnu-headers on snow leopard and …
10:19 PM Changeset in macports-ports [78f6da4e648056a5c86c3a220468660d16d284e0]boost_1.72.0_updatevirt-hackery by nerdling (Jeremy L)
virtuoso: avoid build conflict with xnu-headers on snow leopard and …
9:01 PM Changeset [114355] by pixilla@…
multimedia/mythtv-core.27: - Maintainer patch. - Update to version …
9:01 PM Changeset in macports-ports [09f0d4741786cf70b803a88b81260e1aee9e526e]boost_1.72.0_updatevirt-hackery by Bradley Giesbrecht <pixilla@…>
multimedia/mythtv-core.27: - Maintainer patch. - Update to version …
8:44 PM Ticket #41704 (qgis depends on py27-pyqt4-devel) created by mabouali@…
Hi, qgis is not compiling on MAC OSX 10.9 (Maverick) One problem is …
8:41 PM Ticket #41703 (fuse4x-kext: No architectures to compile for (ARCHS=, VALID_ARCHS=i386 ...) created by mparchet@…
Hello, When I reied to install ntfs_3g on mac os 10.9 I get an errer. …
8:01 PM Changeset [114354] by mmoll@…
boost: update patch for +python3X variants (#41568)
8:01 PM Changeset in macports-ports [1ddbd3351389053649a7a31f4c252835f9701ac0]boost_1.72.0_updatevirt-hackery by Mark Moll <mmoll@…>
boost: update patch for +python3X variants …
8:00 PM Ticket #40898 (boost +python33 +openmpi fails to build on OS X 10.9 Mavericks) closed by mamoll (Mark Moll)
fixed: Seems to be fixed in boost 1.55.
7:21 PM Ticket #40108 (virtuoso: build fails: link: `../../libsrc/Dk/libdk1t.la' is not a ...) closed by nerdling (Jeremy L)
worksforme
7:06 PM Ticket #40882 (virtuoso: build fails) closed by nerdling (Jeremy L)
fixed: Marked as x86_64-only in r114353. If you need 32-bit, you can attempt …
7:05 PM Changeset [114353] by snc@…
virtuoso: only builds 64-bit, #40882
7:05 PM Changeset in macports-ports [3cc37851d45c4a5f294626619acecb1511220e92]boost_1.72.0_updatevirt-hackery by nerdling (Jeremy L)
virtuoso: only builds 64-bit, https://trac.macports.org/ticket/40882
7:00 PM Ticket #41535 (upgrade of py27-aplpy fails) closed by robitaille@…
fixed
7:00 PM Ticket #41664 (Upgrade virtuoso 7.0.0_0 to 7.0.0_1 fails) closed by nerdling (Jeremy L)
fixed: libiodbc appears to be fine, with only unixODBC conflicting. Added …
6:59 PM Changeset [114352] by snc@…
virtuoso: avoid build conflict with unixODBC, #41664
6:59 PM Changeset in macports-ports [3f2fde7f63def334faaa199c03bab91ad3bff3fc]boost_1.72.0_updatevirt-hackery by nerdling (Jeremy L)
virtuoso: avoid build conflict with unixODBC, …
6:50 PM Changeset [114351] by mmoll@…
fcl: use eq instead of == for testing string equality
6:50 PM Changeset in macports-ports [1bb5cf7bdaff9ba0e2ffd9c99afa508d2e80cbbf]boost_1.72.0_updatevirt-hackery by Mark Moll <mmoll@…>
fcl: use eq instead of == for testing string equality git-svn-id: …
5:59 PM Ticket #41647 (Unbound doesn't want to start after install) closed by nerdling (Jeremy L)
worksforme: I have rebuilt and reinstalled unbound and the symlink is owned by …
5:39 PM Ticket #41702 (Falcon: Link failure with pcre symbols) closed by nerdling (Jeremy L)
worksforme: I was able to build Falcon just fine. See …
5:30 PM Ticket #41376 (atlas @3.10.1_5 +clang Build fails) closed by Veence (Vincent)
duplicate: Excellent! Nice to know you were able to solve this conundrum. I …
4:07 PM Ticket #41702 (Falcon: Link failure with pcre symbols) created by NicosPavlov
I am getting an error while trying to build falcon, where linkage …
4:04 PM Changeset [114350] by snc@…
py-pyxg: incompatible on OS X >= 10.8
4:04 PM Changeset in macports-ports [b9b8552d8c635f4a87ba6da64fd904ccfafe42eb]boost_1.72.0_updatevirt-hackery by nerdling (Jeremy L)
py-pyxg: incompatible on OS X >= 10.8 git-svn-id: …
3:46 PM Changeset [114349] by michaelld@…
gnuradio: remove integrated patchfile.
3:46 PM Changeset in macports-ports [37e1bfd2dbbd1b75bf4ad55273b9f1afe525553d]boost_1.72.0_updatevirt-hackery by michaelld (Michael Dickens)
gnuradio: remove integrated patchfile. git-svn-id: …
3:14 PM Ticket #41699 (graphite2 upgrade fails.) closed by ryandesign (Ryan Schmidt)
fixed: Thanks for the report. I hadn't seen this on my main machine because …
3:13 PM Changeset [114348] by ryandesign@…
graphite2: fix upgrade failure (#41699)
3:13 PM Changeset in macports-ports [84da327e71ad697706512a58e5e0ba7ed8b308ef]boost_1.72.0_updatevirt-hackery by ryandesign (Ryan Schmidt)
graphite2: fix upgrade failure …
2:58 PM Changeset [114347] by michaelld@…
gr-osmosdr: update port to 05d51b53 and legacy to 86ecf305, both 20131204.
2:58 PM Changeset in macports-ports [6d804bec740208634f3b5760e6103fc20b18f12e]boost_1.72.0_updatevirt-hackery by michaelld (Michael Dickens)
gr-osmosdr: update port to 05d51b53 and legacy to 86ecf305, both …
2:45 PM Changeset [114346] by vince@…
Take into account various remarks by Ryan; thanks!
2:45 PM Changeset in macports-ports [ddb46e918cd838da9c2d8dc3abc4007d1f98d804]boost_1.72.0_updatevirt-hackery by Veence (Vincent)
Take into account various remarks by Ryan; thanks! git-svn-id: …
2:39 PM Changeset [114345] by michaelld@…
gqrx: + update devel to 32898619 (20131204); + libc++ patch is …
2:39 PM Changeset in macports-ports [259e77d71a2804aaae4db0297783cebe42b59b37]boost_1.72.0_updatevirt-hackery by michaelld (Michael Dickens)
gqrx: + update devel to 32898619 (20131204); + libc++ patch is …
2:36 PM Changeset [114344] by jwa@…
postgresql84: version bump to 8.4.19
2:36 PM Changeset in macports-ports [0f7423d4e8a202f639dbe9756577b8fde954611b]boost_1.72.0_updatevirt-hackery by jyrkiwahlstedt
postgresql84: version bump to 8.4.19 git-svn-id: …
2:35 PM Changeset [114343] by jwa@…
postgresql90: version bump to 9.0.15
2:35 PM Changeset in macports-ports [eb77ef22420b3bcb69ac92d0585a9794a612608a]boost_1.72.0_updatevirt-hackery by jyrkiwahlstedt
postgresql90: version bump to 9.0.15 git-svn-id: …
2:34 PM Changeset [114342] by jwa@…
postgresql91: version bump to 9.1.11
2:34 PM Changeset in macports-ports [ce61df700363689eb29564559374af6e85016146]boost_1.72.0_updatevirt-hackery by jyrkiwahlstedt
postgresql91: version bump to 9.1.11 git-svn-id: …
2:34 PM Changeset [114341] by jwa@…
postgresql92: version bump to 9.2.6
2:34 PM Changeset in macports-ports [5ffb4f33b5092062a67a63b1e27e3cf2e93e66cb]boost_1.72.0_updatevirt-hackery by jyrkiwahlstedt
postgresql92: version bump to 9.2.6 git-svn-id: …
2:33 PM Changeset [114340] by jwa@…
postgresql93: version bump to 9.3.2
2:33 PM Changeset in macports-ports [00e4f7abe595bf46039c6ca37317d68281c6937e]boost_1.72.0_updatevirt-hackery by jyrkiwahlstedt
postgresql93: version bump to 9.3.2 git-svn-id: …
2:30 PM Ticket #41700 (octave +atlas+docs Error: Processing of port octave failed) closed by ryandesign (Ryan Schmidt)
duplicate: Duplicate of #37604. Try installing without the +docs variant first, …
2:23 PM Ticket #41701 (Failed to open ...) created by idleft@…
Hi guys. Sorry for bother again. I met a problem installing "ncurses". …
1:58 PM Ticket #41700 (octave +atlas+docs Error: Processing of port octave failed) created by tckuehn@…
[…] I am using 10.9 and installed xcode and macports fresh (no …
1:19 PM Ticket #41699 (graphite2 upgrade fails.) created by watsodw
See log.
1:11 PM Changeset [114339] by cal@…
binutils: whitespace only, add modeline
1:11 PM Changeset in macports-ports [26e473b5930ca0781741caf64043f7a236fed410]boost_1.72.0_updatevirt-hackery by neverpanic (Clemens Lang)
binutils: whitespace only, add modeline git-svn-id: …
1:10 PM Changeset [114338] by cal@…
binutils: update to 2.24
1:10 PM Changeset in macports-ports [9f3d62a226e1e49bc3473935044239a5942124cb]boost_1.72.0_updatevirt-hackery by neverpanic (Clemens Lang)
binutils: update to 2.24 git-svn-id: …
12:53 PM Changeset [114337] by g5pw@…
devel/appledoc: update description
12:53 PM Changeset in macports-ports [eeba587f0d4d81c46cc6b690efdf681d4806e589]boost_1.72.0_updatevirt-hackery by g5pw (Aljaž Srebrnič)
devel/appledoc: update description git-svn-id: …
12:30 PM Changeset [114336] by ryandesign@…
harfbuzz: update to 0.9.25
12:30 PM Changeset in macports-ports [6161080bcaf90a7d9475b0f9e170687094717160]boost_1.72.0_updatevirt-hackery by ryandesign (Ryan Schmidt)
harfbuzz: update to 0.9.25 git-svn-id: …
12:30 PM Changeset [114335] by ryandesign@…
graphite2: update to 1.2.4
12:30 PM Changeset in macports-ports [133d9976da2512be1e38e59405e3a8c2e5f37107]boost_1.72.0_updatevirt-hackery by ryandesign (Ryan Schmidt)
graphite2: update to 1.2.4 git-svn-id: …
12:11 PM Changeset [114334] by ryandesign@…
phpmyadmin: update to 4.0.10
12:11 PM Changeset in macports-ports [695a93ed5e2a89f303ce9473e3cd0ee31f7202ac]boost_1.72.0_updatevirt-hackery by ryandesign (Ryan Schmidt)
phpmyadmin: update to 4.0.10 git-svn-id: …
12:10 PM Changeset [114333] by ryandesign@…
youtube-dl: update to 2013.12.04
12:10 PM Changeset in macports-ports [d96373e314c5f9338f7e0b944b50c2b257fda319]boost_1.72.0_updatevirt-hackery by ryandesign (Ryan Schmidt)
youtube-dl: update to 2013.12.04 git-svn-id: …
12:00 PM Ticket #41698 (rpm: use libmagic instead of bundled version) created by ryandesign (Ryan Schmidt)
The rpm port uses an old version of libmagic included in the rpm …
11:40 AM Ticket #40128 (rpm: Undefined symbols: _libiconv _libiconv_close _libiconv_open) closed by ryandesign (Ryan Schmidt)
fixed: I tested the patch before attaching it. It works. Committed in r114332
11:40 AM Ticket #41697 (rpm: libtool: link: cannot find the library `/opt/local/lib/libpopt.la') created by ryandesign (Ryan Schmidt)
rpm fails to build on Mavericks, saying: […] On Mavericks by …
11:34 AM Changeset [114332] by ryandesign@…
rpm: fix build failure due to undefined libiconv symbols (#40128; …
11:34 AM Changeset in macports-ports [537f9704b7943fd43a4d3c5769febc876e5c3a12]boost_1.72.0_updatevirt-hackery by ryandesign (Ryan Schmidt)
rpm: fix build failure due to undefined libiconv symbols …
11:27 AM Changeset [114331] by ryandesign@…
tcpdump: update to 4.5.1
11:27 AM Changeset in macports-ports [a154ed16227fc64917ec718ac117ecb930911186]boost_1.72.0_updatevirt-hackery by ryandesign (Ryan Schmidt)
tcpdump: update to 4.5.1 git-svn-id: …
11:26 AM Ticket #39232 (libpcap: please update to 1.5.2) closed by ryandesign (Ryan Schmidt)
fixed: Updated to 1.5.2 in r114330.
11:26 AM Changeset [114330] by ryandesign@…
libpcap: update to 1.5.2 (#39232)
11:26 AM Changeset in macports-ports [c287d385afd2d9f71504e4b6f36d9eb2c443e628]boost_1.72.0_updatevirt-hackery by ryandesign (Ryan Schmidt)
libpcap: update to 1.5.2 (https://trac.macports.org/ticket/39232) …
11:02 AM Ticket #41696 (rpm: undefined libiconv symbols) closed by ryandesign (Ryan Schmidt)
duplicate: The log says: […] That makes this a duplicate of #40128.
10:54 AM Ticket #41598 (py27-pyobjc @2.5.1_0 build fails) closed by ci42
worksforme
10:48 AM Ticket #41696 (rpm: undefined libiconv symbols) created by jyewen001@…
Who can help me. I run to sudo port install rpm report a error on …
10:22 AM Changeset [114329] by ryandesign@…
appledoc: use eq for string comparison
10:22 AM Changeset in macports-ports [e30190e458c128672d4b15cd7c3b258323b3d308]boost_1.72.0_updatevirt-hackery by ryandesign (Ryan Schmidt)
appledoc: use eq for string comparison git-svn-id: …
10:21 AM Changeset [114328] by ryandesign@…
use eq and ne instead of == and != when comparing ${os.arch}, …
10:21 AM Changeset in macports-ports [3ada155dffee01f2c993c38d15d8df228d675966]boost_1.72.0_updatevirt-hackery by ryandesign (Ryan Schmidt)
use eq and ne instead of == and != when comparing ${os.arch}, …
10:08 AM Changeset [114327] by g5pw@…
devel/appledoc: new port
10:08 AM Changeset in macports-ports [2db6739759faeae65b4397be0f2f91892b683064]boost_1.72.0_updatevirt-hackery by g5pw (Aljaž Srebrnič)
devel/appledoc: new port git-svn-id: …
10:01 AM Changeset [114326] by vince@…
Initial commit of v.2
10:01 AM Changeset in macports-ports [c8071598d0077c832eb3bdf9fb66c3e3361386dd]boost_1.72.0_updatevirt-hackery by Veence (Vincent)
Initial commit of v.2 git-svn-id: …
9:20 AM Changeset [114325] by ryandesign@…
use eq and ne instead of == and != when comparing ${os.platform} and …
9:20 AM Changeset in macports-ports [c8759386541272aae103f6164dba76cf48b225d5]boost_1.72.0_updatevirt-hackery by ryandesign (Ryan Schmidt)
use eq and ne instead of == and != when comparing ${os.platform} and …
8:44 AM Changeset [114324] by ryandesign@…
python ports: use eq and ne when comparing ${subport} instead of == and !=
8:44 AM Changeset in macports-ports [8dd19bec0e842813f349154fec75208d45d33edb]boost_1.72.0_updatevirt-hackery by ryandesign (Ryan Schmidt)
python ports: use eq and ne when comparing ${subport} instead of == …
7:48 AM Changeset [114323] by jwa@…
py-wxpython-2.8: limiting livecheck to 2.8.x
7:48 AM Changeset in macports-ports [61311b666137dd8ff7bfbd32df6286743b00fc0b]boost_1.72.0_updatevirt-hackery by jyrkiwahlstedt
py-wxpython-2.8: limiting livecheck to 2.8.x git-svn-id: …
7:47 AM Changeset [114322] by jwa@…
wxWidgets-2.8: limiting livecheck to 2.8.x
7:47 AM Changeset in macports-ports [093c2a4e1eefa86c1f69de2e399be369117bc059]boost_1.72.0_updatevirt-hackery by jyrkiwahlstedt
wxWidgets-2.8: limiting livecheck to 2.8.x git-svn-id: …
7:43 AM Changeset [114321] by ryandesign@…
lftp: fix universal variant build failure (it checks bitness at …
7:43 AM Changeset in macports-ports [91aa8e01d9557fb71d086338d863e8497c8e3d5b]boost_1.72.0_updatevirt-hackery by ryandesign (Ryan Schmidt)
lftp: fix universal variant build failure (it checks bitness at …
7:28 AM Ticket #41685 (p5-netpacket: update to version 1.4.4) closed by ryandesign (Ryan Schmidt)
fixed: r114320
7:28 AM Changeset [114320] by ryandesign@…
p5-netpacket: maintainer update to 1.4.4 (#41685)
7:28 AM Changeset in macports-ports [3267aabd7617b3c01a4493907166e50f11cf3b68]boost_1.72.0_updatevirt-hackery by ryandesign (Ryan Schmidt)
p5-netpacket: maintainer update to 1.4.4 …
7:28 AM Ticket #41684 (p5-set-scalar: update to version 1.26) closed by ryandesign (Ryan Schmidt)
fixed: r114319
7:28 AM Changeset [114319] by ryandesign@…
p5-set-scalar: maintainer update to 1.26 (#41684)
7:28 AM Changeset in macports-ports [6c4f9137ba0cb40003c1d05a6a38d34726229feb]boost_1.72.0_updatevirt-hackery by ryandesign (Ryan Schmidt)
p5-set-scalar: maintainer update to 1.26 …
7:24 AM Ticket #41683 (p5-http-server-simple-psgi: update to version 0.16) closed by ryandesign (Ryan Schmidt)
fixed: r114318
7:24 AM Changeset [114318] by ryandesign@…
p5-http-server-simple-psgi: maintainer update to 0.16 (#41683)
7:24 AM Changeset in macports-ports [40dac2cc5291ede48a1650920da8b9e1cf1fcbd4]boost_1.72.0_updatevirt-hackery by ryandesign (Ryan Schmidt)
p5-http-server-simple-psgi: maintainer update to 0.16 …
7:12 AM Ticket #41692 (berkeleygw: update to 1.0.6) closed by ryandesign (Ryan Schmidt)
fixed: r114317; I also disabled the universal variant because dependency fftw …
7:12 AM Changeset [114317] by ryandesign@…
berkeleygw: maintainer update to 1.0.6 (#41692); disable universal variant
7:12 AM Changeset in macports-ports [a1ea8e8072ef014437f5e031bc7b63bba850883e]boost_1.72.0_updatevirt-hackery by ryandesign (Ryan Schmidt)
berkeleygw: maintainer update to 1.0.6 …
6:40 AM Changeset [114316] by devans@…
gnome: update to version 3.10.2, license, dependencies.
6:40 AM Changeset in macports-ports [3e83ab0489620576a1f5c806cf5af0046280028c]boost_1.72.0_updatevirt-hackery by dbevans (David B. Evans)
gnome: update to version 3.10.2, license, dependencies. git-svn-id: …
6:39 AM Ticket #41695 (vim @7.4.052_0+huge+python27 build failure) created by karen.yyng@…
When I try to build vim from macport, it seems like macport fails to …
6:35 AM Changeset [114315] by stromnov@…
bullet: update to version 2.82
6:35 AM Changeset in macports-ports [3f472d93e59c94d734c2cef2044c72c1075c1492]boost_1.72.0_updatevirt-hackery by stromnov (Andrew Stromnov)
bullet: update to version 2.82 git-svn-id: …
5:45 AM Changeset [114314] by devans@…
gimp2: fix webkit-gtk dependencies, one version not both.
5:45 AM Changeset in macports-ports [49466169c0a70aeb595eeba2a60db83ee3080fbc]boost_1.72.0_updatevirt-hackery by dbevans (David B. Evans)
gimp2: fix webkit-gtk dependencies, one version not both. git-svn-id: …
5:23 AM Ticket #41638 (gnucash won't run b/c libvorbisfile is too old) closed by ryandesign (Ryan Schmidt)
invalid: Restarting the computer should not be necessary, only creating a new …
5:09 AM Changeset [114313] by ryandesign@…
p5-test-unit: remove dependencies from stub port
5:09 AM Changeset in macports-ports [a2f2e8b48014c87e32e57cc35b9690f34d132742]boost_1.72.0_updatevirt-hackery by ryandesign (Ryan Schmidt)
p5-test-unit: remove dependencies from stub port git-svn-id: …
4:45 AM Ticket #41694 (gnome-session: build fails on Snow Leopard, getline()) closed by dbevans (David B. Evans)
fixed: Tentative fix using private getline(), getdelim() on 10.6 and earlier …
4:35 AM Changeset [114312] by devans@…
gnome-session: tentative build fix for SL.
4:35 AM Changeset in macports-ports [20bc9714b7b48fb86e792ddf3397fd1a2d4002cb]boost_1.72.0_updatevirt-hackery by dbevans (David B. Evans)
gnome-session: tentative build fix for SL. git-svn-id: …
4:20 AM Ticket #41686 (lftp: update to version 4.4.13) closed by ryandesign (Ryan Schmidt)
fixed: r114311
4:19 AM Changeset [114311] by ryandesign@…
lftp: update to 4.4.13 (#41686)
4:19 AM Changeset in macports-ports [cff47c77dbee069e8c8780644f23f93921b1efcd]boost_1.72.0_updatevirt-hackery by ryandesign (Ryan Schmidt)
lftp: update to 4.4.13 (https://trac.macports.org/ticket/41686) …
3:30 AM Changeset [114310] by blair@…
p5-class-inner: add master_sites to download tarball from non-FTP site.
3:30 AM Changeset in macports-ports [be904613f497f8e44f555622d5f4f56438345fca]boost_1.72.0_updatevirt-hackery by blair (Blair Zajac)
p5-class-inner: add master_sites to download tarball from non-FTP …
3:18 AM Changeset [114309] by blair@…
p5-test-unit: add missing depends_lib on Class::Inner.
3:18 AM Changeset in macports-ports [9ef03f73234dd096603e22534ee3132724187aa1]boost_1.72.0_updatevirt-hackery by blair (Blair Zajac)
p5-test-unit: add missing depends_lib on Class::Inner. git-svn-id: …
2:59 AM Changeset [114308] by blair@…
p5-test-unit: new port for Test::Unit 0.25.
2:59 AM Changeset in macports-ports [85bc87dbe43d2e9a667744fa8a2ddf1eee48e23d]boost_1.72.0_updatevirt-hackery by blair (Blair Zajac)
p5-test-unit: new port for Test::Unit 0.25. git-svn-id: …
2:59 AM Changeset [114307] by blair@…
p5-class-inner: new port for Class::Inner 0.1.
2:59 AM Changeset in macports-ports [a0f01eb554d8fbb27cdc20cf99305161af2d0892]boost_1.72.0_updatevirt-hackery by blair (Blair Zajac)
p5-class-inner: new port for Class::Inner 0.1. git-svn-id: …
1:49 AM Ticket #41117 (Try to install dsniff on Mac 10.9.-.Mavericks) closed by neverpanic (Clemens Lang)
worksforme: Works fine for me, plus there's a suitable db.h in /usr/include. …
1:40 AM Ticket #40681 (Perl5.10 won't install on OS X Mavericks) closed by neverpanic (Clemens Lang)
fixed: The Mavericks buildbot is currently building p5.10-* packages, so I'd …
1:35 AM Ticket #41691 (gstreamer010-gst-plugins-base @0.10.36_2+universal - build failure) closed by ryandesign (Ryan Schmidt)
invalid: The main.log file you attached does not show a build failure, and the …
1:31 AM Ticket #41690 (`xcode-select --install` failing) closed by ryandesign (Ryan Schmidt)
invalid: You've received an answer on Stack Overflow. This issue tracker is …
12:44 AM Ticket #41694 (gnome-session: build fails on Snow Leopard, getline()) created by dbevans (David B. Evans)
gnome-session builds without error on Lion and up but fails on Snow …
12:31 AM Ticket #41693 (ld64 broken) created by phyrrus9@…
ld64 fails to build on OSX 10.9, because <unordered_set> could not be …

Dec 4, 2013:

11:42 PM Ticket #41506 (gnome-session failed start) closed by dbevans (David B. Evans)
fixed: Fixed in r114306. Manually setting DBUS_SESSION_BUS_ADDRESS is no …
11:38 PM Changeset [114306] by devans@…
gnome-session: check for session dbus address if …
11:38 PM Changeset in macports-ports [f2396b2269689da23e608a27e981e022c9610d17]boost_1.72.0_updatevirt-hackery by dbevans (David B. Evans)
gnome-session: check for session dbus address if …
11:21 PM Ticket #41692 (berkeleygw: update to 1.0.6) created by dstrubbe (David Strubbe)
Update to version 1.0.6. Adding patch to avoid a test failure.
10:48 PM Changeset [114305] by robitaille@…
py-aplpy: updated to 0.9.11
10:48 PM Changeset in macports-ports [3ff7e5cf684e74372e5a491afb6af1a502217a4a]boost_1.72.0_updatevirt-hackery by Thomas Robitaille <robitaille@…>
py-aplpy: updated to 0.9.11 git-svn-id: …
9:04 PM Ticket #41689 (llvm-3.0 @3.0_12: not supported on Mavericks or later) closed by jeremyhu (Jeremy Huddleston Sequoia)
invalid: yep.
8:26 PM Ticket #41691 (gstreamer010-gst-plugins-base @0.10.36_2+universal - build failure) created by MacPro@…
Error: Failed to install gstreamer010-gst-plugins-base […]
8:10 PM Changeset [114304] by larryv@…
frescobaldi: Fix typo introduced in r114303.
8:10 PM Changeset in macports-ports [c0b3e701a056b47c8d7b35dfc2fcfe88c4937d91]boost_1.72.0_updatevirt-hackery by larryv (Lawrence Velázquez)
frescobaldi: Fix typo introduced in …
7:47 PM Ticket #41690 (`xcode-select --install` failing) created by spadam77@…
Trying to get macports so that I can run imagemagik. My stack …
7:18 PM Changeset [114303] by michaelld@…
various dports: allow use of either py*-pyqt4 or py*-pyqt4-devel.
7:18 PM Changeset in macports-ports [01c547dbee7f3cabe8fcc9b5841ee876e30f0a49]boost_1.72.0_updatevirt-hackery by michaelld (Michael Dickens)
various dports: allow use of either py*-pyqt4 or py*-pyqt4-devel. …
7:02 PM Changeset [114302] by mk@…
kmymoney4-devel: update to latest git version
7:02 PM Changeset in macports-ports [da050d6d43a3a9e8567275666acade4dfd6d1f4a]boost_1.72.0_updatevirt-hackery by mkae (Marko Käning)
kmymoney4-devel: update to latest git version git-svn-id: …
5:17 PM Ticket #41689 (llvm-3.0 @3.0_12: not supported on Mavericks or later) created by katakagi@…
I upgraded Mavericks to Moutain Lion,and I operated below. […] …
5:08 PM Ticket #41688 (hugin-app fails to compile) created by david@…
Hugin-app fails to build on a clean mavericks install […] snip …
4:44 PM Ticket #41687 (gcc48 @4.8.2 fortran does not work) created by ralph@…
I have had a lot of problems trying to build arpack, atlas etc with …
4:33 PM Ticket #41686 (lftp: update to version 4.4.13) created by jpo@…
The attached patch updates lftp to the latest upstream version …
4:20 PM Ticket #41685 (p5-netpacket: update to version 1.4.4) created by jpo@…
The attached patch updates p5-netpacket to the latest upstream version …
4:19 PM Ticket #41684 (p5-set-scalar: update to version 1.26) created by jpo@…
The attached patch updates p5-set-scalar to the latest upstream …
4:17 PM Ticket #41683 (p5-http-server-simple-psgi: update to version 0.16) created by jpo@…
The attached patch updates p5-http-server-simple-psgi to the latest …
4:08 PM Ticket #41682 (py27-pymc @2.3_2 +gcc48 Checksum error) created by jeisch@…
[…] From the port file: […] The log file suggests that the …
3:48 PM Changeset [114301] by michaelld@…
gr-fosphor: better patch for FindFreetype2; augment some other Find …
3:48 PM Changeset in macports-ports [4694eaa16394a67fb199620b1dbcdca09f7be0a1]boost_1.72.0_updatevirt-hackery by michaelld (Michael Dickens)
gr-fosphor: better patch for FindFreetype2; augment some other Find …
3:45 PM Changeset [114300] by michaelld@…
gr-osmosdr: update to 81b23e21 (20131203).
3:45 PM Changeset in macports-ports [8d396068d187ff2a94622f7f0212e9a109effbea]boost_1.72.0_updatevirt-hackery by michaelld (Michael Dickens)
gr-osmosdr: update to 81b23e21 (20131203). git-svn-id: …
3:43 PM Changeset [114299] by michaelld@…
glfw: update to 0c0bb28d (20131204).
3:43 PM Changeset in macports-ports [19dccf682179807a844fc86399e6b5bde0f0190d]boost_1.72.0_updatevirt-hackery by michaelld (Michael Dickens)
glfw: update to 0c0bb28d (20131204). git-svn-id: …
2:46 PM Ticket #41680 (Non-existent variants do not cause a failure messge) closed by ryandesign (Ryan Schmidt)
duplicate: Duplicate of #14648.
2:40 PM Ticket #41681 (gramps: use app portgroup to add launcher) created by ctreleaven (Craig Treleaven)
Patch to add a Mac application bundle that launches gramps. Can be …
2:12 PM ram edited by skymoo (Adam Mercer)
(diff)
2:12 PM Changeset [114298] by ram@…
www/googlecl: drop maintainership
2:12 PM Changeset in macports-ports [8aa100f9c30d703cd9281c00d44bb605796e59c7]boost_1.72.0_updatevirt-hackery by skymoo (Adam Mercer)
www/googlecl: drop maintainership git-svn-id: …
2:12 PM Changeset [114297] by ram@…
devel/gc-utils: drop maintainership
2:12 PM Changeset in macports-ports [0ea829adc749a37eb1ed8e46d9ba2a1dea73d537]boost_1.72.0_updatevirt-hackery by skymoo (Adam Mercer)
devel/gc-utils: drop maintainership git-svn-id: …
2:09 PM Changeset [114296] by ram@…
python/py-dap: drop maintainership
2:09 PM Changeset in macports-ports [bedcda0f1343b1bcd0cdc58edcd4722d6cf0173a]boost_1.72.0_updatevirt-hackery by skymoo (Adam Mercer)
python/py-dap: drop maintainership git-svn-id: …
2:08 PM Ticket #41405 (py-matplotlib: ImportError: cannot import name scimath) closed by skymoo (Adam Mercer)
worksforme: Seems to have gone away with py27-matplotlib @1.3.1_2
2:07 PM ram edited by skymoo (Adam Mercer)
(diff)
2:05 PM Changeset [114295] by ram@…
python/py-pyfftw3: drop maintainership
2:05 PM Changeset in macports-ports [42728c4e62118e963dd7b6d4ab11df3b0abb6b9c]boost_1.72.0_updatevirt-hackery by skymoo (Adam Mercer)
python/py-pyfftw3: drop maintainership git-svn-id: …
2:04 PM Changeset [114294] by ram@…
math/fftw-3: drop maintainership
2:04 PM Changeset in macports-ports [de542158c25730ac3c5916bcba32eaf147c891df]boost_1.72.0_updatevirt-hackery by skymoo (Adam Mercer)
math/fftw-3: drop maintainership git-svn-id: …
1:32 PM Ticket #41680 (Non-existent variants do not cause a failure messge) created by ralph@…
I tried […] not realising that variant +perl5.18 does not exist. …
12:38 PM Ticket #35345 (libgsasl: error: conflicting types for 'gl_int_fast8_t') closed by ryandesign (Ryan Schmidt)
fixed: The port was updated to 1.8.0 awhile ago; see #37461.
12:30 PM Ticket #41409 (xgsch2pcb: Dependency 'py25-numpy' not found.) closed by ryandesign (Ryan Schmidt)
fixed: Resurrected and updated to use python 2.7 in r114293.
12:30 PM Changeset [114293] by ryandesign@…
xgsch2pcb: resurrect and update to python 2.7 (#41409)
12:30 PM Changeset in macports-ports [ed4112dd298dd517c42e83f25e9917f320a1666b]boost_1.72.0_updatevirt-hackery by ryandesign (Ryan Schmidt)
xgsch2pcb: resurrect and update to python 2.7 …
12:23 PM Changeset [114292] by easieste@…
lang/sbcl: upgrade to sbcl-1.1.14.
12:23 PM Changeset in macports-ports [ce4413469312db12ea1b485a3d4030d691459f6b]boost_1.72.0_updatevirt-hackery by Mark Evenson <easieste@…>
lang/sbcl: upgrade to sbcl-1.1.14. git-svn-id: …
11:47 AM Ticket #41620 (p5-dancer-plugin-database: update to version 2.08) closed by ryandesign (Ryan Schmidt)
fixed: r114291
11:47 AM Changeset [114291] by ryandesign@…
p5-dancer-plugin-database: maintainer update to 2.08 (#41620)
11:47 AM Changeset in macports-ports [6cf48e4f71ade4b23c5581f219b621e12080c139]boost_1.72.0_updatevirt-hackery by ryandesign (Ryan Schmidt)
p5-dancer-plugin-database: maintainer update to 2.08 …
11:46 AM Ticket #41679 ("move" should support case-only renames on case-insensitive filesystems) closed by ryandesign (Ryan Schmidt)
fixed: r114289
11:46 AM Changeset [114290] by ryandesign@…
ChangeLog: fix revision
11:46 AM Changeset in macports-base [cd9cf6efb20e254be21df49360498d4bdca7bd4b]fix-cxx-2017-compiler-selgsoc14-cleanupgsoc14-interactivegsoc15-dependencygsoc15-portfilegsoc17-migratelibsolvportgroups-selectorrelease-2.3release-2.4release-2.5release-2.6travis-civcs-fetch by ryandesign (Ryan Schmidt)
ChangeLog: fix revision git-svn-id: …
11:45 AM Changeset [114289] by ryandesign@…
portutil.tcl: support case-only renames on case-insensitive …
11:45 AM Changeset in macports-base [fc0d8ae082f1b0cddd0b342227608e4d3bbb8d74]fix-cxx-2017-compiler-selgsoc14-cleanupgsoc14-interactivegsoc15-dependencygsoc15-portfilegsoc17-migratelibsolvportgroups-selectorrelease-2.3release-2.4release-2.5release-2.6travis-civcs-fetch by ryandesign (Ryan Schmidt)
portutil.tcl: support case-only renames on case-insensitive …
11:25 AM Changeset [114288] by raimue@…
emulators/qemu: Update to version 1.7.0, remove patch applied upstream
11:25 AM Changeset in macports-ports [ef6d9aca8d980c76a5885961039d5c1f4fecbb5f]boost_1.72.0_updatevirt-hackery by raimue (Rainer Müller)
emulators/qemu: Update to version 1.7.0, remove patch applied upstream …
9:24 AM Ticket #41679 ("move" should support case-only renames on case-insensitive filesystems) created by ryandesign (Ryan Schmidt)
Currently, trying a case-only rename on a case-insensitive filesystem …
9:13 AM Ticket #41525 (Cannot Install) closed by ryandesign (Ryan Schmidt)
invalid
9:08 AM Ticket #41621 (p5-module-corelist: update to version 3.01) closed by ryandesign (Ryan Schmidt)
fixed: r114287
9:08 AM Changeset [114287] by ryandesign@…
p5-module-corelist: update to 3.01 (#41621)
9:08 AM Changeset in macports-ports [91430d610eeb06e84d0d10d9b97ffb2a02583e0e]boost_1.72.0_updatevirt-hackery by ryandesign (Ryan Schmidt)
p5-module-corelist: update to 3.01 …
9:06 AM Ticket #41619 (p5-dancer: update to version 1.3119) closed by ryandesign (Ryan Schmidt)
fixed: r114286
9:06 AM Changeset [114286] by ryandesign@…
p5-dancer: maintainer update to 1.3119 (#41619)
9:06 AM Changeset in macports-ports [c5193d1b4bb3da250f3f7bb521378590789b9dc2]boost_1.72.0_updatevirt-hackery by ryandesign (Ryan Schmidt)
p5-dancer: maintainer update to 1.3119 …
9:03 AM Ticket #41618 (p5-pmtools: update to version 1.54) closed by ryandesign (Ryan Schmidt)
fixed: r114285
9:03 AM Changeset [114285] by ryandesign@…
p5-pmtools: maintainer update to 1.54 (#41618)
9:03 AM Changeset in macports-ports [84b60a0a9565953cc2648557a3b3bfa6009cb433]boost_1.72.0_updatevirt-hackery by ryandesign (Ryan Schmidt)
p5-pmtools: maintainer update to 1.54 …
9:02 AM Ticket #41608 (p5-log-dispatch: update to version 2.41) closed by ryandesign (Ryan Schmidt)
fixed: r114284
9:02 AM Changeset [114284] by ryandesign@…
p5-log-dispatch: maintainer update to 2.41 (#41608)
9:02 AM Changeset in macports-ports [0736daa22a5df51762e7c1ea9e9a3dbaf25a4402]boost_1.72.0_updatevirt-hackery by ryandesign (Ryan Schmidt)
p5-log-dispatch: maintainer update to 2.41 …
8:59 AM Ticket #41607 (p5-log-log4perl: update to version 1.42) closed by ryandesign (Ryan Schmidt)
fixed: r114283
8:59 AM Changeset [114283] by ryandesign@…
p5-log-log4perl: maintainer update to 1.42 (#41607)
8:59 AM Changeset in macports-ports [61e03233f29df890b330a3686a7d80c15e32b879]boost_1.72.0_updatevirt-hackery by ryandesign (Ryan Schmidt)
p5-log-log4perl: maintainer update to 1.42 …
8:58 AM Ticket #41606 (p5-netpacket: update to version 1.4.3) closed by ryandesign (Ryan Schmidt)
fixed: r114282
8:57 AM Changeset [114282] by ryandesign@…
p5-netpacket: maintainer update to 1.4.3 (#41606)
8:57 AM Changeset in macports-ports [928c6159adc179b1032cbc7857f7cd9e4642c84f]boost_1.72.0_updatevirt-hackery by ryandesign (Ryan Schmidt)
p5-netpacket: maintainer update to 1.4.3 …
8:56 AM Changeset [114281] by ryandesign@…
p5-module-build: update to 0.4203; update dependencies
8:56 AM Changeset in macports-ports [d7b5d59560004f27e649e1a8fc91b4ca837636e9]boost_1.72.0_updatevirt-hackery by ryandesign (Ryan Schmidt)
p5-module-build: update to 0.4203; update dependencies git-svn-id: …
7:57 AM Changeset [114280] by larryv@…
py*-cartopy: Clarify comment about dependencies for testing. See …
7:57 AM Changeset in macports-ports [f0c7948bd55d72f7194364f1b2e9145ac84ada8b]boost_1.72.0_updatevirt-hackery by larryv (Lawrence Velázquez)
py*-cartopy: Clarify comment about dependencies for testing. See …
7:33 AM Changeset [114279] by stromnov@…
py-parakeet: new port
7:33 AM Changeset in macports-ports [1cceceaa3c0aa16ec9ef21149f08eed76796c19f]boost_1.72.0_updatevirt-hackery by stromnov (Andrew Stromnov)
py-parakeet: new port git-svn-id: …
7:27 AM Changeset [114278] by stromnov@…
py-dsltools: disable py33- subport
7:27 AM Changeset in macports-ports [af0e59c45ed83646b887224a4980f3cf871af860]boost_1.72.0_updatevirt-hackery by stromnov (Andrew Stromnov)
py-dsltools: disable py33- subport git-svn-id: …
7:18 AM Changeset [114277] by stromnov@…
py-dsltools: new port
7:18 AM Changeset in macports-ports [f996878b6a806df376c72af66511de7fe9c5f673]boost_1.72.0_updatevirt-hackery by stromnov (Andrew Stromnov)
py-dsltools: new port git-svn-id: …
7:18 AM Changeset [114276] by ryandesign@…
p5-version: update to 0.9904
7:18 AM Changeset in macports-ports [59168c0ea2f32fac4f036213e4d4d194df26fdc2]boost_1.72.0_updatevirt-hackery by ryandesign (Ryan Schmidt)
p5-version: update to 0.9904 git-svn-id: …
7:16 AM Changeset [114275] by ryandesign@…
p5-cpan-meta: update to 2.132830
7:16 AM Changeset in macports-ports [9155f0501fa09e760789b4d277052abb30ff4537]boost_1.72.0_updatevirt-hackery by ryandesign (Ryan Schmidt)
p5-cpan-meta: update to 2.132830 git-svn-id: …
7:14 AM Changeset [114274] by aronnax@…
py-astroML: new port, machine learning algorithms for astronomy
7:14 AM Changeset in macports-ports [b173ed211033147c3739b05afa7467671508548d]boost_1.72.0_updatevirt-hackery by Leo Singer <aronnax@…>
py-astroML: new port, machine learning algorithms for astronomy …
7:13 AM Changeset [114273] by stromnov@…
py-theano: fix setuptools dependency
7:13 AM Changeset in macports-ports [6e7fe52884e415bc3fc03db135286fc8bdecc79c]boost_1.72.0_updatevirt-hackery by stromnov (Andrew Stromnov)
py-theano: fix setuptools dependency git-svn-id: …
7:09 AM Changeset [114272] by ryandesign@…
p5-podlators: update to 2.5.3
7:09 AM Changeset in macports-ports [02fce920febcddedf2fa065756bb9c733e85f560]boost_1.72.0_updatevirt-hackery by ryandesign (Ryan Schmidt)
p5-podlators: update to 2.5.3 git-svn-id: …
6:57 AM Changeset [114271] by stromnov@…
py-theano: new port
6:57 AM Changeset in macports-ports [3583834c0a182f4051ee9703d1dff40fe40c8a01]boost_1.72.0_updatevirt-hackery by stromnov (Andrew Stromnov)
py-theano: new port git-svn-id: …
6:31 AM Changeset [114270] by stromnov@…
py-nuitka: update to version 0.4.7
6:31 AM Changeset in macports-ports [c4f1377249c0cf61c3ba1ec272acbc0d8083fd31]boost_1.72.0_updatevirt-hackery by stromnov (Andrew Stromnov)
py-nuitka: update to version 0.4.7 git-svn-id: …
6:28 AM Changeset [114269] by stromnov@…
py-billiard: update to version 3.3.0.11
6:28 AM Changeset in macports-ports [66fbb747dd87f1aeffc9355b3d8f16e67df9e07e]boost_1.72.0_updatevirt-hackery by stromnov (Andrew Stromnov)
py-billiard: update to version 3.3.0.11 git-svn-id: …
6:26 AM Changeset [114268] by stromnov@…
py-regex: update to version 2013-11-29
6:26 AM Changeset in macports-ports [a0918c685f3a8422c4ba5a4f9985ded41461168d]boost_1.72.0_updatevirt-hackery by stromnov (Andrew Stromnov)
py-regex: update to version 2013-11-29 git-svn-id: …
6:23 AM Ticket #41676 (Error: Failed to configure python27) closed by jyrkiwahlstedt
invalid: Thanks for finding the cause!
6:20 AM Ticket #41642 (Error in Quickstart page for MacPorts) closed by ryandesign (Ryan Schmidt)
fixed: r114267
6:20 AM Changeset [114267] by ryandesign@…
install.php: fix typo in license agreement command (#41642)
6:20 AM Changeset in macports-www [18ec311de6624f840541fe8737df0609dc134bd4] by ryandesign (Ryan Schmidt)
install.php: fix typo in license agreement command …
6:18 AM Ticket #41662 (fftw-3 build failure on Lion) closed by ryandesign (Ryan Schmidt)
invalid
6:18 AM Ticket #41662 (fftw-3 build failure on Lion) reopened by ryandesign (Ryan Schmidt)
6:05 AM Ticket #41599 (Inkscape crashes on startup) closed by ryandesign (Ryan Schmidt)
duplicate: Yes, I think so. Should be fixed in freetype @2.5.1_1.
6:05 AM Ticket #41651 (emacs +x11: Segmentation Fault) closed by ryandesign (Ryan Schmidt)
duplicate: Should be fixed in freetype @2.5.1_1.
6:05 AM Ticket #41645 (freetype: crash in TT_Load_Simple_Glyph) closed by ryandesign (Ryan Schmidt)
fixed: I was able to reproduce the issue using fc-list. Upstream fixed this …
6:04 AM Changeset [114266] by ryandesign@…
freetype: fix crash in TT_Load_Simple_Glyph (#41645)
6:04 AM Changeset in macports-ports [dfdb91c7539ee275e77cff066dd6ba3250902259]boost_1.72.0_updatevirt-hackery by ryandesign (Ryan Schmidt)
freetype: fix crash in TT_Load_Simple_Glyph …
5:32 AM Ticket #41678 (v8 @3.23.15: undefined symbols v8::Isolate::ThrowException etc.) created by ryandesign (Ryan Schmidt)
v8 is failing to build on leopard i386 with this error: […]
5:30 AM Ticket #41677 (v8 @3.23.15: fetches additional files from svn) created by ryandesign (Ryan Schmidt)
Although the v8 port has a distfile, it downloads lots of additional …
5:21 AM Changeset [114265] by ryandesign@…
wine, wine-crossover, wine-devel: blacklist FSF GCC which cannot …
5:21 AM Changeset in macports-ports [c099290063b5cb3cea29e92ca274c35cf4c0a063]boost_1.72.0_updatevirt-hackery by ryandesign (Ryan Schmidt)
wine, wine-crossover, wine-devel: blacklist FSF GCC which cannot …
5:05 AM Ticket #34647 (py*-smisk: unify) closed by mf2k (Frank Schima)
fixed: Was done in r101145.
4:13 AM Ticket #41674 (GNU Radio Build Fail in Mavericks (Graphviz error)) closed by ryandesign (Ryan Schmidt)
duplicate: The crash is in TT_Load_Simple_Glyph so I call this a duplicate of …
4:00 AM Ticket #41676 (Error: Failed to configure python27) created by mposard@…
I am trying to install wine using macports and keep getting this error …
3:01 AM Ticket #41675 (lsdvd 0.16_2 won't compile) closed by ryandesign (Ryan Schmidt)
invalid: That output shows that lsdvd was already installed before you ran the …
2:07 AM Ticket #41675 (lsdvd 0.16_2 won't compile) created by oswaldt@…
I am unable to install lsdvd on OSX Mavericks, when I run sudo port …
1:58 AM Changeset [114264] by devans@…
gnome3-apps, gnome3-core: update to version 3.10.2.
1:58 AM Changeset in macports-ports [db102de4c9972fb3f3c63ad7a461fa596d2bdbad]boost_1.72.0_updatevirt-hackery by dbevans (David B. Evans)
gnome3-apps, gnome3-core: update to version 3.10.2. git-svn-id: …
1:49 AM Ticket #41674 (GNU Radio Build Fail in Mavericks (Graphviz error)) created by chuiyewleong@…
[…]
1:49 AM Changeset [114263] by ryandesign@…
youtube-dl: update to 2013.12.03
1:49 AM Changeset in macports-ports [88417dd1ac6fd7bf1e21ca4baa79addb4da2d888]boost_1.72.0_updatevirt-hackery by ryandesign (Ryan Schmidt)
youtube-dl: update to 2013.12.03 git-svn-id: …
12:01 AM Ticket #41671 (gtk based programs crash with segmentation fault when started) closed by ryandesign (Ryan Schmidt)
duplicate: Looks like the same crash as #41645.

Dec 3, 2013:

11:48 PM Changeset [114262] by ram@…
math/fftw-3-long: ensure --enable-avx is not passed
11:48 PM Changeset in macports-ports [f5014ff44062e718a600d17b2c2f566b85de1060]boost_1.72.0_updatevirt-hackery by skymoo (Adam Mercer)
math/fftw-3-long: ensure --enable-avx is not passed git-svn-id: …
11:26 PM Ticket #41673 (fftw-3 @3.3.3_4 Building fftw-3 failed) closed by skymoo (Adam Mercer)
fixed: r114261
11:25 PM Ticket #41622 (fftw-3: enable avx instructions) closed by skymoo (Adam Mercer)
fixed: r114261
11:25 PM Changeset [114261] by ram@…
math/fftw-3: blacklist clang <= 211.10.1 (#41622, #41673)
11:25 PM Changeset in macports-ports [d60720506c6a1702e7c973c8be5520e125a720c2]boost_1.72.0_updatevirt-hackery by skymoo (Adam Mercer)
math/fftw-3: blacklist clang <= 211.10.1 …
10:47 PM Changeset [114260] by devans@…
glade: update to version 3.14.3.
10:47 PM Changeset in macports-ports [62d575f07c892f6cad03da6312032b7dbc5c3580]boost_1.72.0_updatevirt-hackery by dbevans (David B. Evans)
glade: update to version 3.14.3. git-svn-id: …
10:47 PM Ticket #41673 (fftw-3 @3.3.3_4 Building fftw-3 failed) created by by.cmsc@…
[…]
10:29 PM Ticket #41624 (inkscape-devel build error) closed by mf2k (Frank Schima)
fixed: This was fixed by r114165.
10:19 PM Ticket #41672 (gdb 7 can't read mach-o-le files. gdb apple can.) created by macports-prf@…
Hi, gdb 7 seems to worl better with eclipse cdt, so I got it. …
10:10 PM Changeset [114259] by mk@…
kmymoney4-devel: update to latest git version
10:10 PM Changeset in macports-ports [73bc6d81f458efd0779956b2d0c581d0e5888c56]boost_1.72.0_updatevirt-hackery by mkae (Marko Käning)
kmymoney4-devel: update to latest git version git-svn-id: …
10:00 PM Ticket #41669 (libcomerr checksum failure) closed by ryandesign (Ryan Schmidt)
worksforme: The checksum matches for me. Please clean and try again; perhaps you …
9:53 PM Changeset [114258] by devans@…
inkscape-devel: update to bzr 12836, bug fixes.
9:53 PM Changeset in macports-ports [c7cd139962cf64e95b6bc64ab219982679c65150]boost_1.72.0_updatevirt-hackery by dbevans (David B. Evans)
inkscape-devel: update to bzr 12836, bug fixes. git-svn-id: …
9:50 PM Ticket #41671 (gtk based programs crash with segmentation fault when started) created by atlantide84@…
I tried to start winetricks and i got a segmentation fault. After many …
9:30 PM Changeset [114257] by ryandesign@…
rethinkdb: simplify compiler.blacklist; use correct variable in …
9:30 PM Changeset in macports-ports [79a3313d276e79aceddfcfabab07f8e9ddcbdcba]boost_1.72.0_updatevirt-hackery by ryandesign (Ryan Schmidt)
rethinkdb: simplify compiler.blacklist; use correct variable in …
8:08 PM Ticket #41670 (swi-prolog @6.6.0 build error: command execution failed) created by svankasteel+macports@…
== OS/XCode version == Mac OS X 10.6.8 (32 bit) XCode 4.2, Build …
7:39 PM Ticket #41662 (fftw-3 build failure on Lion) closed by skymoo (Adam Mercer)
fixed: Replying to marji.booker@…: > That is how they were …
7:22 PM Changeset [114256] by devans@…
gtkmm3: add build deps required for autoreconf.
7:22 PM Changeset in macports-ports [b2d48d96e96ea5b3056c7e5349b5aad3be7ce014]boost_1.72.0_updatevirt-hackery by dbevans (David B. Evans)
gtkmm3: add build deps required for autoreconf. git-svn-id: …
6:21 PM Ticket #41669 (libcomerr checksum failure) created by bernhard.koppensteiner@…
5:43 PM Ticket #41668 (port -v selfupdate not work.) closed by mf2k (Frank Schima)
invalid: Trac is not for tech support. Please use the …
5:39 PM Ticket #41646 (Python 3.3.3 upgrade staging error) closed by mf2k (Frank Schima)
worksforme
5:04 PM Ticket #41668 (port -v selfupdate not work.) reopened by jam.with.ju2@…
4:30 PM Ticket #41668 (port -v selfupdate not work.) closed by neverpanic (Clemens Lang)
worksforme: Please install Xcode from the App Store and the Command Line Tools …
4:12 PM Ticket #41668 (port -v selfupdate not work.) created by jam.with.ju2@…
[…] I attach "config.log". Please see log file.
4:04 PM Ticket #41667 (py26-parsing does not build on Mavericks) closed by ci42
invalid: That is the problem: […] (...) […] Please have a look at …
3:51 PM Ticket #41667 (py26-parsing does not build on Mavericks) created by michaelbartz@…
[…]
3:42 PM Changeset [114255] by devans@…
GNOME-3/stable/dports: webkit-gtk, sync with trunk.
3:37 PM Changeset [114254] by cal@…
policykit: add missing dependency actually required since r107655 5 …
3:37 PM Changeset in macports-ports [4ae73b2b7e943ece98e5a7bc2c0b35d63b449c23]boost_1.72.0_updatevirt-hackery by neverpanic (Clemens Lang)
policykit: add missing dependency actually required since …
3:36 PM Ticket #41666 (Unable to upgrade port) created by tgd412w@…
Hi, I have no problems when I run: […] But if I then run: […] …
3:29 PM Changeset [114253] by devans@…
webkit-gtk: don't error out during portindex.
3:29 PM Changeset in macports-ports [dd9105458cd6e09379a5ce602cbc75ac1abc2586]boost_1.72.0_updatevirt-hackery by dbevans (David B. Evans)
webkit-gtk: don't error out during portindex. git-svn-id: …
3:20 PM Ticket #41665 (libcomerr: install_name_tool: malformed object (unknown load command 4)) created by bernhard.koppensteiner@…
When i tried to install nmap the installation failed because of …
3:14 PM Changeset [114252] by scantor@…
Bump to latest version
3:14 PM Changeset in macports-ports [e2c320c3cbed76d633c801f83b04cd5189c97435]boost_1.72.0_updatevirt-hackery by Scott Cantor <scantor@…>
Bump to latest version git-svn-id: …
3:04 PM Changeset [114251] by cal@…
policykit: add missing dependency on autoconf/automake
3:04 PM Changeset in macports-ports [fe032da9fef04b711337bff8870f5ca68a47abf4]boost_1.72.0_updatevirt-hackery by neverpanic (Clemens Lang)
policykit: add missing dependency on autoconf/automake git-svn-id: …
2:29 PM Changeset [114250] by jwa@…
py-robotframework: version bump to 2.8.3
2:29 PM Changeset in macports-ports [739d78f02de17831c559c309080aa760a47c9b6b]boost_1.72.0_updatevirt-hackery by jyrkiwahlstedt
py-robotframework: version bump to 2.8.3 git-svn-id: …
2:26 PM Changeset [114249] by michaelld@…
gnuradio: update devel to 6195ff3c and next to 0256794b, both 20131202.
2:26 PM Changeset in macports-ports [8b267cbaa37f52ae00ab3c1b7af142b7ca592e49]boost_1.72.0_updatevirt-hackery by michaelld (Michael Dickens)
gnuradio: update devel to 6195ff3c and next to 0256794b, both …
2:23 PM Changeset [114248] by cal@…
rethinkdb: add fallback compiler on systems < darwin13
2:23 PM Changeset in macports-ports [1b517bbad47f18b725fdd48078ad6444c3895df2]boost_1.72.0_updatevirt-hackery by neverpanic (Clemens Lang)
rethinkdb: add fallback compiler on systems < darwin13 git-svn-id: …
2:19 PM Changeset [114247] by cal@…
rethinkdb: another attempt at fixing compilation on systems < darwin13 …
2:19 PM Changeset in macports-ports [b0647aa9c94a6e4a5964419f435158dfa6e5bf26]boost_1.72.0_updatevirt-hackery by neverpanic (Clemens Lang)
rethinkdb: another attempt at fixing compilation on systems < darwin13 …
1:50 PM Ticket #41664 (Upgrade virtuoso 7.0.0_0 to 7.0.0_1 fails) created by watsodw
See log.
1:47 PM Ticket #41663 (webkit-gtk fails to build: no member named RedirectedXCompositeWindow) created by gthb (Gunnlaugur Thor Briem)
Salient bit from main.log: […]
1:37 PM Changeset [114246] by cal@…
rethinkdb: Use compiler's default stdlib (or the one specified by …
1:37 PM Changeset in macports-ports [5f1a9ebe29087a702be0559e3814870b6dfbf9b9]boost_1.72.0_updatevirt-hackery by neverpanic (Clemens Lang)
rethinkdb: Use compiler's default stdlib (or the one specified by …
1:18 PM Ticket #38462 (v8: integer overflow in expression) closed by neverpanic (Clemens Lang)
fixed: I think this should finally be fixed in r114189. Please re-open if the …
12:38 PM Changeset [114245] by krischik@…
New version.
12:38 PM Changeset in macports-ports [afaffad091492552e2778d8370063dd4db982b66]boost_1.72.0_updatevirt-hackery by Martin Krischik <krischik@…>
New version. git-svn-id: …
12:12 PM Ticket #41662 (fftw-3 build failure on Lion) created by marji.booker@…
Apologize if it is in the known issues but I have been unable to find …
11:48 AM Changeset [114244] by g5pw@…
python/py-taskw: new port: python interface to taskwarrior
11:48 AM Changeset in macports-ports [a799fa0f8a793a80923dbcbbc5176062adc7856d]boost_1.72.0_updatevirt-hackery by g5pw (Aljaž Srebrnič)
python/py-taskw: new port: python interface to taskwarrior …
11:28 AM Changeset [114243] by cal@…
rethinkdb: use patch.pre_args rather than patch.args to specify -p$x …
11:28 AM Changeset in macports-ports [cceeae11ff64eb63bb3fa36d2a52241dfdb5de5e]boost_1.72.0_updatevirt-hackery by neverpanic (Clemens Lang)
rethinkdb: use patch.pre_args rather than patch.args to specify -p$x …
11:23 AM Changeset [114242] by cal@…
rethinkdb: update to 1.11.1, apply patch to fix build against current v8
11:23 AM Changeset in macports-ports [1152246505b7493caff4938aa0815a68d317d83a]boost_1.72.0_updatevirt-hackery by neverpanic (Clemens Lang)
rethinkdb: update to 1.11.1, apply patch to fix build against current …
11:18 AM Ticket #41655 (fontconfig, freetype: segmentation fault loading font) closed by ryandesign (Ryan Schmidt)
duplicate: Duplicate of #41645.
11:12 AM Ticket #25695 (Freetype 2.4.0 renders much worse than 2.3.12) closed by ryandesign (Ryan Schmidt)
wontfix: If this is still an issue with freetype 2.5.1, please take it up with …
10:45 AM Ticket #41643 (gtk3 fails to configure on mavericks) closed by neverpanic (Clemens Lang)
worksforme: I'm not sure where those problems come from, but they do seem to cause …
10:13 AM Changeset [114241] by cal@…
v8: update livecheck to track the latest release considered stable and …
10:13 AM Changeset in macports-ports [884d4e16055b4df3f5b9066345cd9a8ac79cbc9a]boost_1.72.0_updatevirt-hackery by neverpanic (Clemens Lang)
v8: update livecheck to track the latest release considered stable and …
10:12 AM Changeset [114240] by krischik@…
Add distfile for android
10:11 AM Changeset [114239] by krischik@…
Monitor EXE
10:10 AM Changeset [114238] by krischik@…
Monitor EXE
9:36 AM Changeset [114237] by jeremyhu@…
misc: Automatically prefer webkit-gtk-2.0 over webkit-gtk if using …
9:36 AM Changeset in macports-ports [77e5bfc124978d0ad433ca216eb93aa564ff3ab7]boost_1.72.0_updatevirt-hackery by jeremyhu (Jeremy Huddleston Sequoia)
misc: Automatically prefer webkit-gtk-2.0 over webkit-gtk if using …
9:33 AM Ticket #41605 (wine, wine-crossover, wine-devel: build fails with freetype 2.5.1) closed by ryandesign (Ryan Schmidt)
fixed: Fixed wine-crossover in r114236. This patch is not suitable for …
9:31 AM Changeset [114236] by ryandesign@…
wine-crossover: fix build with freetype 2.5.1 (#41605), and update to …
9:31 AM Changeset in macports-ports [8969cc147b06a5ee362757bada76a17a996c7126]boost_1.72.0_updatevirt-hackery by ryandesign (Ryan Schmidt)
wine-crossover: fix build with freetype 2.5.1 …
9:25 AM Changeset [114235] by jeremyhu@…
multiple: Update webkit-gtk dependency to be satisfied by …
9:25 AM Changeset in macports-ports [69ae62980bf9ed84ea8a6d9ff05fd794fc63eeea]boost_1.72.0_updatevirt-hackery by jeremyhu (Jeremy Huddleston Sequoia)
multiple: Update webkit-gtk dependency to be satisfied by …
9:18 AM Changeset [114234] by jeremyhu@…
webkit-gtk-2.0: verbose autoreconf
9:18 AM Changeset in macports-ports [7c8b6d9f3d0e97e59a913ec19b1d3d815e57addb]boost_1.72.0_updatevirt-hackery by jeremyhu (Jeremy Huddleston Sequoia)
webkit-gtk-2.0: verbose autoreconf git-svn-id: …
9:17 AM Ticket #41560 (webkit-gtk3 2.4.0 with webkit2 support needed) reopened by jeremyhu (Jeremy Huddleston Sequoia)
Actually, reopening because of the webkit2 support request as well…
9:16 AM Ticket #41560 (webkit-gtk3 2.4.0 with webkit2 support needed) closed by jeremyhu (Jeremy Huddleston Sequoia)
fixed: r114232 r114233
9:16 AM Changeset [114233] by jeremyhu@…
webkit-gtk: Bump to 2.2.2
9:16 AM Changeset in macports-ports [cacf0f2e92fce79f77f417a26819e9b142db56a5]boost_1.72.0_updatevirt-hackery by jeremyhu (Jeremy Huddleston Sequoia)
webkit-gtk: Bump to 2.2.2 git-svn-id: …
9:13 AM Changeset [114232] by jeremyhu@…
webkit-gtk-2.0: Legacy version of webkit-gtk which supports older C++ …
9:13 AM Changeset in macports-ports [93562dc953f99d237f57416f491778592648b2ab]boost_1.72.0_updatevirt-hackery by jeremyhu (Jeremy Huddleston Sequoia)
webkit-gtk-2.0: Legacy version of webkit-gtk which supports older C++ …
8:35 AM Changeset [114231] by stromnov@…
py-omniORBpy: give up maintainership
8:35 AM Changeset in macports-ports [cf7e346f1726524136d075ce688119ea1c198ac0]boost_1.72.0_updatevirt-hackery by stromnov (Andrew Stromnov)
py-omniORBpy: give up maintainership git-svn-id: …
8:34 AM Changeset [114230] by stromnov@…
omniORB: give up maintainership
8:34 AM Changeset in macports-ports [a0f13d031e07049807b61749e7bf94ca16ea1606]boost_1.72.0_updatevirt-hackery by stromnov (Andrew Stromnov)
omniORB: give up maintainership git-svn-id: …
8:32 AM Changeset [114229] by stromnov@…
py-celery: update to version 3.1.6
8:32 AM Changeset in macports-ports [3521cd6225d01c542570262850fe0f1bde607358]boost_1.72.0_updatevirt-hackery by stromnov (Andrew Stromnov)
py-celery: update to version 3.1.6 git-svn-id: …
8:31 AM Changeset [114228] by stromnov@…
py-kombu: update to version 3.0.7
8:31 AM Changeset in macports-ports [29a42725969f4a45da019261fa5aeb17b1657898]boost_1.72.0_updatevirt-hackery by stromnov (Andrew Stromnov)
py-kombu: update to version 3.0.7 git-svn-id: …
8:31 AM Changeset [114227] by stromnov@…
py-billiard: update to version 3.3.0.10
8:31 AM Changeset in macports-ports [469d4a1a612b16223e0ee6021c2741450f4fd1f9]boost_1.72.0_updatevirt-hackery by stromnov (Andrew Stromnov)
py-billiard: update to version 3.3.0.10 git-svn-id: …
8:03 AM Changeset [114226] by ryandesign@…
php modules: remove archcheck portgroup
8:03 AM Changeset in macports-ports [d82f18e12d3867c27921667f9a9a1dfd32a42b0f]boost_1.72.0_updatevirt-hackery by ryandesign (Ryan Schmidt)
php modules: remove archcheck portgroup git-svn-id: …
8:01 AM Changeset [114225] by ryandesign@…
terminator: update homepage
8:01 AM Changeset in macports-ports [cdaa640fe1cacb42cc4d281a403f899109b8d2ef]boost_1.72.0_updatevirt-hackery by ryandesign (Ryan Schmidt)
terminator: update homepage git-svn-id: …
5:52 AM Ticket #41100 (geda-gaf not finding config files) closed by larryv (Lawrence Velázquez)
fixed: I’m considering this ticket fixed. Use #41660 to track 1.8.2 update.
4:50 AM Ticket #41657 (py27-llvmpy: checksum mismatch) closed by ryandesign (Ryan Schmidt)
fixed: I'm doing well today... should be fixed in r114224.
4:49 AM Changeset [114224] by ryandesign@…
py-llvmpy: fix stub port (#41657)
4:49 AM Changeset in macports-ports [eb290966d1738e4ae7fa759c33858793aa96ed6f]boost_1.72.0_updatevirt-hackery by ryandesign (Ryan Schmidt)
py-llvmpy: fix stub port (https://trac.macports.org/ticket/41657) …
4:42 AM Ticket #41657 (py27-llvmpy: checksum mismatch) reopened by carlossalvadorbilardo@…
Me again. Some problem persits and another file is missing in the port …
4:08 AM Ticket #39325 (py-libxslt @1.1.26: error: incomplete definition of type 'struct _xmlBuf') closed by ryandesign (Ryan Schmidt)
fixed: Fixed by updating py*-libxslt to 1.1.28; see #39748 for more details.
4:08 AM Ticket #39748 (py-libxslt: update to 1.1.28) closed by ryandesign (Ryan Schmidt)
fixed: In fact having mismatched libxslt and py-libxslt versions caused …
4:03 AM Changeset [114223] by ryandesign@…
libxslt: add py*-libxslt as subports, thereby updating them to 1.1.28 …
4:03 AM Changeset in macports-ports [cf7e08787821443ea2b2b732cb03bdb6ea22e026]boost_1.72.0_updatevirt-hackery by ryandesign (Ryan Schmidt)
libxslt: add py*-libxslt as subports, thereby updating them to 1.1.28 …
3:53 AM Ticket #41657 (py27-llvmpy: checksum mismatch) closed by ryandesign (Ryan Schmidt)
fixed: Sometimes the github portgroup is too clever for its own good. It has …
3:53 AM Changeset [114222] by ryandesign@…
py-llvmpy: fix build failure introduced by r114217 (#41657)
3:53 AM Changeset in macports-ports [7edd618a8bb5c5704e7aefe501f89f5b39732a30]boost_1.72.0_updatevirt-hackery by ryandesign (Ryan Schmidt)
py-llvmpy: fix build failure introduced by …
3:50 AM Ticket #41657 (py27-llvmpy: checksum mismatch) reopened by ryandesign (Ryan Schmidt)
No, wait, I see the problem, and it's my fault.
3:49 AM Changeset [114221] by jmr@…
SDLInvaders: update homepage
3:49 AM Changeset in macports-ports [8ff794ab63d3c801f1a5cac09994ca47fb88b4c1]boost_1.72.0_updatevirt-hackery by jmroot (Joshua Root)
SDLInvaders: update homepage git-svn-id: …
3:48 AM Ticket #41657 (py27-llvmpy: checksum mismatch) closed by ryandesign (Ryan Schmidt)
fixed: The tclIndex error is a red herring. Please do open a …
3:47 AM Ticket #41657 (py27-llvmpy: checksum mismatch) reopened by carlossalvadorbilardo@…
3:12 AM Ticket #41661 (py27-libxslt @1.1.26: error: incomplete definition of type 'struct _xmlBuf') closed by ryandesign (Ryan Schmidt)
duplicate: Duplicate of #39325.
2:38 AM Ticket #41661 (py27-libxslt @1.1.26: error: incomplete definition of type 'struct _xmlBuf') created by michaelbartz@…
py27-libxslt does not build on Mavericks (also py26 does not build either)
2:30 AM Changeset [114220] by devans@…
gsettings-desktop-schemas: restore deprecated settings required to run …
2:30 AM Changeset in macports-ports [cfbd74cd620669859ebcc8df8d091cff48444efc]boost_1.72.0_updatevirt-hackery by dbevans (David B. Evans)
gsettings-desktop-schemas: restore deprecated settings required to run …
1:27 AM Changeset [114219] by ryandesign@…
octave-symbolic: fix case of GiNaC dependency
1:27 AM Changeset in macports-ports [779b497cc1bc30c17e24db7f65bcd13896b11790]boost_1.72.0_updatevirt-hackery by ryandesign (Ryan Schmidt)
octave-symbolic: fix case of GiNaC dependency git-svn-id: …
1:15 AM Changeset [114218] by ryandesign@…
portfile-gen: use eq and ne for string comparisons instead of == and !=
1:15 AM Changeset in macports-contrib [d47460b5054b05021ac87bb2476068db40b63221] by ryandesign (Ryan Schmidt)
portfile-gen: use eq and ne for string comparisons instead of == and …
1:12 AM Ticket #41657 (py27-llvmpy: checksum mismatch) closed by ryandesign (Ryan Schmidt)
fixed: Fixed in r114217. Please wait 30 minutes, then run "sudo port clean …
1:12 AM Changeset [114217] by ryandesign@…
py-llvmpy: do not fetch from upstream for now, to avoid checksum …
1:12 AM Changeset in macports-ports [953d2a2ad272323762ad8cc0e630043503c67d72]boost_1.72.0_updatevirt-hackery by ryandesign (Ryan Schmidt)
py-llvmpy: do not fetch from upstream for now, to avoid checksum …
1:05 AM Ticket #41652 (dia @0.97.2: build fails with freetype 2.5.1) closed by ryandesign (Ryan Schmidt)
fixed: Committed a fix: r114216 Reported it upstream: …
1:05 AM Changeset [114216] by ryandesign@…
dia: fix build with freetype 2.5.1 (#41652)
1:05 AM Changeset in macports-ports [d1e400f30767e2690e38c821ccf82ce07c7270a0]boost_1.72.0_updatevirt-hackery by ryandesign (Ryan Schmidt)
dia: fix build with freetype 2.5.1 …
12:25 AM Ticket #41660 (geda-gaf @1.6.2_0 (epoch 1): Update port to stable-1.8.2) created by thomasrussellmurphy (Thomas Russell Murphy)
http://git.geda-project.org/geda-gaf/log/?h=stable-1.8 What is the …
12:24 AM Changeset [114215] by devans@…
gimp2: upstream bug fixes, help_browser now works with +quartz.
12:24 AM Changeset in macports-ports [e488d10d65926098912c555bf69164c5add1d12d]boost_1.72.0_updatevirt-hackery by dbevans (David B. Evans)
gimp2: upstream bug fixes, help_browser now works with +quartz. …
12:16 AM Changeset [114214] by michaelld@…
gnuradio: + update release to 3.7.2.1, which removes the need for a …
12:16 AM Changeset in macports-ports [d1fffd75f4c27dde57442f84766655f6e39007b0]boost_1.72.0_updatevirt-hackery by michaelld (Michael Dickens)
gnuradio: + update release to 3.7.2.1, which removes the need for a …

Dec 2, 2013:

11:31 PM SummerOfCodeArchive edited by neverpanic (Clemens Lang)
words… (diff)
11:30 PM SummerOfCodeArchive edited by neverpanic (Clemens Lang)
document GSoC 12 and 13 (diff)
10:50 PM Ticket #41659 (digikam crash-Very unstable) created by gtmdhl@…
Imac running OS 10.9 with Xcode 5.0.2, Xcode Command Line Tools …
10:06 PM Ticket #41658 (metis: Add gcc48 variant) created by sylvain.desroziers@…
This patch adds the variant gcc48 to the metis port
9:49 PM Changeset [114213] by devans@…
gimp-help-en: update to version 2.8.1, drop +python25 variant.
9:49 PM Changeset in macports-ports [8316bf51e9b982de4a4d2c9e5c5ac4ea24e8aaec]boost_1.72.0_updatevirt-hackery by dbevans (David B. Evans)
gimp-help-en: update to version 2.8.1, drop +python25 variant. …
9:25 PM Ticket #41657 (py27-llvmpy: checksum mismatch) created by carlossalvadorbilardo@…
I am running macports over Mavericks. I have installed several modules …
8:55 PM Changeset [114212] by stromnov@…
py-alembic: update to version 0.6.1
8:55 PM Changeset in macports-ports [c1ba725c8cff845b95f3d71fe0d3ea6013db681e]boost_1.72.0_updatevirt-hackery by stromnov (Andrew Stromnov)
py-alembic: update to version 0.6.1 git-svn-id: …
8:48 PM Ticket #41656 (Update Go Portfile to 1.2) created by b@…
Go 1.2 is officially released: http://blog.golang.org/go12 Go 1.2 …
7:34 PM Ticket #41655 (fontconfig, freetype: segmentation fault loading font) created by Martin.vGagern@…
fc-list Helvetica crashes on me with a single error line mentioning …
7:14 PM Ticket #41555 (gcc46: gfortran not working after upgrade) closed by jeremyhu (Jeremy Huddleston Sequoia)
worksforme
7:11 PM Ticket #41654 (cross/avrdude: update to 6.0.1 broken with AVR ISP MK2) created by abusse@…
After updating to 6.0.1, trying to program with an AVR ISP MK2 only …
7:04 PM Ticket #41653 (new port of gr1c) created by SCL@…
I created a new port for gr1c (http://scottman.net/2012/gr1c ; …
6:59 PM Changeset [114211] by devans@…
inkscape: patch through r9988, includes upstream freetype fix, no …
6:59 PM Changeset in macports-ports [98725e68a5789ed8d494a105c571e35b3073a943]boost_1.72.0_updatevirt-hackery by dbevans (David B. Evans)
inkscape: patch through r9988, includes upstream freetype fix, no …
6:59 PM Ticket #41652 (dia @0.97.2: build fails with freetype 2.5.1) created by leonfauster@…
dia-0.97.2_4 could not be build because: […] ---- Workaround: …
5:55 PM Ticket #30301 (Octave-Symbolic 1.0.9 error) closed by michaelld (Michael Dickens)
fixed: Added in r114210. Works on 10.8 and 10.9 for me.
5:55 PM Changeset [114210] by michaelld@…
octave-symbolic: new port; addresses ticket #30301.
5:55 PM Changeset in macports-ports [ed5e1dbc285f802f25e4d6f9340772793d5470bf]boost_1.72.0_updatevirt-hackery by michaelld (Michael Dickens)
octave-symbolic: new port; addresses ticket …
5:42 PM Ticket #41651 (emacs +x11: Segmentation Fault) created by aseth@…
I've just got a new rMBP running mavericks and Xcode 5.0.2 The first …
5:38 PM Ticket #40851 (GiNaC 1.6.2 does not build with clang on 10.9) closed by michaelld (Michael Dickens)
fixed: Those links provide the idea for the necessary patch. Clang++ is just …
5:37 PM Changeset [114209] by michaelld@…
GiNaC: maintainer timeout: add patches for clang++/libc++; do not seem …
5:37 PM Changeset in macports-ports [f24067f6cb6d9864ad080ea322401513d3975709]boost_1.72.0_updatevirt-hackery by michaelld (Michael Dickens)
GiNaC: maintainer timeout: add patches for clang++/libc++; do not seem …
5:02 PM Ticket #41650 (clang-3.4: Fails to build on SL) created by eborisch (Eric A. Borisch)
See buildbot log -- I get the same result. …
4:53 PM Changeset [114208] by ram@…
finance/cgminer: go back to using bundled libusb
4:53 PM Changeset in macports-ports [7d507130f30a31bb6730bb1e850290b5948a4b58]boost_1.72.0_updatevirt-hackery by skymoo (Adam Mercer)
finance/cgminer: go back to using bundled libusb git-svn-id: …
4:31 PM Ticket #40848 (current cln tarball fails to build; already fixed in git repository) closed by michaelld (Michael Dickens)
fixed: Maintainer timeout; fixed in r114207.
4:31 PM Changeset [114207] by michaelld@…
cln: maintainer timeout: update to 1.3.3 and patch to work with 10.9 / …
4:31 PM Changeset in macports-ports [8279abe5e30c7cf2a595efb846c2c6c9dd39413c]boost_1.72.0_updatevirt-hackery by michaelld (Michael Dickens)
cln: maintainer timeout: update to 1.3.3 and patch to work with 10.9 / …
3:31 PM Changeset [114206] by michaelld@…
rtl-sdr: update to a4265960 (20131121).
3:31 PM Changeset in macports-ports [9ef28f31b7ea70af80bc9d87258cdcd24a8b591e]boost_1.72.0_updatevirt-hackery by michaelld (Michael Dickens)
rtl-sdr: update to a4265960 (20131121). git-svn-id: …
3:29 PM Changeset [114205] by michaelld@…
octave 1.0 PortGroup: in post-extract when renaming the worksrcdir to …
3:29 PM Changeset in macports-ports [a31e0cc13f733ee5a1f8b9ff0f6ff3ae34e0f430]boost_1.72.0_updatevirt-hackery by michaelld (Michael Dickens)
octave 1.0 PortGroup: in post-extract when renaming the worksrcdir to …
1:56 PM Ticket #41649 (vte 0.34 dropped python support) created by jean-daniel.pauget@…
as far as I understand vte dropped python binding starting from …
1:18 PM Changeset [114204] by stromnov@…
py-gevent-websocket: update to version 0.9
1:18 PM Changeset in macports-ports [a21bf47487b4371690f1ab6a2e2788d5a9643cb2]boost_1.72.0_updatevirt-hackery by stromnov (Andrew Stromnov)
py-gevent-websocket: update to version 0.9 git-svn-id: …
1:09 PM Ticket #41615 (Error: org.macports.destroot for port py27-pyqt4 returned: command ...) closed by michaelld (Michael Dickens)
worksforme: Interesting; I'm glad it working now for you, no matter how strange …
11:51 AM Changeset [114203] by mojca@…
mojca/root: version 5.34.13 with more configurability wrt. …
10:54 AM Changeset [114202] by ryandesign@…
wine, wine-crossover, wine-devel: add comment about keeping wine_gecko …
10:54 AM Changeset in macports-ports [9868ad3925079c2dac41129cda4c97240be11099]boost_1.72.0_updatevirt-hackery by ryandesign (Ryan Schmidt)
wine, wine-crossover, wine-devel: add comment about keeping wine_gecko …
10:54 AM Changeset [114201] by ryandesign@…
wine-crossover-games: remove obsolete port
10:54 AM Changeset in macports-ports [561b2e805f17e7e4b9710cfca926f428c2b309d9]boost_1.72.0_updatevirt-hackery by ryandesign (Ryan Schmidt)
wine-crossover-games: remove obsolete port git-svn-id: …
10:06 AM Ticket #41648 (gcc48: Bootstrap comparison failure) created by udbraumann
I have tried to install gcc48 on my 10.5.8 PPC. While libgcc 4.8.2_0 …
9:08 AM Changeset [114200] by ryandesign@…
graphviz-devel: update to 2.35.20131202.0545
9:08 AM Changeset in macports-ports [bee509c94f7718a25b4397d617a8d57a36b410a1]boost_1.72.0_updatevirt-hackery by ryandesign (Ryan Schmidt)
graphviz-devel: update to 2.35.20131202.0545 git-svn-id: …
9:04 AM Changeset [114199] by ryandesign@…
libvirt: update to 1.2.0
9:04 AM Changeset in macports-ports [54a0be3fd2a0f5e4a7ef1aaafef47c1ee574f835]boost_1.72.0_updatevirt-hackery by ryandesign (Ryan Schmidt)
libvirt: update to 1.2.0 git-svn-id: …
8:55 AM Ticket #41647 (Unbound doesn't want to start after install) created by ludovic@…
The install script for unbound says : […] […] Attaching the …
8:42 AM Ticket #41646 (Python 3.3.3 upgrade staging error) created by samuelandjw
Hi, On OS X 10.9. I tried to upgrade python33 from 3.3.2 to 3.3.3. …
8:37 AM Ticket #41645 (freetype: crash in TT_Load_Simple_Glyph) created by nortcele
With a MacBook pro, OS X Mavericks, Xcode 5.02, MacPorts 2.2.1. All …
7:47 AM Ticket #41641 (llvm-3.4: build fails in Release+Debug+Asserts/AnalysisTests: ld: ...) closed by jeremyhu (Jeremy Huddleston Sequoia)
invalid: Xcode 4.1 is not supported.
7:24 AM Changeset [114198] by ryandesign@…
wine: fix build with freetype 2.5.1 (#41605)
7:24 AM Changeset in macports-ports [2cc4d5b475bc35eb99c45e7f3851c72cb2d1eefd]boost_1.72.0_updatevirt-hackery by ryandesign (Ryan Schmidt)
wine: fix build with freetype 2.5.1 …
6:05 AM Changeset [114197] by sean@…
mercurial: update to 2.8.1
6:05 AM Changeset in macports-ports [8ea4557e75881fc27857d3bdc9468e5a80c72716]boost_1.72.0_updatevirt-hackery by seanfarley (Sean Farley)
mercurial: update to 2.8.1 git-svn-id: …
5:03 AM Ticket #41644 (root5 @5.34.13: Undefined symbols: ___GLXEW_ARB_multisample (on 10.5 i386)) created by ryandesign (Ryan Schmidt)
On Leopard i386, building root fails with: […]
4:12 AM Ticket #41460 (xtide @2.11: error: no viable overloaded '=') closed by ryandesign (Ryan Schmidt)
fixed: Ok, here we go! r114196
4:12 AM Changeset [114196] by ryandesign@…
xtide: update to 2.13.2; add an upstream patch for clang …
4:12 AM Changeset in macports-ports [788fdde3042135b3e45e800e697d5395ffedd010]boost_1.72.0_updatevirt-hackery by ryandesign (Ryan Schmidt)
xtide: update to 2.13.2; add an upstream patch for clang …
3:53 AM Ticket #41643 (gtk3 fails to configure on mavericks) created by simonblanchard@…
gtk3 config fails with the following message […]
3:47 AM Ticket #41642 (Error in Quickstart page for MacPorts) created by spencer@…
on http://www.macports.org/install.php step 2 says: "Agree to Xcode …
3:45 AM Ticket #41641 (llvm-3.4: build fails in Release+Debug+Asserts/AnalysisTests: ld: ...) created by h.rayflood@…
[…] […] […] […]
3:16 AM Ticket #41622 (fftw-3: enable avx instructions) reopened by skymoo (Adam Mercer)
2:41 AM Ticket #41622 (fftw-3: enable avx instructions) closed by skymoo (Adam Mercer)
fixed: Committed in r114195, with appropriate revision bumps. Thanks.
2:40 AM Changeset [114195] by ram@…
math/fftw-3: use avx optimisation where supported (#41622)
2:40 AM Changeset in macports-ports [579226f9877d295a3e33d73e6a6b02691ccde2c4]boost_1.72.0_updatevirt-hackery by skymoo (Adam Mercer)
math/fftw-3: use avx optimisation where supported …
2:26 AM Ticket #41640 (VLC, VLC-devel: fails to build with freetype 2.5.1) created by ctreleaven (Craig Treleaven)
Freetype changed the layout of its include files and VLC is using an …
2:01 AM Changeset [114194] by larryv@…
tigervnc: Revert r114192 and correct patchfiles instead (#41617).
2:01 AM Changeset in macports-ports [5e224696daab7b075834a72a3f78f93c8f8053fb]boost_1.72.0_updatevirt-hackery by larryv (Lawrence Velázquez)
tigervnc: Revert https://trac.macports.org/changeset/114192 and …
1:19 AM Changeset [114193] by devans@…
lib2geom: update to bzr 2160, some fixes for elliptical arcs, paths, …
1:19 AM Changeset in macports-ports [22fff23bcb4f857e7d1893c7efcd8404446213ea]boost_1.72.0_updatevirt-hackery by dbevans (David B. Evans)
lib2geom: update to bzr 2160, some fixes for elliptical arcs, paths, …
1:17 AM Ticket #41617 (tigervnc @1.2.0_0: patch filename has wrong case) closed by larryv (Lawrence Velázquez)
fixed
1:17 AM Ticket #41617 (tigervnc @1.2.0_0: patch filename has wrong case) reopened by larryv (Lawrence Velázquez)
1:13 AM Changeset [114192] by larryv@…
tigervnc: Fix case of patch filename (#41617).
1:13 AM Changeset in macports-ports [72b5a6c805ea2b87b4192b7891d8ee3dd605506a]boost_1.72.0_updatevirt-hackery by larryv (Lawrence Velázquez)
tigervnc: Fix case of patch filename …
12:55 AM Ticket #41636 (ROOT : Update to 5.34.13) closed by ryandesign (Ryan Schmidt)
fixed: r114191
12:55 AM Changeset [114191] by ryandesign@…
root: maintainer update to 5.34.13; add debug variant; see #41636
12:55 AM Changeset in macports-ports [cb3c91fea5c76efa49a93ae246bc929a586cd630]boost_1.72.0_updatevirt-hackery by ryandesign (Ryan Schmidt)
root: maintainer update to 5.34.13; add debug variant; see …
12:15 AM Changeset [114190] by jmr@…
py-setuptools: update to 1.4.2
12:15 AM Changeset in macports-ports [732b78578e1fae4901a9804a1397cd3ecc6b39f9]boost_1.72.0_updatevirt-hackery by jmroot (Joshua Root)
py-setuptools: update to 1.4.2 git-svn-id: …
12:14 AM Ticket #41639 (gnudatalanguage @0.9.4: error: call to 'isspace' is ambiguous) created by manischaudhuri@…
[…]
12:13 AM Ticket #41637 (boost: failed to fetch patches) closed by ryandesign (Ryan Schmidt)
invalid
12:02 AM Ticket #41626 (v8 @3.23.15: error: private field 'redundant_' is not used) closed by neverpanic (Clemens Lang)
fixed: Should be fixed in r114189. This might also fix previous issues with …
12:01 AM Changeset [114189] by cal@…
v8: fix build by really disabling -Werror, closes #41626
12:01 AM Changeset in macports-ports [3ee784fbd311f179caa56474d55d9d023b941577]boost_1.72.0_updatevirt-hackery by neverpanic (Clemens Lang)
v8: fix build by really disabling -Werror, closes …

Dec 1, 2013:

10:31 PM Ticket #41638 (gnucash won't run b/c libvorbisfile is too old) created by LenoreHorner
[…] I've just run self update so MacPorts is at 2.2.1. My OS is …
8:33 PM Ticket #41632 (qt4-mac-sqlite3-plugin: Requested variants "" do not match original ...) closed by ryandesign (Ryan Schmidt)
invalid: As the message you showed us says: `Requested variants "" do not match …
8:28 PM Ticket #41633 (wine @1.6.1: build fails with freetype 2.5.1) closed by ryandesign (Ryan Schmidt)
duplicate: Failing to fetch an archive is not a bug. In that case, it will try to …
8:27 PM Ticket #41635 (perl5.12: sh: /usr/bin/gnutar: No such file or directory) closed by ryandesign (Ryan Schmidt)
invalid: The log says: […] Read MavericksProblems for the solution.
8:10 PM Ticket #41637 (boost: failed to fetch patches) created by mike.hui.zhang@…
Attempting to fetch patch-tools_build_v2_engine_src_build.sh.diff Can …
8:07 PM Ticket #41636 (ROOT : Update to 5.34.13) created by cjones051073 (Chris Jones)
Update to 5.34.11 + add a debug variant.
7:44 PM Ticket #41635 (perl5.12: sh: /usr/bin/gnutar: No such file or directory) created by wangsix (Cheng-i Wang)
perl5.12 can`t get upgraded or installed after upgrade to 10.9, have …
7:32 PM Changeset [114188] by ram@…
finance/cgminer: update to 3.8.4 This release drops support for GPU …
7:32 PM Changeset in macports-ports [8fd2e1ffa5bdf28aa353ca0406c2773d6da004e1]boost_1.72.0_updatevirt-hackery by skymoo (Adam Mercer)
finance/cgminer: update to 3.8.4 This release drops support for GPU …
7:11 PM Ticket #41634 (fugu @1.2.0 does not build on Mavericks) created by bouttier__macports@…
I am unable to reinstall Fugu on a Mac I just upgraded from 10.6.8 to …
5:46 PM Ticket #41633 (wine @1.6.1: build fails with freetype 2.5.1) created by charlie.ellison01@…
When trying to install wine, the archive fetch failed for …
5:11 PM Ticket #41632 (qt4-mac-sqlite3-plugin: Requested variants "" do not match original ...) created by gtmdhl@…
Mac OS 10.9 Maverick on IMac Attempting to install digikam. Downloaded …
4:10 PM Changeset [114187] by devans@…
glib-networking: update to version 2.38.2.
4:10 PM Changeset in macports-ports [6be247138b3550cd155595d4b7cc66cbbae8caff]boost_1.72.0_updatevirt-hackery by dbevans (David B. Evans)
glib-networking: update to version 2.38.2. git-svn-id: …
1:58 PM Changeset [114186] by nicos@…
gsl: passing optimization flags to configure.optflags, supressing …
1:58 PM Changeset in macports-ports [38db2417bef2a6757a469d2f607b7e972e1f3f70]boost_1.72.0_updatevirt-hackery by NicosPavlov
gsl: passing optimization flags to configure.optflags, supressing …
1:23 PM Changeset [114185] by mww@…
algol68g: version 2.8
1:23 PM Changeset in macports-ports [c1f41739c66a6cc60f72afb71bb37da2f61e1663]boost_1.72.0_updatevirt-hackery by Markus W. Weißmann <mww@…>
algol68g: version 2.8 git-svn-id: …
12:24 PM Ticket #41631 (pypy 2.2.1 build failure) closed by jmroot (Joshua Root)
duplicate: #40458 Deactivate the old, non-working version of pypy while you …
12:09 PM Ticket #41631 (pypy 2.2.1 build failure) created by poorsod@…
I'm trying to upgrade my Pypy installation from 2.1 to 2.2.1. The …
9:40 AM Ticket #41630 (dmenu @4.5: new submission) created by jpo@…
8:24 AM Changeset [114184] by devans@…
ffmpeg-devel: update to recent git master.
8:24 AM Changeset in macports-ports [4cd44077e1ef40ef89dd9fe49f47e78c39c563f3]boost_1.72.0_updatevirt-hackery by dbevans (David B. Evans)
ffmpeg-devel: update to recent git master. git-svn-id: …
7:40 AM Changeset [114183] by vince@…
Restores epoch (thanks Ryan).
7:40 AM Changeset in macports-ports [23ba05ecd481955bc1c914f805fb8cb9c57d57ff]boost_1.72.0_updatevirt-hackery by Veence (Vincent)
Restores epoch (thanks Ryan). git-svn-id: …
6:56 AM Ticket #41583 (swi-prolog-devel @7.1.0: update to 7.1.1) closed by ryandesign (Ryan Schmidt)
fixed: r114182
6:56 AM Changeset [114182] by ryandesign@…
swi-prolog-devel: maintainer update to 7.1.1 (#41583)
6:56 AM Changeset in macports-ports [0f3c70258d0fb166f860810b20b713cc32b283be]boost_1.72.0_updatevirt-hackery by ryandesign (Ryan Schmidt)
swi-prolog-devel: maintainer update to 7.1.1 …
6:36 AM Ticket #40090 (log4cxx @0.10.0: Undefined local symbol L318) reopened by ryandesign (Ryan Schmidt)
As it happens, I see the same problem with the log4cxx port that we do …
4:49 AM Ticket #34937 (log4cxx @0.10.0_0+universal build fails with clang) closed by ryandesign (Ryan Schmidt)
fixed: Fixed in r114181 (maintainer timeout).
4:48 AM Changeset [114181] by ryandesign@…
log4cxx: fix universal variant with clang by regenerating libtool …
4:48 AM Changeset in macports-ports [59c181242d24ef7487a7d46b6df6b9c5937b1646]boost_1.72.0_updatevirt-hackery by ryandesign (Ryan Schmidt)
log4cxx: fix universal variant with clang by regenerating libtool …
4:34 AM Ticket #40093 (log4cxx doesn't build on ML and XCode 4.3, can't find db-4.6) closed by ryandesign (Ryan Schmidt)
fixed: Replying to kyle.j.kauffman@…: > {{{ > :info:build ld: …
4:34 AM Changeset [114180] by ryandesign@…
log4cxx: fix build failure "ld: library not found for -ldb-4.6" …
4:34 AM Changeset in macports-ports [ee6ac803d9e5388576df7d618d966c24097140c4]boost_1.72.0_updatevirt-hackery by ryandesign (Ryan Schmidt)
log4cxx: fix build failure "ld: library not found for -ldb-4.6" …
4:06 AM Ticket #41604 (log4cxx build fails on Mavericks) closed by ryandesign (Ryan Schmidt)
fixed: r114179 (maintainer timeout) Build still fails as described in #40093.
4:05 AM Changeset [114179] by ryandesign@…
log4cxx: fix build failure on Mavericks (#41604)
4:05 AM Changeset in macports-ports [f793261eed47639f3010eb17896092d3943a1d35]boost_1.72.0_updatevirt-hackery by ryandesign (Ryan Schmidt)
log4cxx: fix build failure on Mavericks …
3:54 AM Changeset [114178] by ryandesign@…
podofo: fix line endings of FindFREETYPE.cmake; never look for …
3:54 AM Changeset in macports-ports [07d488c678270ef6777faf56d577d2c2e5c44b0b]boost_1.72.0_updatevirt-hackery by ryandesign (Ryan Schmidt)
podofo: fix line endings of FindFREETYPE.cmake; never look for …
3:31 AM Ticket #41569 (cmake: FindFreetype.cmake doesn't work properly after upgrading to ...) closed by ryandesign (Ryan Schmidt)
fixed: Upstream has not moved on this issue, so I committed a quick fix in …
3:30 AM Changeset [114177] by ryandesign@…
cmake: fix FindFreetype.cmake to be able to find freetype 2.5.1 (but …
3:30 AM Changeset in macports-ports [667558939af23c480d7e219aab59ae895ff90877]boost_1.72.0_updatevirt-hackery by ryandesign (Ryan Schmidt)
cmake: fix FindFreetype.cmake to be able to find freetype 2.5.1 (but …
3:09 AM Changeset [114176] by ryandesign@…
ee: ensure we're UsingTheRightCompiler and -arch flags; add universal …
3:09 AM Changeset in macports-ports [4bab700888e652f91bf601f8a13cbafa3183cbca]boost_1.72.0_updatevirt-hackery by ryandesign (Ryan Schmidt)
ee: ensure we're UsingTheRightCompiler and -arch flags; add universal …
3:01 AM Changeset [114175] by ryandesign@…
ee: whitespace changes; add modeline
3:01 AM Changeset in macports-ports [a5eaf5dcf0d7fcf9aa5a64e009405d1bf4cdba88]boost_1.72.0_updatevirt-hackery by ryandesign (Ryan Schmidt)
ee: whitespace changes; add modeline git-svn-id: …
2:41 AM Ticket #41625 (qt4-x11: sed: RE error: illegal byte sequence) closed by ryandesign (Ryan Schmidt)
fixed: Replying to ryandesign@…: > The error in the log is: > > …
2:40 AM Changeset [114174] by ryandesign@…
qt4-x11: fix patch failure on Mountain Lion and later (#41625)
2:40 AM Changeset in macports-ports [fd6e54eb6f325228f700779f534f20143b6095bf]boost_1.72.0_updatevirt-hackery by ryandesign (Ryan Schmidt)
qt4-x11: fix patch failure on Mountain Lion and later …
2:07 AM Ticket #41628 (wine @1.6.1: build fails with freetype 2.5.1) closed by ryandesign (Ryan Schmidt)
duplicate: Duplicate of #41605.
1:40 AM Ticket #41629 (macosx_deployment_target) created by help@…
Error occurs when macosx_deployment_target is set in macports.conf to …
1:39 AM Ticket #39824 (cflow @1.0: update to 1.4) closed by larryv (Lawrence Velázquez)
fixed: I updated to 1.4 in r114173, except I used the smaller xz distfile …
1:37 AM Ticket #41628 (wine @1.6.1: build fails with freetype 2.5.1) created by orchestrateddeath@…
Macbook Air OS X 10.9 Mavericks. I followed this guide: …
1:34 AM Changeset [114173] by larryv@…
cflow: Update to 1.4 (maintainer, #39824).
1:34 AM Changeset in macports-ports [23157c23302d685358c23968bbaa4bf07ac5d9a9]boost_1.72.0_updatevirt-hackery by larryv (Lawrence Velázquez)
cflow: Update to 1.4 (maintainer, …
12:59 AM Ticket #41627 (ld64 @136_2 build fails when macosx_deployment_target is set) created by help@…
Error occurs when macosx_deployment_target is set in macports.conf to …
12:54 AM Changeset [114172] by devans@…
virtuoso: rebuild due to library reversioning libsasl2.2 -> libsasl2.
12:54 AM Changeset in macports-ports [dc837939a2fe667648f448b2d96a25b57b64d11c]boost_1.72.0_updatevirt-hackery by dbevans (David B. Evans)
virtuoso: rebuild due to library reversioning libsasl2.2 -> libsasl2. …
12:53 AM Ticket #41626 (v8 @3.23.15: error: private field 'redundant_' is not used) created by ryandesign (Ryan Schmidt)
v8 @3.23.15 fails to build for me on Mavericks: […] I'm upgrading …
12:33 AM Changeset [114171] by devans@…
py-spatialite: needs py-setuptools.
12:33 AM Changeset in macports-ports [1bbfd963e05afb6d3c68e0d92097f9456f2ee10c]boost_1.72.0_updatevirt-hackery by dbevans (David B. Evans)
py-spatialite: needs py-setuptools. git-svn-id: …
12:25 AM Ticket #41617 (tigervnc @1.2.0_0: patch filename has wrong case) closed by ryandesign (Ryan Schmidt)
invalid: The patch files are already in the files directory.
12:20 AM Changeset [114170] by ryandesign@…
wine-devel: fix build with freetype 2.5.1 (#41605)
12:20 AM Changeset in macports-ports [ce2ad93c30313234f426574b83a6db84efdb1c5b]boost_1.72.0_updatevirt-hackery by ryandesign (Ryan Schmidt)
wine-devel: fix build with freetype 2.5.1 …
12:15 AM Changeset [114169] by devans@…
py-spatialite: set name after githup.setup to avoid portindex failure.
12:15 AM Changeset in macports-ports [3162437fc679566daade509c4f8c36a248f0ecf8]boost_1.72.0_updatevirt-hackery by dbevans (David B. Evans)
py-spatialite: set name after githup.setup to avoid portindex failure. …
Note: See TracTimeline for information about the timeline view.