wiki:ElCapitanProblems

Version 1 (modified by raimue (Rainer Müller), 6 years ago) (diff)

--

El Capitan Problems

General Issues

First of all, please read Migration.

Updating MacPorts Base

MacPorts must be re-installed in a version configured for OS X 10.11 El Capitan.

Ensure you have at least the command line tools installed by running xcode-select --install from a Terminal. Make sure to also run this even if you have Xcode installed, because some ports fail to build without it. You also have to run sudo xcodebuild -license after doing this.

Tickets for Broken Ports

#45560
csound @5.16.6: KeyError: 10
#48471
FSF gcc48 fails to compile projects on El Capitan due to OS X SDK bug in Availability.h
#49069
emacs-mac-app @5.9: error: no type or protocol named 'WebFrameLoadDelegate'
#49094
phantomjs 2.0 fails to build on OS X 10.11 El Capitan
#49104
star @1.5.2: mkdir: /etc/default: Operation not permitted
#49129
HandBrakeCLI @0.10.0: configure.py: error: invalid xcconfig: osx1011.x86_64
#49290
mongodb does not start after upgrade to El Capitan
#50040
Aquaterm 1.1.1 El Capitan build failure
#50075
zeroc-ice35: error: expression with side effects will be evaluated despite being used as an operand to 'typeid'
#50138
optpp: ld: framework not found vecLib
#51133
Xcode 7.3 bug: __DATA/__thread_bss extends beyond end of file
#52018
dibbler @1.0.0RC1: ../Misc/Portable.h:323:48: error: expected ')'
#52245
cups-pdf mainly broken on El Capitan OS X 10.11
#53161
tuntaposx: kernel extensions have to be signed
#53204
Error: Processing of port netcdf-fortran failed
#53861
gmake @4.2.1: Symbol not found: _clock_gettime
#54781
osxfuse @3.6.3: use of undeclared identifiers 'VOL_CAP_FMT_NO_IMMUTABLE_FILES' 'VOL_CAP_FMT_NO_PERMISSIONS'
#60477
stack @2.3.1_0: Undefined symbols: _utimensat
#62007
postgresql11-server @11.10 startupitem don't start
#62220
KeePassXC @2.6.4: no member named 'MacOSBigSur' in 'QOperatingSystemVersion'
#62455
pngpaste: error: use of undeclared identifier 'NSBitmapImageFileTypeGIF'
#62459
wxMaxima @21.02.0: error: unknown type name 'nullptr_t'; did you mean 'std::nullptr_t'?
#62488
py38-scipy - vodemodule.c - fatal error: 'threads.h' not found
#62501
py27-sqlalchemy @1.4.1_0 broke buildbot-0.8
#62709
libgcc10 @ 10.3.0_0+universal.darwin_15.i386-x86_64: libgcc/libgcc2.c:1989:10: internal compiler error: Illegal instruction: 4 building mulxc3
#62735
optool @ 0.1_0+universal.darwin_15.i386-x86_64: synthesized property ('rule' | 'position') naming problems

#45006
cups-pdf sandbox issues in yosemite
#45582
grace: xmgrace crashes with SIGSYS in yosemite
#45612
Failed to Install SoXt on Yosemite
#45629
cedet @1.1 fails to build on OS X Yosemite
#45689
Yosemite 10.10 Glade requirements not met
#46015
Cannot install gnu prolog (gprolog) on Yosemite
#46412
p5-text-kakasi, p5-text-chasen: fails to install on Yosemite
#46548
octave-parallel-2.0.5 Configure failure on Yosemite
#47983
ocaml-lacaml 7.0.13 build failure owing to changed framework on yosemite 10.10
#48004
Internal compiler error (gcc-5.1.0) when using math.h on Yosemite
#49621
qyoto @ 4.14.3: fails to build on Yosemite
#51153
Error: Failed to install p5.22-html-parser on Yosemite
#62950
dsniff @2.4b1_2 build failure on Mac OSX 10.10.-.Yosemite