Ticket #13856: mod_python - out.txt

File mod_python - out.txt, 19.4 KB (added by tabithamc@…, 13 years ago)

output of attempting to install mod_python on Leopard Server

Line 
1bash-3.2# port -v install mod_python
2--->  Fetching mod_python
3--->  Verifying checksum(s) for mod_python
4--->  Checksumming mod_python-3.3.1.tgz
5--->  Extracting mod_python
6--->  Extracting mod_python-3.3.1.tgz
7--->  Configuring mod_python
8checking for gcc... /usr/bin/gcc-4.0
9checking for C compiler default output file name... a.out
10checking whether the C compiler works... yes
11checking whether we are cross compiling... no
12checking for suffix of executables...
13checking for suffix of object files... o
14checking whether we are using the GNU C compiler... yes
15checking whether /usr/bin/gcc-4.0 accepts -g... yes
16checking for /usr/bin/gcc-4.0 option to accept ANSI C... none needed
17checking for ar... ar
18checking for a BSD-compatible install... /usr/bin/install
19checking whether make sets $(MAKE)... yes
20checking for main in -lm... yes
21checking for an ANSI C-conforming const... yes
22checking your blood pressure... a bit high, but we can proceed
23configure: checking whether apxs is available...
24checking for --with-apxs... /opt/local/apache2/bin/apxs executable, good
25checking Apache version... 2.2.6
26checking for Apache libexec directory... /opt/local/apache2/modules
27checking for Apache include directory... -I/opt/local/apache2/include
28checking for --with-python... /opt/local/bin/python2.4
29checking Python version... 2.4
30checking Python install prefix... /opt/local/Library/Frameworks/Python.framework/Versions/2.4
31checking checking where python libraries are installed... /opt/local/Library/Frameworks/Python.framework/Versions/2.4/lib/python2.4
32checking what libraries Python was linked with... -framework  Python    -ldl                   
33checking linker flags used to link Python...
34checking where Python include files are... -I/opt/local/Library/Frameworks/Python.framework/Versions/2.4/include/python2.4
35checking for --with-python-src... no
36checking for --with-mutex-dir... no
37Using MUTEX_DIR /tmp
38checking for --with-max-locks... no
39Using 8 MAX_LOCKS.
40checking for --with-flex... /opt/local/bin/flex
41found /opt/local/bin/flex, we'll use this. Use --with-flex to specify another.
42checking flex version... 2.5.34. Good
43configure: creating ./config.status
44config.status: creating Makefile
45config.status: creating src/Makefile
46config.status: creating Doc/Makefile
47config.status: creating src/include/mod_python.h
48config.status: creating test/Makefile
49config.status: creating test/testconf.py
50config.status: creating dist/setup.py
51config.status: creating dist/Makefile
52--->  Building mod_python with target all
53
54Compiling for DSO.
55
56/opt/local/apache2/bin/apxs -I/opt/local/var/macports/build/_opt_local_var_macports_sources_rsync.macports.org_release_ports_www_mod_python/work/mod_python-3.3.1/src/include -I/opt/local/apache2/include -I/opt/local/Library/Frameworks/Python.framework/Versions/2.4/include/python2.4 -c mod_python.c _apachemodule.c requestobject.c tableobject.c util.c serverobject.c connobject.c filterobject.c hlist.c hlistobject.c finfoobject.c -L/opt/local/lib -Wl,-F/opt/local/Library/Frameworks -Wl,-framework,Python  -u _PyMac_Error /Versions//   -L/opt/local/lib   -lm  -framework  Python    -ldl                     
57/opt/local/share/apr-1/build/libtool --silent --mode=compile /usr/bin/gcc-4.0 -prefer-pic -O2  -DDARWIN -DSIGPROCMASK_SETS_THREAD_MASK -no-cpp-precomp -I/opt/local/include -I/opt/local/apache2/include  -I/opt/local/include/apr-1   -I/opt/local/include/apr-1 -I/opt/local/include -I/opt/local/var/macports/build/_opt_local_var_macports_sources_rsync.macports.org_release_ports_www_mod_python/work/mod_python-3.3.1/src/include -I/opt/local/apache2/include -I/opt/local/Library/Frameworks/Python.framework/Versions/2.4/include/python2.4  -c -o mod_python.lo mod_python.c && touch mod_python.slo
58mod_python.c: In function 'python_init':
59mod_python.c:826: warning: initialization from incompatible pointer type
60/opt/local/share/apr-1/build/libtool --silent --mode=compile /usr/bin/gcc-4.0 -prefer-pic -O2  -DDARWIN -DSIGPROCMASK_SETS_THREAD_MASK -no-cpp-precomp -I/opt/local/include -I/opt/local/apache2/include  -I/opt/local/include/apr-1   -I/opt/local/include/apr-1 -I/opt/local/include -I/opt/local/var/macports/build/_opt_local_var_macports_sources_rsync.macports.org_release_ports_www_mod_python/work/mod_python-3.3.1/src/include -I/opt/local/apache2/include -I/opt/local/Library/Frameworks/Python.framework/Versions/2.4/include/python2.4  -c -o _apachemodule.lo _apachemodule.c && touch _apachemodule.slo
61/opt/local/share/apr-1/build/libtool --silent --mode=compile /usr/bin/gcc-4.0 -prefer-pic -O2  -DDARWIN -DSIGPROCMASK_SETS_THREAD_MASK -no-cpp-precomp -I/opt/local/include -I/opt/local/apache2/include  -I/opt/local/include/apr-1   -I/opt/local/include/apr-1 -I/opt/local/include -I/opt/local/var/macports/build/_opt_local_var_macports_sources_rsync.macports.org_release_ports_www_mod_python/work/mod_python-3.3.1/src/include -I/opt/local/apache2/include -I/opt/local/Library/Frameworks/Python.framework/Versions/2.4/include/python2.4  -c -o requestobject.lo requestobject.c && touch requestobject.slo
62/opt/local/share/apr-1/build/libtool --silent --mode=compile /usr/bin/gcc-4.0 -prefer-pic -O2  -DDARWIN -DSIGPROCMASK_SETS_THREAD_MASK -no-cpp-precomp -I/opt/local/include -I/opt/local/apache2/include  -I/opt/local/include/apr-1   -I/opt/local/include/apr-1 -I/opt/local/include -I/opt/local/var/macports/build/_opt_local_var_macports_sources_rsync.macports.org_release_ports_www_mod_python/work/mod_python-3.3.1/src/include -I/opt/local/apache2/include -I/opt/local/Library/Frameworks/Python.framework/Versions/2.4/include/python2.4  -c -o tableobject.lo tableobject.c && touch tableobject.slo
63tableobject.c:1092: warning: initialization from incompatible pointer type
64/opt/local/share/apr-1/build/libtool --silent --mode=compile /usr/bin/gcc-4.0 -prefer-pic -O2  -DDARWIN -DSIGPROCMASK_SETS_THREAD_MASK -no-cpp-precomp -I/opt/local/include -I/opt/local/apache2/include  -I/opt/local/include/apr-1   -I/opt/local/include/apr-1 -I/opt/local/include -I/opt/local/var/macports/build/_opt_local_var_macports_sources_rsync.macports.org_release_ports_www_mod_python/work/mod_python-3.3.1/src/include -I/opt/local/apache2/include -I/opt/local/Library/Frameworks/Python.framework/Versions/2.4/include/python2.4  -c -o util.lo util.c && touch util.slo
65/opt/local/share/apr-1/build/libtool --silent --mode=compile /usr/bin/gcc-4.0 -prefer-pic -O2  -DDARWIN -DSIGPROCMASK_SETS_THREAD_MASK -no-cpp-precomp -I/opt/local/include -I/opt/local/apache2/include  -I/opt/local/include/apr-1   -I/opt/local/include/apr-1 -I/opt/local/include -I/opt/local/var/macports/build/_opt_local_var_macports_sources_rsync.macports.org_release_ports_www_mod_python/work/mod_python-3.3.1/src/include -I/opt/local/apache2/include -I/opt/local/Library/Frameworks/Python.framework/Versions/2.4/include/python2.4  -c -o serverobject.lo serverobject.c && touch serverobject.slo
66serverobject.c:387: warning: initialization from incompatible pointer type
67/opt/local/share/apr-1/build/libtool --silent --mode=compile /usr/bin/gcc-4.0 -prefer-pic -O2  -DDARWIN -DSIGPROCMASK_SETS_THREAD_MASK -no-cpp-precomp -I/opt/local/include -I/opt/local/apache2/include  -I/opt/local/include/apr-1   -I/opt/local/include/apr-1 -I/opt/local/include -I/opt/local/var/macports/build/_opt_local_var_macports_sources_rsync.macports.org_release_ports_www_mod_python/work/mod_python-3.3.1/src/include -I/opt/local/apache2/include -I/opt/local/Library/Frameworks/Python.framework/Versions/2.4/include/python2.4  -c -o connobject.lo connobject.c && touch connobject.slo
68/opt/local/share/apr-1/build/libtool --silent --mode=compile /usr/bin/gcc-4.0 -prefer-pic -O2  -DDARWIN -DSIGPROCMASK_SETS_THREAD_MASK -no-cpp-precomp -I/opt/local/include -I/opt/local/apache2/include  -I/opt/local/include/apr-1   -I/opt/local/include/apr-1 -I/opt/local/include -I/opt/local/var/macports/build/_opt_local_var_macports_sources_rsync.macports.org_release_ports_www_mod_python/work/mod_python-3.3.1/src/include -I/opt/local/apache2/include -I/opt/local/Library/Frameworks/Python.framework/Versions/2.4/include/python2.4  -c -o filterobject.lo filterobject.c && touch filterobject.slo
69/opt/local/share/apr-1/build/libtool --silent --mode=compile /usr/bin/gcc-4.0 -prefer-pic -O2  -DDARWIN -DSIGPROCMASK_SETS_THREAD_MASK -no-cpp-precomp -I/opt/local/include -I/opt/local/apache2/include  -I/opt/local/include/apr-1   -I/opt/local/include/apr-1 -I/opt/local/include -I/opt/local/var/macports/build/_opt_local_var_macports_sources_rsync.macports.org_release_ports_www_mod_python/work/mod_python-3.3.1/src/include -I/opt/local/apache2/include -I/opt/local/Library/Frameworks/Python.framework/Versions/2.4/include/python2.4  -c -o hlist.lo hlist.c && touch hlist.slo
70/opt/local/share/apr-1/build/libtool --silent --mode=compile /usr/bin/gcc-4.0 -prefer-pic -O2  -DDARWIN -DSIGPROCMASK_SETS_THREAD_MASK -no-cpp-precomp -I/opt/local/include -I/opt/local/apache2/include  -I/opt/local/include/apr-1   -I/opt/local/include/apr-1 -I/opt/local/include -I/opt/local/var/macports/build/_opt_local_var_macports_sources_rsync.macports.org_release_ports_www_mod_python/work/mod_python-3.3.1/src/include -I/opt/local/apache2/include -I/opt/local/Library/Frameworks/Python.framework/Versions/2.4/include/python2.4  -c -o hlistobject.lo hlistobject.c && touch hlistobject.slo
71/opt/local/share/apr-1/build/libtool --silent --mode=compile /usr/bin/gcc-4.0 -prefer-pic -O2  -DDARWIN -DSIGPROCMASK_SETS_THREAD_MASK -no-cpp-precomp -I/opt/local/include -I/opt/local/apache2/include  -I/opt/local/include/apr-1   -I/opt/local/include/apr-1 -I/opt/local/include -I/opt/local/var/macports/build/_opt_local_var_macports_sources_rsync.macports.org_release_ports_www_mod_python/work/mod_python-3.3.1/src/include -I/opt/local/apache2/include -I/opt/local/Library/Frameworks/Python.framework/Versions/2.4/include/python2.4  -c -o finfoobject.lo finfoobject.c && touch finfoobject.slo
72/opt/local/share/apr-1/build/libtool --silent --mode=link /usr/bin/gcc-4.0 -o mod_python.la  -rpath /opt/local/apache2/modules -module -avoid-version    finfoobject.lo hlistobject.lo hlist.lo filterobject.lo connobject.lo serverobject.lo util.lo tableobject.lo requestobject.lo _apachemodule.lo mod_python.lo -L/opt/local/lib -Wl,-F/opt/local/Library/Frameworks -Wl,-framework,Python -u _PyMac_Error /Versions// -L/opt/local/lib -lm -framework Python -ldl
73ln -s ../lib/python/mod_python mod_python
74ln -s ../src src
75make[2]: `psp_parser.c' is up to date.
76/opt/local/bin/python2.4 setup.py build
77running build
78running build_py
79creating build
80creating build/lib.macosx-10.3-i386-2.4
81creating build/lib.macosx-10.3-i386-2.4/mod_python
82copying /opt/local/var/macports/build/_opt_local_var_macports_sources_rsync.macports.org_release_ports_www_mod_python/work/mod_python-3.3.1/lib/python/mod_python/Cookie.py -> build/lib.macosx-10.3-i386-2.4/mod_python
83copying /opt/local/var/macports/build/_opt_local_var_macports_sources_rsync.macports.org_release_ports_www_mod_python/work/mod_python-3.3.1/lib/python/mod_python/Session.py -> build/lib.macosx-10.3-i386-2.4/mod_python
84copying /opt/local/var/macports/build/_opt_local_var_macports_sources_rsync.macports.org_release_ports_www_mod_python/work/mod_python-3.3.1/lib/python/mod_python/__init__.py -> build/lib.macosx-10.3-i386-2.4/mod_python
85copying /opt/local/var/macports/build/_opt_local_var_macports_sources_rsync.macports.org_release_ports_www_mod_python/work/mod_python-3.3.1/lib/python/mod_python/apache.py -> build/lib.macosx-10.3-i386-2.4/mod_python
86copying /opt/local/var/macports/build/_opt_local_var_macports_sources_rsync.macports.org_release_ports_www_mod_python/work/mod_python-3.3.1/lib/python/mod_python/cache.py -> build/lib.macosx-10.3-i386-2.4/mod_python
87copying /opt/local/var/macports/build/_opt_local_var_macports_sources_rsync.macports.org_release_ports_www_mod_python/work/mod_python-3.3.1/lib/python/mod_python/cgihandler.py -> build/lib.macosx-10.3-i386-2.4/mod_python
88copying /opt/local/var/macports/build/_opt_local_var_macports_sources_rsync.macports.org_release_ports_www_mod_python/work/mod_python-3.3.1/lib/python/mod_python/importer.py -> build/lib.macosx-10.3-i386-2.4/mod_python
89copying /opt/local/var/macports/build/_opt_local_var_macports_sources_rsync.macports.org_release_ports_www_mod_python/work/mod_python-3.3.1/lib/python/mod_python/psp.py -> build/lib.macosx-10.3-i386-2.4/mod_python
90copying /opt/local/var/macports/build/_opt_local_var_macports_sources_rsync.macports.org_release_ports_www_mod_python/work/mod_python-3.3.1/lib/python/mod_python/publisher.py -> build/lib.macosx-10.3-i386-2.4/mod_python
91copying /opt/local/var/macports/build/_opt_local_var_macports_sources_rsync.macports.org_release_ports_www_mod_python/work/mod_python-3.3.1/lib/python/mod_python/python22.py -> build/lib.macosx-10.3-i386-2.4/mod_python
92copying /opt/local/var/macports/build/_opt_local_var_macports_sources_rsync.macports.org_release_ports_www_mod_python/work/mod_python-3.3.1/lib/python/mod_python/testhandler.py -> build/lib.macosx-10.3-i386-2.4/mod_python
93copying /opt/local/var/macports/build/_opt_local_var_macports_sources_rsync.macports.org_release_ports_www_mod_python/work/mod_python-3.3.1/lib/python/mod_python/util.py -> build/lib.macosx-10.3-i386-2.4/mod_python
94running build_ext
95building 'mod_python._psp' extension
96creating build/temp.macosx-10.3-i386-2.4
97creating build/temp.macosx-10.3-i386-2.4/opt/local
98creating build/temp.macosx-10.3-i386-2.4/opt/local/var
99creating build/temp.macosx-10.3-i386-2.4/opt/local/var/macports
100creating build/temp.macosx-10.3-i386-2.4/opt/local/var/macports/build
101creating build/temp.macosx-10.3-i386-2.4/opt/local/var/macports/build/_opt_local_var_macports_sources_rsync.macports.org_release_ports_www_mod_python
102creating build/temp.macosx-10.3-i386-2.4/opt/local/var/macports/build/_opt_local_var_macports_sources_rsync.macports.org_release_ports_www_mod_python/work
103creating build/temp.macosx-10.3-i386-2.4/opt/local/var/macports/build/_opt_local_var_macports_sources_rsync.macports.org_release_ports_www_mod_python/work/mod_python-3.3.1
104creating build/temp.macosx-10.3-i386-2.4/opt/local/var/macports/build/_opt_local_var_macports_sources_rsync.macports.org_release_ports_www_mod_python/work/mod_python-3.3.1/src
105-fno-strict-aliasing -Wno-long-double -no-cpp-precomp -fno-common -fno-common -dynamic -DNDEBUG -g -O3 -Wall -Wstrict-prototypes -I/opt/local/var/macports/build/_opt_local_var_macports_sources_rsync.macports.org_release_ports_www_mod_python/work/mod_python-3.3.1/src/include -I/opt/local/Library/Frameworks/Python.framework/Versions/2.4/include/python2.4 -c /opt/local/var/macports/build/_opt_local_var_macports_sources_rsync.macports.org_release_ports_www_mod_python/work/mod_python-3.3.1/src/psp_string.c -o build/temp.macosx-10.3-i386-2.4/opt/local/var/macports/build/_opt_local_var_macports_sources_rsync.macports.org_release_ports_www_mod_python/work/mod_python-3.3.1/src/psp_string.o
106unable to execute -fno-strict-aliasing: No such file or directory
107error: command '-fno-strict-aliasing' failed with exit status 1
108make[1]: *** [build] Error 1
109make: *** [do_dso] Error 2
110Error: Target org.macports.build returned: shell command " cd "/opt/local/var/macports/build/_opt_local_var_macports_sources_rsync.macports.org_release_ports_www_mod_python/work/mod_python-3.3.1" && make all " returned error 2
111Command output: copying /opt/local/var/macports/build/_opt_local_var_macports_sources_rsync.macports.org_release_ports_www_mod_python/work/mod_python-3.3.1/lib/python/mod_python/Session.py -> build/lib.macosx-10.3-i386-2.4/mod_python
112copying /opt/local/var/macports/build/_opt_local_var_macports_sources_rsync.macports.org_release_ports_www_mod_python/work/mod_python-3.3.1/lib/python/mod_python/__init__.py -> build/lib.macosx-10.3-i386-2.4/mod_python
113copying /opt/local/var/macports/build/_opt_local_var_macports_sources_rsync.macports.org_release_ports_www_mod_python/work/mod_python-3.3.1/lib/python/mod_python/apache.py -> build/lib.macosx-10.3-i386-2.4/mod_python
114copying /opt/local/var/macports/build/_opt_local_var_macports_sources_rsync.macports.org_release_ports_www_mod_python/work/mod_python-3.3.1/lib/python/mod_python/cache.py -> build/lib.macosx-10.3-i386-2.4/mod_python
115copying /opt/local/var/macports/build/_opt_local_var_macports_sources_rsync.macports.org_release_ports_www_mod_python/work/mod_python-3.3.1/lib/python/mod_python/cgihandler.py -> build/lib.macosx-10.3-i386-2.4/mod_python
116copying /opt/local/var/macports/build/_opt_local_var_macports_sources_rsync.macports.org_release_ports_www_mod_python/work/mod_python-3.3.1/lib/python/mod_python/importer.py -> build/lib.macosx-10.3-i386-2.4/mod_python
117copying /opt/local/var/macports/build/_opt_local_var_macports_sources_rsync.macports.org_release_ports_www_mod_python/work/mod_python-3.3.1/lib/python/mod_python/psp.py -> build/lib.macosx-10.3-i386-2.4/mod_python
118copying /opt/local/var/macports/build/_opt_local_var_macports_sources_rsync.macports.org_release_ports_www_mod_python/work/mod_python-3.3.1/lib/python/mod_python/publisher.py -> build/lib.macosx-10.3-i386-2.4/mod_python
119copying /opt/local/var/macports/build/_opt_local_var_macports_sources_rsync.macports.org_release_ports_www_mod_python/work/mod_python-3.3.1/lib/python/mod_python/python22.py -> build/lib.macosx-10.3-i386-2.4/mod_python
120copying /opt/local/var/macports/build/_opt_local_var_macports_sources_rsync.macports.org_release_ports_www_mod_python/work/mod_python-3.3.1/lib/python/mod_python/testhandler.py -> build/lib.macosx-10.3-i386-2.4/mod_python
121copying /opt/local/var/macports/build/_opt_local_var_macports_sources_rsync.macports.org_release_ports_www_mod_python/work/mod_python-3.3.1/lib/python/mod_python/util.py -> build/lib.macosx-10.3-i386-2.4/mod_python
122running build_ext
123building 'mod_python._psp' extension
124creating build/temp.macosx-10.3-i386-2.4
125creating build/temp.macosx-10.3-i386-2.4/opt/local
126creating build/temp.macosx-10.3-i386-2.4/opt/local/var
127creating build/temp.macosx-10.3-i386-2.4/opt/local/var/macports
128creating build/temp.macosx-10.3-i386-2.4/opt/local/var/macports/build
129creating build/temp.macosx-10.3-i386-2.4/opt/local/var/macports/build/_opt_local_var_macports_sources_rsync.macports.org_release_ports_www_mod_python
130creating build/temp.macosx-10.3-i386-2.4/opt/local/var/macports/build/_opt_local_var_macports_sources_rsync.macports.org_release_ports_www_mod_python/work
131creating build/temp.macosx-10.3-i386-2.4/opt/local/var/macports/build/_opt_local_var_macports_sources_rsync.macports.org_release_ports_www_mod_python/work/mod_python-3.3.1
132creating build/temp.macosx-10.3-i386-2.4/opt/local/var/macports/build/_opt_local_var_macports_sources_rsync.macports.org_release_ports_www_mod_python/work/mod_python-3.3.1/src
133-fno-strict-aliasing -Wno-long-double -no-cpp-precomp -fno-common -fno-common -dynamic -DNDEBUG -g -O3 -Wall -Wstrict-prototypes -I/opt/local/var/macports/build/_opt_local_var_macports_sources_rsync.macports.org_release_ports_www_mod_python/work/mod_python-3.3.1/src/include -I/opt/local/Library/Frameworks/Python.framework/Versions/2.4/include/python2.4 -c /opt/local/var/macports/build/_opt_local_var_macports_sources_rsync.macports.org_release_ports_www_mod_python/work/mod_python-3.3.1/src/psp_string.c -o build/temp.macosx-10.3-i386-2.4/opt/local/var/macports/build/_opt_local_var_macports_sources_rsync.macports.org_release_ports_www_mod_python/work/mod_python-3.3.1/src/psp_string.o
134unable to execute -fno-strict-aliasing: No such file or directory
135error: command '-fno-strict-aliasing' failed with exit status 1
136make[1]: *** [build] Error 1
137make: *** [do_dso] Error 2
138
139Warning: the following items did not execute (for mod_python): org.macports.activate org.macports.build org.macports.destroot org.macports.install
140Error: Status 1 encountered during processing.
141bash-3.2#