Ticket #20027: perl5.8_with_-v_-d.txt

File perl5.8_with_-v_-d.txt, 35.2 KB (added by uttam@…, 12 years ago)

output of "sudo port -v -d install perl5.8"

Line 
1m:~ illuminati$ sudo port -v -d install perl5.8
2Password:
3DEBUG: Found port in file:///opt/local/var/macports/sources/rsync.macports.org/release/ports/lang/perl5.8
4DEBUG: Changing to port directory: /opt/local/var/macports/sources/rsync.macports.org/release/ports/lang/perl5.8
5DEBUG: setting option os.universal_supported to yes
6DEBUG: org.macports.load registered provides 'load', a pre-existing procedure. Target override will not be provided
7DEBUG: org.macports.distfiles registered provides 'distfiles', a pre-existing procedure. Target override will not be provided
8DEBUG: 'universal_variant no' specified, so not adding the default universal variant
9DEBUG: Requested variant darwin is not provided by port perl5.8.
10DEBUG: Requested variant i386 is not provided by port perl5.8.
11DEBUG: Requested variant macosx is not provided by port perl5.8.
12DEBUG: Executing org.macports.main (perl5.8)
13--->  Fetching perl5.8
14DEBUG: Executing org.macports.fetch (perl5.8)
15--->  Verifying checksum(s) for perl5.8
16DEBUG: Executing org.macports.checksum (perl5.8)
17--->  Checksumming perl-5.8.9.tar.bz2
18DEBUG: Correct (md5) checksum for perl-5.8.9.tar.bz2
19DEBUG: Correct (sha1) checksum for perl-5.8.9.tar.bz2
20DEBUG: Correct (rmd160) checksum for perl-5.8.9.tar.bz2
21DEBUG: setting option extract.cmd to /opt/local/bin/bzip2
22--->  Extracting perl5.8
23DEBUG: Executing org.macports.extract (perl5.8)
24--->  Extracting perl-5.8.9.tar.bz2
25DEBUG: setting option extract.args to /opt/local/var/macports/distfiles/perl5.8/perl-5.8.9.tar.bz2
26DEBUG: Environment: MACOSX_DEPLOYMENT_TARGET='10.5'
27DEBUG: Assembled command: 'cd "/opt/local/var/macports/build/_opt_local_var_macports_sources_rsync.macports.org_release_ports_lang_perl5.8/work" && /opt/local/bin/bzip2 -dc /opt/local/var/macports/distfiles/perl5.8/perl-5.8.9.tar.bz2 | /usr/bin/gnutar --no-same-owner -xf -'
28DEBUG: Executing org.macports.patch (perl5.8)
29--->  Applying patches to perl5.8
30--->  Applying /opt/local/var/macports/sources/rsync.macports.org/release/ports/lang/perl5.8/files/patch-perl.c.diff
31DEBUG: Environment: MACOSX_DEPLOYMENT_TARGET='10.5'
32DEBUG: Assembled command: 'cd "/opt/local/var/macports/build/_opt_local_var_macports_sources_rsync.macports.org_release_ports_lang_perl5.8/work/perl-5.8.9" && patch -p0'
33patching file perl.c
34DEBUG: Executing proc-post-org.macports.patch-patch-0
35DEBUG: Executing proc-post-org.macports.patch-patch-1
36--->  Configuring perl5.8
37DEBUG: Using compiler 'Mac OS X gcc 4.0'
38DEBUG: Executing org.macports.configure (perl5.8)
39DEBUG: Environment: CFLAGS='-O2' CPPFLAGS='-I/opt/local/include' CXXFLAGS='-O2' MACOSX_DEPLOYMENT_TARGET='10.5' CPP='/usr/bin/cpp-4.0' CXX='/usr/bin/g++-4.0' F90FLAGS='-O2' LDFLAGS='-L/opt/local/lib' FCFLAGS='-O2' OBJC='/usr/bin/gcc-4.0' INSTALL='/usr/bin/install -c' OBJCFLAGS='-O2' FFLAGS='-O2' CC='/usr/bin/gcc-4.0' LC_ALL='C'
40DEBUG: Assembled command: 'cd "/opt/local/var/macports/build/_opt_local_var_macports_sources_rsync.macports.org_release_ports_lang_perl5.8/work/perl-5.8.9" && /bin/sh Configure -des -D prefix='/opt/local' -D scriptdir='/opt/local/bin' -D cppflags="${CPPFLAGS}" -D ldflags="${LDFLAGS}" -D vendorprefix='/opt/local' -D man1ext='1pm' -D man3ext='3pm' -D cc=${CC} -D ld=${CC} -D man1dir='/opt/local/share/man/man1p' -D man3dir='/opt/local/share/man/man3p' -D siteman1dir='/opt/local/share/man/man1' -D siteman3dir='/opt/local/share/man/man3' -D vendorman1dir='/opt/local/share/man/man1' -D vendorman3dir='/opt/local/share/man/man3' -D inc_version_list="5.8.8 5.8.8/darwin-2level" -U i_bind -U i_gdbm -U i_db'
41First let's make sure your kit is complete.  Checking...
42Locating common programs...
43Checking compatibility between /bin/echo and builtin echo (if any)...
44Symbolic links are supported.
45Checking how to test for symbolic links...
46You can test for symbolic links with 'test -h'.
47Good, your tr supports [:lower:] and [:upper:] to convert case.
48Using [:upper:] and [:lower:] to convert case.
493b1             cygwin          gnu             linux           next_3_0        sco_2_3_0       ultrix_4   
50aix             darwin          gnukfreebsd     lynxos          next_4          sco_2_3_1       umips   
51aix_3           dcosx           gnuknetbsd      machten         nonstopux       sco_2_3_2       unicos   
52aix_4           dec_osf         greenhills      machten_2       openbsd         sco_2_3_3       unicosmk   
53altos486        dgux            hpux            midnightbsd     opus            sco_2_3_4       unisysdynix   
54amigaos         dos_djgpp       i386            mint            os2             solaris_2       utekv   
55apollo          dragonfly       interix         mips            os390           stellar         uts   
56atheos          dynix           irix_4          mirbsd          os400           sunos_4_0       uwin   
57aux_3           dynixptx        irix_5          mpc             posix-bc        sunos_4_1       vmesa   
58beos            epix            irix_6          mpeix           powerux         super-ux        vos   
59bsdos           esix4           irix_6_0        ncr_tower       qnx             svr4   
60catamount       fps             irix_6_1        netbsd          rhapsody        svr5   
61convexos        freebsd         isc             newsos4         riscos          ti1500   
62cxux            genix           isc_2           next_3          sco             titanos   
63Which of these apply, if any? [darwin] 
64Operating system name? [darwin] 
65Operating system version? [9.7.0] 
66Installation prefix to use? (~name ok) [/opt/local] 
67AFS does not seem to be running...
68What installation prefix should I use for installing files? (~name ok) [/opt/local] 
69Build Perl for SOCKS? [n] 
70Use the PerlIO abstraction layer? [y] 
71Getting the current patchlevel...
72Build a threading Perl? [n] 
73Build Perl for multiplicity? [n] 
74Use which C compiler? [/usr/bin/gcc-4.0] 
75Checking for GNU cc in disguise and/or its version number...
76Now, how can we feed standard input to your C preprocessor...
77Directories to use for library searches? [/usr/local/lib /opt/local/lib /usr/lib] 
78What is the file extension used for shared libraries? [dylib] 
79Try to use long doubles if available? [n] 
80Checking for optional libraries...
81What libraries to use? [-ldbm -ldl -lm -lutil -lc] 
82What optimizer/debugger flag should be used? [-O3] 
83Any additional cc flags?
84[-fno-common -DPERL_DARWIN -I/opt/local/include -no-cpp-precomp -fno-strict-aliasing -pipe -I/usr/local/include -I/opt/local/include] 
85Let me guess what the preprocessor flags are...
86Any additional ld flags (NOT including libraries)? [-L/opt/local/lib -L/usr/local/lib] 
87Checking your choice of C compiler and flags for coherency...
88Computing filename position in cpp output for #include directives...
89./fieldn: line 2: /sbin/grep: Permission denied
90<stdlib.h> found.
91Checking to see how big your integers are...
92Checking to see if you have long long...
93Checking to see how big your long longs are...
94<inttypes.h> found.
95Checking to see if you have int64_t...
96Checking which 64-bit integer type we could use...
97We could use 'long long' for 64-bit integers.
98Try to use 64-bit integers, if available? [n] 
99Try to use maximal 64-bit support, if available? [n] 
100Checking to see how big your double precision numbers are...
101Checking to see if you have long double...
102Checking to see how big your long doubles are...
103What is your architecture name [darwin] 
104Perlio selected.
105Pathname where the public executables will reside? (~name ok) [/opt/local/bin] 
106Use relocatable @INC? [n] 
107Pathname where the private library files will reside? (~name ok) [/opt/local/lib/perl5/5.8.9] 
108Where do you want to put the public architecture-dependent libraries? (~name ok)
109[/opt/local/lib/perl5/5.8.9/darwin-2level] 
110Other username to test security of setuid scripts with? [none] 
111I'll assume setuid scripts are *not* secure.
112Does your kernel have *secure* setuid scripts? [n] 
113Do you want to do setuid/setgid emulation? [n] 
114Installation prefix to use for add-on modules and utilities? (~name ok) [/opt/local] 
115Pathname for the site-specific library files? (~name ok) [/opt/local/lib/perl5/site_perl/5.8.9] 
116List of earlier versions to include in @INC? [5.8.8 5.8.8/darwin-2level] 
117<malloc.h> NOT found.
118Checking to see how well your C compiler groks the void type...
119Good.  It appears to support void to the level perl5 wants.
120Checking to see how big your pointers are...
121Do you wish to wrap malloc calls to protect against potential overflows? [y] 
122Do you wish to attempt to use the malloc that comes with perl5? [n] 
123Your system wants malloc to return 'void *', it would seem.
124Your system uses void free(), it would seem.
125Pathname for the site-specific architecture-dependent library files? (~name ok)
126[/opt/local/lib/perl5/site_perl/5.8.9/darwin-2level] 
127Do you want to configure vendor-specific add-on directories? [y] 
128Installation prefix to use for vendor-supplied add-ons? (~name ok) [/opt/local] 
129Pathname for the vendor-supplied library files? (~name ok) [/opt/local/lib/perl5/vendor_perl/5.8.9] 
130Pathname for vendor-supplied architecture-dependent files? (~name ok)
131[/opt/local/lib/perl5/vendor_perl/5.8.9/darwin-2level] 
132Colon-separated list of additional directories for perl to search? [none] 
133Checking out function prototypes...
134Install any extra modules (y or n)? [n] 
135Directory for the main Perl5 html pages? (~name ok) [none] 
136Directory for the Perl5 module html pages? (~name ok) [none] 
137Do you want to install perl as /usr/bin/perl? [n] 
138Checking for GNU C Library...
139Shall I use /usr/bin/nm to extract C symbols from the libraries? [y] 
140Where is your C library? [/usr/lib/libc.dylib] 
141Extracting names from the following files for later perusal:
142        /usr/lib/libc.dylib
143        /usr/lib/libdbm.dylib
144        /usr/lib/libdl.dylib
145        /usr/lib/libm.dylib
146        /usr/lib/libutil.dylib
147This may take a while...Configure: line 7478: /sbin/grep: Permission denied
148......Configure: line 7508: /sbin/grep: Permission denied
149........Configure: line 7541: /sbin/grep: Permission denied
150./usr/bin/nm didn't seem to work right. Trying /usr/bin/ar instead...
151ar: /usr/lib/libc.dylib is a fat file (use libtool(1) or lipo(1) and ar(1) on it)
152ar: /usr/lib/libc.dylib: Inappropriate file type or format
153/usr/bin/ar didn't seem to work right.
154Maybe this is a Cray...trying bld instead...
155Configure: line 7575: bld: command not found
156Configure: line 7578: bld: command not found
157ar: /usr/lib/libdbm.dylib is a fat file (use libtool(1) or lipo(1) and ar(1) on it)
158ar: /usr/lib/libdbm.dylib: Inappropriate file type or format
159Configure: line 7578: bld: command not found
160ar: /usr/lib/libdl.dylib is a fat file (use libtool(1) or lipo(1) and ar(1) on it)
161ar: /usr/lib/libdl.dylib: Inappropriate file type or format
162Configure: line 7578: bld: command not found
163ar: /usr/lib/libm.dylib is a fat file (use libtool(1) or lipo(1) and ar(1) on it)
164ar: /usr/lib/libm.dylib: Inappropriate file type or format
165Configure: line 7578: bld: command not found
166ar: /usr/lib/libutil.dylib is a fat file (use libtool(1) or lipo(1) and ar(1) on it)
167ar: /usr/lib/libutil.dylib: Inappropriate file type or format
168Ok.
169./findhdr: line 13: /sbin/grep: Permission denied
170<dld.h> NOT found.
171Checking for C++...
172dlopen() found.
173<unistd.h> found.
174Do you wish to use dynamic loading? [y] 
175Source file to use for dynamic loading [ext/DynaLoader/dl_dlopen.xs] 
176Any special flags to pass to /usr/bin/gcc-4.0 -c to compile shared library modules? [none] 
177What command should be used to create dynamic libraries? [env MACOSX_DEPLOYMENT_TARGET=10.3 /usr/bin/gcc-4.0] 
178Any special flags to pass to env MACOSX_DEPLOYMENT_TARGET=10.3 /usr/bin/gcc-4.0 to create a dynamically loaded library?
179[-L/opt/local/lib -bundle -undefined dynamic_lookup -L/usr/local/lib] 
180Any special flags to pass to /usr/bin/gcc-4.0 to use dynamic linking? [none] 
181Build a shared libperl.dylib (y/n) [n] 
182System manual is in /usr/share/man/man1.
183Where do the main Perl5 manual pages (source) go? (~name ok) [/opt/local/share/man/man1p] 
184What suffix should be used for the main Perl5 man pages? [1pm] 
185You can have filenames longer than 14 characters.
186Where do the perl5 library man pages (source) go? (~name ok) [/opt/local/share/man/man3p] 
187What suffix should be used for the perl5 library man pages? [3pm] 
188Figuring out host name...
189Your host name appears to be "Uttam.local". Right? [y] 
190What is your domain name? [.local] 
191What is your e-mail address? [illuminati@uttam.local] 
192Perl administrator e-mail address [illuminati@uttam.local] 
193Do you want to install only the version-specific parts of perl? [n] 
194What shall I put after the #! to start up perl ("none" to not use #!)? [/opt/local/bin/perl] 
195Where do you keep publicly executable scripts? (~name ok) [/opt/local/bin] 
196Pathname where the add-on public executables should be installed? (~name ok) [/opt/local/bin] 
197Pathname where the site-specific html pages should be installed? (~name ok) [none] 
198Pathname where the site-specific library html pages should be installed? (~name ok) [none] 
199Pathname where the site-specific manual pages should be installed? (~name ok) [/opt/local/share/man/man1] 
200Pathname where the site-specific library manual pages should be installed? (~name ok)
201[/opt/local/share/man/man3] 
202Pathname where add-on public executable scripts should be installed? (~name ok) [/opt/local/bin] 
203Use the "fast stdio" if available? [y] 
204off_t found.
205Checking to see how big your file offsets are...
206fpos_t found.
207Checking the size of fpos_t...
208Pathname for the vendor-supplied executables directory? (~name ok) [/opt/local/bin] 
209Pathname for the vendor-supplied html pages? (~name ok) [none] 
210Pathname for the vendor-supplied html pages? (~name ok) [none] 
211Pathname for the vendor-supplied manual section 1 pages? (~name ok) [/opt/local/share/man/man1] 
212Pathname for the vendor-supplied manual section 3 pages? (~name ok) [/opt/local/share/man/man3] 
213Pathname for the vendor-supplied scripts directory? (~name ok) [/opt/local/bin] 
214Using <string.h> instead of <strings.h>.
215qgcvt() NOT found.
216Checking how to print long doubles...
217gconvert NOT found.
218gcvt() found.
219sprintf() found.
220I'll use sprintf to convert floats into a string.
221fwalk() NOT found.
222access() NOT found.
223accessx() NOT found.
224aintl() NOT found.
225alarm() NOT found.
226<pthread.h> found.
227<sys/types.h> found.
228<sys/select.h> found.
229Testing to see if we should include <time.h>, <sys/time.h> or both.
230We'll include <sys/time.h>.
231Checking to see if your struct tm has tm_zone field...
232Checking to see if your struct tm has tm_gmtoff field...
233asctime_r() NOT found.
234atolf() NOT found.
235atoll() NOT found.
236Checking whether your compiler can handle __attribute__((format)) ...
237Checking whether your compiler allows __printf__ format to be null ...
238Checking whether your compiler can handle __attribute__((malloc)) ...
239Checking whether your compiler can handle __attribute__((nonnull(1))) ...
240Checking whether your compiler can handle __attribute__((noreturn)) ...
241Checking whether your compiler can handle __attribute__((pure)) ...
242Checking whether your compiler can handle __attribute__((unused)) ...
243Checking whether your compiler can handle __attribute__((warn_unused_result)) ...
244bcmp() NOT found.
245bcopy() NOT found.
246getpgrp() NOT found.
247setpgrp() NOT found.
248Checking whether your compiler can handle __builtin_choose_expr ...
249Checking whether your compiler can handle __builtin_expect ...
250bzero() NOT found.
251<stdarg.h> found.
252<varargs.h> found.
253We'll include <stdarg.h> to get va_dcl definition.
254You have <stdarg.h> and <stdlib.h>, so checking for C99 variadic macros.
255You have C99 variadic macros.
256You have void (*signal())().
257Checking whether your C compiler can cast large floats to int32.
258Checking whether your C compiler can cast negative float to unsigned.
259vprintf() NOT found.
260chown() NOT found.
261chroot() NOT found.
262chsize() NOT found.
263class() NOT found.
264clearenv() NOT found.
265Hmm... You don't have Berkeley networking in libc.a...
266or anywhere else I see.
267socketpair() NOT found.
268Checking the availability of certain socket constants...
269<sys/uio.h> found.
270Checking to see if your system supports struct cmsghdr...
271Checking to see if your C compiler knows about "const"...
272copysignl() NOT found.
273crypt() NOT found.
274crypt() NOT found.
275./findhdr: line 13: /sbin/grep: Permission denied
276<crypt.h> NOT found.
277crypt_r() NOT found.
278ctermid() NOT found.
279ctermid_r() NOT found.
280ctime_r() NOT found.
281cuserid() NOT found.
282<limits.h> found.
283<float.h> found.
284DBL_DIG found.
285dbmclose() NOT found.
286difftime() NOT found.
287<dirent.h> found.
288Your directory entries are struct dirent.
289Good, your directory entry keeps length information in d_namlen.
290Checking to see if DIR has a dd_fd member variable
291<sys/dir.h> found.
292./findhdr: line 13: /sbin/grep: Permission denied
293<sys/ndir.h> NOT found.
294dirfd() found.
295dlerror() found.
296<dlfcn.h> found.
297What is the extension of dynamically loaded modules [bundle] 
298Checking whether your dlsym() needs a leading underscore ...
299dlsym doesn't need a leading underscore.
300drand48_r() NOT found.
301dup2() NOT found.
302eaccess() NOT found.
303endgrent() NOT found.
304<grp.h> found.
305endgrent_r() NOT found.
306endhostent() NOT found.
307<netdb.h> found.
308endhostent_r() NOT found.
309endnetent() NOT found.
310endnetent_r() NOT found.
311endprotoent() NOT found.
312endprotoent_r() NOT found.
313endpwent() NOT found.
314<pwd.h> found.
315endpwent_r() NOT found.
316endservent() NOT found.
317endservent_r() NOT found.
318<sys/file.h> defines the O_* constants...
319and you have the 3 argument form of open().
320<sys/file.h> found.
321We'll be including <sys/file.h>.
322<fcntl.h> found.
323We don't need to include <fcntl.h> if we include <sys/file.h>.
324fork() NOT found.
325pipe() NOT found.
326Figuring out the flag used by open() for non-blocking I/O...
327Let's see what value errno gets from read() on a O_NONBLOCK file...
328Checking how std your stdio is...
329Checking to see what happens if we set the stdio ptr...
330Increasing ptr in your stdio leaves cnt unchanged.  Good.
331You seem to have 'fast stdio' to directly manipulate the stdio buffers.
332fchdir() NOT found.
333fchmod() NOT found.
334fchown() NOT found.
335fcntl() NOT found.
336Well, your system knows about the normal fd_set typedef...
337and you have the normal fd_set macros (just as I'd expect).
338fgetpos() NOT found.
339finite() NOT found.
340finitel() NOT found.
341flock() NOT found.
342fp_class() NOT found.
343pathconf() NOT found.
344fpathconf() NOT found.
345fpclass() NOT found.
346fpclassify() NOT found.
347fpclassl() NOT found.
348Checking to see if you have fpos64_t...
349frexpl() NOT found.
350<sys/param.h> found.
351<sys/mount.h> found.
352Checking to see if your system supports struct fs_data...
353fseeko() NOT found.
354fsetpos() NOT found.
355fstatfs() NOT found.
356statvfs() NOT found.
357fstatvfs() NOT found.
358fsync() NOT found.
359ftello() NOT found.
360Checking if you have a working futimes()
361Yes, you have
362getcwd() NOT found.
363getespwnam() NOT found.
364getfsstat() NOT found.
365getgrent() NOT found.
366getgrent_r() NOT found.
367getgrgid_r() NOT found.
368getgrnam_r() NOT found.
369gethostbyaddr() NOT found.
370gethostbyname() NOT found.
371gethostent() NOT found.
372I'll use 'popen("/bin/hostname", "r")' to get your hostname.
373gethostbyaddr_r() NOT found.
374gethostbyname_r() NOT found.
375gethostent_r() NOT found.
376getitimer() NOT found.
377getlogin() NOT found.
378getlogin_r() NOT found.
379getmnt() NOT found.
380getmntent() NOT found.
381getnetbyaddr() NOT found.
382getnetbyname() NOT found.
383getnetent() NOT found.
384getnetbyaddr_r() NOT found.
385getnetbyname_r() NOT found.
386getnetent_r() NOT found.
387getpagesize() NOT found.
388getprotobyname() NOT found.
389getprotobynumber() NOT found.
390getprotoent() NOT found.
391getpgid() NOT found.
392getpgrp2() NOT found.
393getppid() NOT found.
394getpriority() NOT found.
395getprotobyname_r() NOT found.
396getprotobynumber_r() NOT found.
397getprotoent_r() NOT found.
398getprpwnam() NOT found.
399getpwent() NOT found.
400getpwent_r() NOT found.
401getpwnam_r() NOT found.
402getpwuid_r() NOT found.
403getservbyname() NOT found.
404getservbyport() NOT found.
405getservent() NOT found.
406getservbyname_r() NOT found.
407getservbyport_r() NOT found.
408getservent_r() NOT found.
409getspnam() NOT found.
410./findhdr: line 13: /sbin/grep: Permission denied
411<shadow.h> NOT found.
412getspnam_r() NOT found.
413gettimeofday() NOT found.
414ftime() NOT found.
415No ftime() nor gettimeofday() -- timing may be less accurate.
416gmtime_r() NOT found.
417hasmntopt() NOT found.
418<netinet/in.h> found.
419<arpa/inet.h> found.
420htonl() NOT found.
421But it seems to be defined as a macro.
422ilogbl() NOT found.
423No index() or strchr() found!
424inet_aton() NOT found.
425isascii() found.
426isfinite() NOT found.
427isinf() NOT found.
428isnan() NOT found.
429isnanl() NOT found.
430killpg() NOT found.
431lchown() found.
432LDBL_DIG found.
433<math.h> found.
434Checking to see if your libm supports _LIB_VERSION...
435No, it does not (probably harmless)
436link() NOT found.
437localtime_r() NOT found.
438localeconv() NOT found.
439lockf() NOT found.
440lstat() NOT found.
441madvise() NOT found.
442malloc_size() NOT found.
443malloc_good_size() NOT found.
444mblen() NOT found.
445mbstowcs() NOT found.
446mbtowc() NOT found.
447memchr() NOT found.
448memcmp() NOT found.
449memcpy() NOT found.
450memmove() NOT found.
451memset() NOT found.
452mkdir() NOT found.
453mkdtemp() NOT found.
454mkfifo() NOT found.
455mkstemp() NOT found.
456mkstemps() NOT found.
457mktime() NOT found.
458<sys/mman.h> found.
459mmap() NOT found.
460sqrtl() NOT found.
461scalbnl() NOT found.
462modfl() NOT found.
463mprotect() NOT found.
464msgctl() NOT found.
465msgget() NOT found.
466msgsnd() NOT found.
467msgrcv() NOT found.
468You don't have the full msg*(2) library.
469Checking to see if your system supports struct msghdr...
470msync() NOT found.
471munmap() NOT found.
472nice() NOT found.
473<langinfo.h> found.
474nl_langinfo() NOT found.
475Checking to see if your C compiler knows about "volatile"...
476Choosing the C types to be used for Perl's internal types...
477Checking how many bits of your UVs your NVs can preserve...
478Checking whether NV 0.0 is all bits zero in memory...
4790.0 is represented as all bits zero in memory
480Checking to see if you have off64_t...
481pause() NOT found.
482poll() NOT found.
483readlink() NOT found.
484vfork() NOT found.
485pthread_attr_setscope() NOT found.
486random_r() NOT found.
487readdir() NOT found.
488seekdir() NOT found.
489telldir() NOT found.
490rewinddir() NOT found.
491readdir64_r() NOT found.
492readdir_r() NOT found.
493readv() NOT found.
494recvmsg() NOT found.
495rename() NOT found.
496rmdir() NOT found.
497<memory.h> found.
498select() NOT found.
499semctl() NOT found.
500semget() NOT found.
501semop() NOT found.
502You don't have the full sem*(2) library.
503You have union semun in <sys/sem.h>.
504sendmsg() NOT found.
505setegid() NOT found.
506seteuid() NOT found.
507setgrent() NOT found.
508setgrent_r() NOT found.
509sethostent() NOT found.
510sethostent_r() NOT found.
511setitimer() NOT found.
512setlinebuf() NOT found.
513setlocale() NOT found.
514<locale.h> found.
515setlocale_r() NOT found.
516setnetent() NOT found.
517setnetent_r() NOT found.
518setprotoent() NOT found.
519setpgid() NOT found.
520setpgrp2() NOT found.
521setpriority() NOT found.
522setproctitle() NOT found.
523setprotoent_r() NOT found.
524setpwent() NOT found.
525setpwent_r() NOT found.
526setregid() NOT found.
527setresgid() NOT found.
528setreuid() NOT found.
529setresuid() NOT found.
530setrgid() NOT found.
531setruid() NOT found.
532setservent() NOT found.
533setservent_r() NOT found.
534setsid() NOT found.
535setvbuf() NOT found.
536./findhdr: line 13: /sbin/grep: Permission denied
537<sfio.h> NOT found.
538shmctl() NOT found.
539shmget() NOT found.
540shmat() NOT found.
541shmdt() NOT found.
542You don't have the full shm*(2) library.
543sigaction NOT found.
544./findhdr: line 13: /sbin/grep: Permission denied
545<sunmath.h> NOT found.
546Checking to see if you have signbit() available to work on double... Yes.
547sigprocmask() NOT found.
548POSIX sigsetjmp found.
549snprintf() NOT found.
550vsnprintf() NOT found.
551sockatmark() NOT found.
552socks5_init() NOT found.
553Checking whether sprintf returns the length of the string...
554sprintf returns the length of the string (as ANSI says it should)
555srand48_r() NOT found.
556srandom_r() NOT found.
557<sys/stat.h> found.
558Checking to see if your struct stat has st_blocks field...
559./findhdr: line 13: /sbin/grep: Permission denied
560<sys/vfs.h> NOT found.
561./findhdr: line 13: /sbin/grep: Permission denied
562<sys/statfs.h> NOT found.
563Checking to see if your system supports struct statfs...
564Checking to see if your struct statfs has f_flags field...
565Checking how to access stdio streams by file descriptor number...
566I can't figure out how to access stdio streams by file descriptor number.
567strcoll() NOT found.
568Checking to see if your C compiler can copy structs...
569strerror() and sys_errlist[] NOT found.
570strerror_r() NOT found.
571strftime() NOT found.
572strlcat() NOT found.
573strlcpy() NOT found.
574strtod() NOT found.
575strtol() NOT found.
576strtold() NOT found.
577strtoll() NOT found.
578strtoq() NOT found.
579strtoul() NOT found.
580strtoull() NOT found.
581strtouq() NOT found.
582strxfrm() NOT found.
583symlink() NOT found.
584syscall() NOT found.
585sysconf() NOT found.
586system() NOT found.
587tcgetpgrp() NOT found.
588tcsetpgrp() NOT found.
589time() not found, hope that will do.
590<sys/times.h> found.
591times() NOT found, hope that will do.
592tmpnam_r() NOT found.
593truncate() NOT found.
594ttyname_r() NOT found.
595tzname[] NOT found.
596(Testing for character data alignment may crash the test.  That's okay.)
597It seems that you must access character data in an aligned manner.
598ualarm() NOT found.
599umask() NOT found.
600unordered() NOT found.
601unsetenv() NOT found.
602usleep() NOT found.
603ustat() NOT found.
604closedir() NOT found.
605wait4() NOT found.
606waitpid() NOT found.
607wcstombs() NOT found.
608wctomb() NOT found.
609writev() NOT found.
610Checking to see how your cpp does stuff like concatenate tokens...
611Oh!  Smells like ANSI's been here.
612<db.h> found.
613Hmm.  Based on the hints in hints/darwin.sh,
614the recommended value for $i_db on this machine was "undef"!
615    Keep the recommended value? [y] 
616Looking for a random number function...
617Yick, looks like I have to use rand().
618Use which function to generate random numbers? [rand] 
619I cannot find function rand. Use that name anyway? [y] 
620Checking to see how many bits your rand() function produces...
621How many bits does your rand() function produce? [31] 
622Determining whether or not we are on an EBCDIC system...
623Nope, no EBCDIC, probably ASCII or some ISO Latin. Or UTF-8.
624Checking how to flush all pending stdio output...
625Your fflush(NULL) works okay for output streams.
626Let's see if it clobbers input pipes...
627fflush(NULL) seems to behave okay with input streams.
628Checking the size of gid_t...
629Checking the sign of gid_t...
630Checking how to print 64-bit integers...
631Checking the format strings to be used for Perl's internal types...
632Checking the format string to be used for gids...
633getgroups() NOT found.
634setgroups() NOT found.
635Checking if your /usr/bin/make program sets $(MAKE)...
636mode_t found.
637It seems that you don't need va_copy().
638size_t found.
639What pager is used on your system? [/usr/bin/less] 
640pid_t found.
641Checking how to generate random libraries on your machine...
642Generating a list of signal names and numbers...
643Checking the size of size_t...
644Checking to see if you have socklen_t...
645./findhdr: line 13: /sbin/grep: Permission denied
646<socks.h> NOT found.
647I'll be using ssize_t for functions returning a byte count.
648Your stdio uses signed chars.
649Checking the size of uid_t...
650Checking the sign of uid_t...
651Checking the format string to be used for uids...
652Which compiler compiler (yacc or bison -y) shall I use? [yacc] 
653./findhdr: line 13: /sbin/grep: Permission denied
654<fp.h> NOT found.
655./findhdr: line 13: /sbin/grep: Permission denied
656<fp_class.h> NOT found.
657./findhdr: line 13: /sbin/grep: Permission denied
658<gdbm.h> NOT found.
659./findhdr: line 13: /sbin/grep: Permission denied
660<ieeefp.h> NOT found.
661./findhdr: line 13: /sbin/grep: Permission denied
662<libutil.h> NOT found.
663./findhdr: line 13: /sbin/grep: Permission denied
664<mntent.h> NOT found.
665<ndbm.h> found.
666dbm_open() NOT found.
667./findhdr: line 13: /sbin/grep: Permission denied
668<net/errno.h> NOT found.
669<netinet/tcp.h> found.
670<poll.h> found.
671Hmm.  Based on the hints in hints/darwin.sh,
672the recommended value for $i_poll on this machine was "undef"!
673    Keep the recommended value? [y] 
674./findhdr: line 13: /sbin/grep: Permission denied
675<prot.h> NOT found.
676Guessing which symbols your C compiler and preprocessor define...
677tcsetattr() NOT found.
678<sgtty.h> found.
679<stddef.h> found.
680./findhdr: line 13: /sbin/grep: Permission denied
681<sys/access.h> NOT found.
682<sys/filio.h> found.
683<sys/ioctl.h> found.
684You have socket ioctls defined in <sys/sockio.h>.
685<syslog.h> found.
686./findhdr: line 13: /sbin/grep: Permission denied
687<sys/mode.h> NOT found.
688<sys/resource.h> found.
689./findhdr: line 13: /sbin/grep: Permission denied
690<sys/security.h> NOT found.
691<sys/statvfs.h> found.
692<sys/un.h> found.
693<sys/utsname.h> found.
694<sys/wait.h> found.
695./findhdr: line 13: /sbin/grep: Permission denied
696<ustat.h> NOT found.
697<utime.h> found.
698./findhdr: line 13: /sbin/grep: Permission denied
699<values.h> NOT found.
700Looking for extensions...
701What extensions do you wish to load dynamically?
702[B ByteLoader Cwd Data/Dumper Devel/DProf Devel/PPPort Devel/Peek Digest/MD5 Encode Fcntl File/Glob Filter/Util/Call Hash/Util IO List/Util MIME/Base64 Opcode POSIX PerlIO/encoding PerlIO/scalar PerlIO/via SDBM_File Storable Sys/Hostname Text/Soundex Time/HiRes Unicode/Normalize XS/APItest XS/Typemap attrs re threads threads/shared] 
703What extensions do you wish to load statically? [none] 
704Stripping down executable paths...
705Creating config.sh...
706Doing variable substitutions on .SH files...
707Extracting config.h (with variable substitutions)
708Extracting cflags (with variable substitutions)
709Not re-extracting config.h
710Extracting makeaperl (with variable substitutions)
711Extracting makedepend (with variable substitutions)
712Extracting makedir (with variable substitutions)
713Extracting Makefile (with variable substitutions)
714Extracting myconfig (with variable substitutions)
715Extracting pod/Makefile (with variable substitutions)
716Extracting Policy.sh (with variable substitutions)
717Extracting utils/Makefile (with variable substitutions)
718Extracting writemain (with variable substitutions)
719Extracting x2p/cflags (with variable substitutions)
720Extracting x2p/Makefile (with variable substitutions)
721Run make depend now? [y] 
722sh ./makedepend MAKE=make
723sh writemain DynaLoader.o  > perlmain.c
724rm -f opmini.c
725cp op.c opmini.c
726echo  av.c scope.c op.c doop.c doio.c dump.c hv.c mg.c reentr.c perl.c perly.c pp.c pp_hot.c pp_ctl.c pp_sys.c regcomp.c regexec.c utf8.c gv.c sv.c taint.c toke.c util.c deb.c run.c universal.c xsutils.c pad.c globals.c perlio.c perlapi.c numeric.c mathoms.c locale.c pp_pack.c pp_sort.c miniperlmain.c perlmain.c opmini.c | tr ' ' '\n' >.clist
727Finding dependencies for av.o.
728Finding dependencies for scope.o.
729Finding dependencies for op.o.
730Finding dependencies for doop.o.
731Finding dependencies for doio.o.
732Finding dependencies for dump.o.
733Finding dependencies for hv.o.
734Finding dependencies for mg.o.
735Finding dependencies for reentr.o.
736Finding dependencies for perl.o.
737Finding dependencies for perly.o.
738Finding dependencies for pp.o.
739Finding dependencies for pp_hot.o.
740Finding dependencies for pp_ctl.o.
741Finding dependencies for pp_sys.o.
742Finding dependencies for regcomp.o.
743Finding dependencies for regexec.o.
744Finding dependencies for utf8.o.
745Finding dependencies for gv.o.
746Finding dependencies for sv.o.
747Finding dependencies for taint.o.
748Finding dependencies for toke.o.
749Finding dependencies for util.o.
750Finding dependencies for deb.o.
751Finding dependencies for run.o.
752Finding dependencies for universal.o.
753Finding dependencies for xsutils.o.
754Finding dependencies for pad.o.
755Finding dependencies for globals.o.
756Finding dependencies for perlio.o.
757Finding dependencies for perlapi.o.
758Finding dependencies for numeric.o.
759Finding dependencies for mathoms.o.
760Finding dependencies for locale.o.
761Finding dependencies for pp_pack.o.
762Finding dependencies for pp_sort.o.
763Finding dependencies for miniperlmain.o.
764Finding dependencies for perlmain.o.
765Finding dependencies for opmini.o.
766echo Makefile.SH cflags.SH config_h.SH makeaperl.SH makedepend.SH makedir.SH myconfig.SH writemain.SH pod/Makefile.SH | tr ' ' '\n' >.shlist
767Updating GNUmakefile...
768test -s perlmain.c && touch perlmain.c
769cd x2p; make depend
770sh ../makedepend MAKE=make
771echo hash.c  str.c util.c walk.c | tr ' ' '\n' >.clist
772Finding dependencies for hash.o.
773Finding dependencies for str.o.
774Finding dependencies for util.o.
775Finding dependencies for walk.o.
776echo Makefile.SH cflags.SH | tr ' ' '\n' >.shlist
777Updating GNUmakefile...
778Now you must run 'make'.
779
780If you compile perl5 on a different machine or from a different object
781directory, copy the Policy.sh file from this object directory to the
782new one before you run Configure -- this will help you with most of
783the policy defaults.
784
785--->  Building perl5.8
786DEBUG: Executing org.macports.build (perl5.8)
787DEBUG: Environment: MACOSX_DEPLOYMENT_TARGET='10.5'
788DEBUG: Assembled command: 'cd "/opt/local/var/macports/build/_opt_local_var_macports_sources_rsync.macports.org_release_ports_lang_perl5.8/work/perl-5.8.9" && make all'
789`sh  cflags "optimize='-O3'" miniperlmain.o`  miniperlmain.c
790          CCCMD =  /usr/bin/gcc-4.0 -DPERL_CORE -c -fno-common -DPERL_DARWIN -I/opt/local/include -no-cpp-precomp -fno-strict-aliasing -pipe -I/usr/local/include -I/opt/local/include  -std=c89 -O3 -Wall -ansi   -W -Wextra -Wdeclaration-after-statement -Wendif-labels
791`sh  cflags "optimize='-O3'" gv.o`  gv.c
792          CCCMD =  /usr/bin/gcc-4.0 -DPERL_CORE -c -fno-common -DPERL_DARWIN -I/opt/local/include -no-cpp-precomp -fno-strict-aliasing -pipe -I/usr/local/include -I/opt/local/include  -std=c89 -O3 -Wall -ansi   -W -Wextra -Wdeclaration-after-statement -Wendif-labels
793`sh  cflags "optimize='-O3'" toke.o`  toke.c
794          CCCMD =  /usr/bin/gcc-4.0 -DPERL_CORE -c -fno-common -DPERL_DARWIN -I/opt/local/include -no-cpp-precomp -fno-strict-aliasing -pipe -I/usr/local/include -I/opt/local/include  -std=c89 -O3 -Wall -ansi   -W -Wextra -Wdeclaration-after-statement -Wendif-labels
795toke.c: In function 'Perl_yylex':
796toke.c:5516: error: invalid lvalue in unary '&'
797toke.c:5516: error: invalid lvalue in unary '&'
798toke.c: In function 'S_pending_ident':
799toke.c:5755: error: invalid lvalue in unary '&'
800toke.c:5755: error: invalid lvalue in unary '&'
801toke.c: In function 'S_scan_heredoc':
802toke.c:9785: error: invalid operands to binary +
803toke.c:9785: error: invalid lvalue in unary '&'
804toke.c:9785: error: invalid lvalue in unary '&'
805toke.c: In function 'S_scan_formline':
806toke.c:10814: error: invalid operands to binary +
807toke.c:10814: error: invalid lvalue in unary '&'
808toke.c:10814: error: invalid lvalue in unary '&'
809make: *** [toke.o] Error 1
810Error: Target org.macports.build returned: shell command " cd "/opt/local/var/macports/build/_opt_local_var_macports_sources_rsync.macports.org_release_ports_lang_perl5.8/work/perl-5.8.9" && make all " returned error 2
811Command output: `sh  cflags "optimize='-O3'" miniperlmain.o`  miniperlmain.c
812          CCCMD =  /usr/bin/gcc-4.0 -DPERL_CORE -c -fno-common -DPERL_DARWIN -I/opt/local/include -no-cpp-precomp -fno-strict-aliasing -pipe -I/usr/local/include -I/opt/local/include  -std=c89 -O3 -Wall -ansi   -W -Wextra -Wdeclaration-after-statement -Wendif-labels
813`sh  cflags "optimize='-O3'" gv.o`  gv.c
814          CCCMD =  /usr/bin/gcc-4.0 -DPERL_CORE -c -fno-common -DPERL_DARWIN -I/opt/local/include -no-cpp-precomp -fno-strict-aliasing -pipe -I/usr/local/include -I/opt/local/include  -std=c89 -O3 -Wall -ansi   -W -Wextra -Wdeclaration-after-statement -Wendif-labels
815`sh  cflags "optimize='-O3'" toke.o`  toke.c
816          CCCMD =  /usr/bin/gcc-4.0 -DPERL_CORE -c -fno-common -DPERL_DARWIN -I/opt/local/include -no-cpp-precomp -fno-strict-aliasing -pipe -I/usr/local/include -I/opt/local/include  -std=c89 -O3 -Wall -ansi   -W -Wextra -Wdeclaration-after-statement -Wendif-labels
817toke.c: In function 'Perl_yylex':
818toke.c:5516: error: invalid lvalue in unary '&'
819toke.c:5516: error: invalid lvalue in unary '&'
820toke.c: In function 'S_pending_ident':
821toke.c:5755: error: invalid lvalue in unary '&'
822toke.c:5755: error: invalid lvalue in unary '&'
823toke.c: In function 'S_scan_heredoc':
824toke.c:9785: error: invalid operands to binary +
825toke.c:9785: error: invalid lvalue in unary '&'
826toke.c:9785: error: invalid lvalue in unary '&'
827toke.c: In function 'S_scan_formline':
828toke.c:10814: error: invalid operands to binary +
829toke.c:10814: error: invalid lvalue in unary '&'
830toke.c:10814: error: invalid lvalue in unary '&'
831make: *** [toke.o] Error 1
832
833Warning: the following items did not execute (for perl5.8): org.macports.activate org.macports.build org.macports.destroot org.macports.install
834Error: Status 1 encountered during processing.
835