Ticket #22267: totem-failed.txt

File totem-failed.txt, 3.3 KB (added by songzw@…, 11 years ago)
Line 
1$ sudo port install totem
2--->  Computing dependencies for totem
3--->  Building gst-plugins-bad
4Error: Target org.macports.build returned: shell command " cd "/opt/local/var/macports/build/_opt_local_var_macports_sources_rsync.macports.org_release_ports_gnome_gst-plugins-bad/work/gst-plugins-bad-0.10.14" && /usr/bin/make -j2 all " returned error 2
5Command output: osxvideosrc.c:1255: error: dereferencing pointer to incomplete type
6osxvideosrc.c:1255: error: dereferencing pointer to incomplete type
7osxvideosrc.c:1255: error: dereferencing pointer to incomplete type
8osxvideosrc.c:1255: error: dereferencing pointer to incomplete type
9osxvideosrc.c:1257: error: dereferencing pointer to incomplete type
10osxvideosrc.c:1259: warning: implicit declaration of function 'UnlockPixels'
11osxvideosrc.c: In function 'prepare_capture':
12osxvideosrc.c:1269: warning: implicit declaration of function 'SGSetChannelUsage'
13osxvideosrc.c:1269: error: dereferencing pointer to incomplete type
14osxvideosrc.c:1269: error: 'seqGrabRecord' undeclared (first use in this function)
15osxvideosrc.c:1275: warning: implicit declaration of function 'SGSetDataProc'
16osxvideosrc.c:1275: error: dereferencing pointer to incomplete type
17osxvideosrc.c:1275: warning: implicit declaration of function 'NewSGDataUPP'
18osxvideosrc.c:1281: warning: implicit declaration of function 'SGPrepare'
19osxvideosrc.c:1281: error: dereferencing pointer to incomplete type
20make[3]: *** [libgstosxvideosrc_la-osxvideosrc.lo] Error 1
21make[3]: *** Waiting for unfinished jobs....
22In file included from osxvideoplugin.m:31:
23osxvideosrc.h:54: error: syntax error before 'SeqGrabComponent'
24osxvideosrc.h:54: warning: no semicolon at end of struct or union
25osxvideosrc.h:55: warning: type defaults to 'int' in declaration of 'video_chan'
26osxvideosrc.h:55: warning: data definition has no type or storage class
27osxvideosrc.h:58: error: syntax error before 'dec_seq'
28osxvideosrc.h:58: warning: type defaults to 'int' in declaration of 'dec_seq'
29osxvideosrc.h:58: warning: data definition has no type or storage class
30osxvideosrc.h:62: error: syntax error before '}' token
31make[3]: *** [libgstosxvideosrc_la-osxvideoplugin.lo] Error 1
32make[2]: *** [all-recursive] Error 1
33make[1]: *** [all-recursive] Error 1
34make: *** [all] Error 2
35
36Error: The following dependencies failed to build: gst-plugins-bad gst-plugins-good aalib esound audiofile libcaca libcdio libcddb libdv libshout2 speex libsoup gnutls libgcrypt libgpg-error libtasn1 lzo opencdk libproxy python25 xorg-libXmu xorg-libXt xorg-libsm xorg-libice taglib cmake libidn wavpack gst-plugins-ugly a52dec lame libdvdread libdvdcss libid3tag libmad libmpeg2 libsdl xorg-libXv xorg-videoproto twolame x264 yasm nautilus gnome-desktop gnome-themes gnome-icon-theme hicolor-icon-theme icon-naming-utils p5-xml-simple p5-xml-namespacesupport p5-xml-sax gtk-engines2 startup-notification xcb imake xorg-cf-files xorg-libXaw xpm xorg-libxcb xorg-libpthread-stubs xorg-xcb-proto xorg-xcb-util libunique py25-gtk py25-cairo py25-numpy fftw-3 py25-nose py25-setuptools py25-gobject totem-pl-parser evolution-data-server libgnomeui gnome-keyring libbonoboui libbonobo libgnome libgnomecanvas libart_lgpl libgweather libical nss nspr xorg-libXtst xorg-recordproto xorg-libXxf86vm xorg-xf86vidmodeproto
37Error: Status 1 encountered during processing.