Ticket #25621: main.log

File main.log, 7.1 KB (added by dhestand@…, 11 years ago)

log file of build failure during "upgrade outdated"

Line 
1version:1
2:msg:main --->  Computing dependencies for apache20:info:main .:debug:main Searching for dependency: apr0
3:debug:main Found Dependency: receipt exists for apr0
4:debug:main Searching for dependency: apr-util0
5:debug:main Found Dependency: receipt exists for apr-util0
6:debug:main Searching for dependency: expat
7:debug:main Found Dependency: receipt exists for expat
8:debug:main Searching for dependency: openssl
9:debug:main Found Dependency: receipt exists for openssl
10:debug:main Searching for dependency: pcre
11:debug:main Found Dependency: receipt exists for pcre
12:msg:main
13:debug:main Executing org.macports.main (apache20)
14:debug:main Skipping completed org.macports.fetch (apache20)
15:debug:main Skipping completed org.macports.checksum (apache20)
16:debug:main setting option extract.cmd to /usr/bin/bzip2
17:debug:main Skipping completed org.macports.extract (apache20)
18:debug:main Skipping completed org.macports.patch (apache20)
19:debug:main Skipping completed org.macports.configure (apache20)
20:msg:main --->  Building apache20
21:debug:build build phase started at Sat Jul 10 18:47:52 EDT 2010
22:debug:build Executing org.macports.build (apache20)
23:debug:build Environment: CPATH='/opt/local/include' CC_PRINT_OPTIONS_FILE='/opt/local/var/macports/build/_opt_local_var_macports_sources_rsync.macports.org_release_ports_www_apache20/work/.CC_PRINT_OPTIONS' LIBRARY_PATH='/opt/local/lib' CC_PRINT_OPTIONS='YES' MACOSX_DEPLOYMENT_TARGET='10.5'
24:debug:build Assembled command: 'cd "/opt/local/var/macports/build/_opt_local_var_macports_sources_rsync.macports.org_release_ports_www_apache20/work/httpd-2.0.63" && /usr/bin/make all'
25:info:build Making all in srclib
26:info:build Making all in pcre
27:info:build make[3]: Nothing to be done for `local-all'.
28:info:build Making all in os
29:info:build Making all in unix
30:info:build make[3]: Nothing to be done for `local-all'.
31:info:build Making all in server
32:info:build Making all in mpm
33:info:build Making all in prefork
34:info:build make[4]: Nothing to be done for `local-all'.
35:info:build Making all in modules
36:info:build Making all in aaa
37:info:build Making all in cache
38:info:build Making all in experimental
39:info:build Making all in filters
40:info:build Making all in loggers
41:info:build Making all in metadata
42:info:build Making all in proxy
43:info:build Making all in ssl
44:info:build Making all in http
45:info:build make[3]: Nothing to be done for `local-all'.
46:info:build Making all in dav/main
47:info:build Making all in generators
48:info:build Making all in dav/fs
49:info:build Making all in mappers
50:info:build make[3]: Nothing to be done for `local-all'.
51:info:build Making all in support
52:info:build make[2]: Nothing to be done for `local-all'.
53:info:build
54:info:build Building shared: mod_access.la mod_auth.la mod_auth_anon.la mod_auth_dbm.la mod_auth_digest.la
55:info:build make[4]: Nothing to be done for `local-shared-build'.
56:info:build Building shared: mod_file_cache.la
57:info:build make[4]: Nothing to be done for `local-shared-build'.
58:info:build Building shared: mod_cache.la mod_disk_cache.la mod_mem_cache.la
59:info:build make[4]: Nothing to be done for `local-shared-build'.
60:info:build Building shared: mod_ext_filter.la mod_include.la mod_deflate.la
61:info:build make[4]: Nothing to be done for `local-shared-build'.
62:info:build Building shared: mod_log_config.la mod_log_forensic.la
63:info:build make[4]: Nothing to be done for `local-shared-build'.
64:info:build Building shared: mod_env.la mod_mime_magic.la mod_cern_meta.la mod_expires.la mod_headers.la mod_usertrack.la mod_unique_id.la mod_setenvif.la mod_version.la
65:info:build make[4]: Nothing to be done for `local-shared-build'.
66:info:build Building shared: mod_proxy.la mod_proxy_connect.la mod_proxy_ftp.la mod_proxy_http.la
67:info:build make[4]: Nothing to be done for `local-shared-build'.
68:info:build Building shared: mod_ssl.la
69:info:build /opt/local/share/apr-0/build/libtool --silent --mode=compile /usr/bin/gcc-4.0    -O2 -arch i386  -DDARWIN -DSIGPROCMASK_SETS_THREAD_MASK -no-cpp-precomp -DAP_HAVE_DESIGNATED_INITIALIZER -I/opt/local/include  -I/opt/local/include/apr-0 -I/opt/local/include -I. -I/opt/local/var/macports/build/_opt_local_var_macports_sources_rsync.macports.org_release_ports_www_apache20/work/httpd-2.0.63/os/unix -I/opt/local/var/macports/build/_opt_local_var_macports_sources_rsync.macports.org_release_ports_www_apache20/work/httpd-2.0.63/server/mpm/prefork -I/opt/local/var/macports/build/_opt_local_var_macports_sources_rsync.macports.org_release_ports_www_apache20/work/httpd-2.0.63/modules/http -I/opt/local/var/macports/build/_opt_local_var_macports_sources_rsync.macports.org_release_ports_www_apache20/work/httpd-2.0.63/modules/filters -I/opt/local/var/macports/build/_opt_local_var_macports_sources_rsync.macports.org_release_ports_www_apache20/work/httpd-2.0.63/modules/proxy -I/opt/local/var/macports/build/_opt_local_var_macports_sources_rsync.macports.org_release_ports_www_apache20/work/httpd-2.0.63/include -I/opt/local/var/macports/build/_opt_local_var_macports_sources_rsync.macports.org_release_ports_www_apache20/work/httpd-2.0.63/modules/generators -I/opt/local/var/macports/build/_opt_local_var_macports_sources_rsync.macports.org_release_ports_www_apache20/work/httpd-2.0.63/server -I/opt/local/include/openssl -I/opt/local/var/macports/build/_opt_local_var_macports_sources_rsync.macports.org_release_ports_www_apache20/work/httpd-2.0.63/modules/dav/main -prefer-pic -c ssl_engine_init.c && touch ssl_engine_init.slo
70:info:build ssl_engine_init.c: In function 'ssl_init_ctx_protocol':
71:info:build ssl_engine_init.c:391: warning: assignment discards qualifiers from pointer target type
72:info:build ssl_engine_init.c:397: warning: assignment discards qualifiers from pointer target type
73:info:build ssl_engine_init.c: In function 'ssl_init_ctx_verify':
74:info:build ssl_engine_init.c:534: error: 'STACK' undeclared (first use in this function)
75:info:build ssl_engine_init.c:534: error: (Each undeclared identifier is reported only once
76:info:build ssl_engine_init.c:534: error: for each function it appears in.)
77:info:build ssl_engine_init.c:534: error: syntax error before ')' token
78:info:build ssl_engine_init.c: In function 'ssl_init_FindCAList':
79:info:build ssl_engine_init.c:1109: warning: pointer type mismatch in conditional expression
80:info:build make[4]: *** [ssl_engine_init.slo] Error 1
81:info:build make[3]: *** [shared-build-recursive] Error 1
82:info:build make[2]: *** [shared-build-recursive] Error 1
83:info:build make[1]: *** [shared-build-recursive] Error 1
84:info:build make: *** [all-recursive] Error 1
85:info:build shell command " cd "/opt/local/var/macports/build/_opt_local_var_macports_sources_rsync.macports.org_release_ports_www_apache20/work/httpd-2.0.63" && /usr/bin/make all " returned error 2
86:error:build Target org.macports.build returned: shell command failed
87:debug:build Backtrace: shell command failed
88    while executing
89"command_exec build"
90    (procedure "portbuild::build_main" line 8)
91    invoked from within
92"$procedure $targetname"
93:info:build Warning: the following items did not execute (for apache20): org.macports.destroot org.macports.build
94:notice:build Log for apache20 is at: /opt/local/var/macports/logs/_opt_local_var_macports_sources_rsync.macports.org_release_ports_www_apache20/main.log