Ticket #32424: main.log

File main.log, 35.5 KB (added by mojca (Mojca Miklavec), 9 years ago)

log of current clhep build (old version) using macports

Line 
1version:1
2:debug:clean changing euid/egid - current euid: 0 - current egid: 0
3:debug:clean egid changed to: 502
4:debug:clean euid changed to: 503
5:debug:main Executing org.macports.main (clhep)
6:debug:main Privilege de-escalation not attempted as not running as root.
7:debug:main Skipping completed org.macports.archivefetch (clhep)
8:debug:main Privilege de-escalation not attempted as not running as root.
9:debug:main Skipping completed org.macports.fetch (clhep)
10:debug:main Privilege de-escalation not attempted as not running as root.
11:debug:main Skipping completed org.macports.checksum (clhep)
12:debug:main Privilege de-escalation not attempted as not running as root.
13:debug:main Skipping completed org.macports.extract (clhep)
14:debug:main Privilege de-escalation not attempted as not running as root.
15:debug:main Skipping completed org.macports.patch (clhep)
16:debug:main Privilege de-escalation not attempted as not running as root.
17:debug:main Skipping completed org.macports.configure (clhep)
18:debug:main Privilege de-escalation not attempted as not running as root.
19:debug:build build phase started at Mon Dec  5 22:42:50 CET 2011
20:notice:build --->  Building clhep
21:debug:build Executing org.macports.build (clhep)
22:debug:build Environment: CPATH='/opt/local/include' CC_PRINT_OPTIONS_FILE='/opt/local/var/macports/build/_opt_local_var_macports_sources_rsync.macports.org_release_ports_science_clhep/clhep/work/.CC_PRINT_OPTIONS' LIBRARY_PATH='/opt/local/lib' CC_PRINT_OPTIONS='YES' MACOSX_DEPLOYMENT_TARGET='10.7'
23:debug:build Assembled command: 'cd "/opt/local/var/macports/build/_opt_local_var_macports_sources_rsync.macports.org_release_ports_science_clhep/clhep/work/2.0.4.5/CLHEP" && /usr/bin/make -j4 -w all'
24:debug:build Executing command line:  cd "/opt/local/var/macports/build/_opt_local_var_macports_sources_rsync.macports.org_release_ports_science_clhep/clhep/work/2.0.4.5/CLHEP" && /usr/bin/make -j4 -w all
25:info:build make: Entering directory `/opt/local/var/macports/build/_opt_local_var_macports_sources_rsync.macports.org_release_ports_science_clhep/clhep/work/2.0.4.5/CLHEP'
26:info:build Making all in Units
27:info:build make[1]: Entering directory `/opt/local/var/macports/build/_opt_local_var_macports_sources_rsync.macports.org_release_ports_science_clhep/clhep/work/2.0.4.5/CLHEP/Units'
28:info:build Making all in Units
29:info:build make[2]: Entering directory `/opt/local/var/macports/build/_opt_local_var_macports_sources_rsync.macports.org_release_ports_science_clhep/clhep/work/2.0.4.5/CLHEP/Units/Units'
30:info:build /usr/bin/make  all-am
31:info:build make[3]: Entering directory `/opt/local/var/macports/build/_opt_local_var_macports_sources_rsync.macports.org_release_ports_science_clhep/clhep/work/2.0.4.5/CLHEP/Units/Units'
32:info:build make[3]: Nothing to be done for `all-am'.
33:info:build make[3]: Leaving directory `/opt/local/var/macports/build/_opt_local_var_macports_sources_rsync.macports.org_release_ports_science_clhep/clhep/work/2.0.4.5/CLHEP/Units/Units'
34:info:build make[2]: Leaving directory `/opt/local/var/macports/build/_opt_local_var_macports_sources_rsync.macports.org_release_ports_science_clhep/clhep/work/2.0.4.5/CLHEP/Units/Units'
35:info:build Making all in .
36:info:build make[2]: Entering directory `/opt/local/var/macports/build/_opt_local_var_macports_sources_rsync.macports.org_release_ports_science_clhep/clhep/work/2.0.4.5/CLHEP/Units'
37:info:build /opt/local/var/macports/build/_opt_local_var_macports_sources_rsync.macports.org_release_ports_science_clhep/clhep/work/2.0.4.5/CLHEP/Units/autotools/install-sh -d /opt/local/var/macports/build/_opt_local_var_macports_sources_rsync.macports.org_release_ports_science_clhep/clhep/work/2.0.4.5/CLHEP/Units/CLHEP;
38:info:build make[3]: Entering directory `/opt/local/var/macports/build/_opt_local_var_macports_sources_rsync.macports.org_release_ports_science_clhep/clhep/work/2.0.4.5/CLHEP/Units/Units'
39:info:build  install headers in /opt/local/var/macports/build/_opt_local_var_macports_sources_rsync.macports.org_release_ports_science_clhep/clhep/work/2.0.4.5/CLHEP/Units/CLHEP/Units
40:info:build make[3]: Leaving directory `/opt/local/var/macports/build/_opt_local_var_macports_sources_rsync.macports.org_release_ports_science_clhep/clhep/work/2.0.4.5/CLHEP/Units/Units'
41:info:build make[2]: Leaving directory `/opt/local/var/macports/build/_opt_local_var_macports_sources_rsync.macports.org_release_ports_science_clhep/clhep/work/2.0.4.5/CLHEP/Units'
42:info:build Making all in test
43:info:build make[2]: Entering directory `/opt/local/var/macports/build/_opt_local_var_macports_sources_rsync.macports.org_release_ports_science_clhep/clhep/work/2.0.4.5/CLHEP/Units/test'
44:info:build make[2]: Nothing to be done for `all'.
45:info:build make[2]: Leaving directory `/opt/local/var/macports/build/_opt_local_var_macports_sources_rsync.macports.org_release_ports_science_clhep/clhep/work/2.0.4.5/CLHEP/Units/test'
46:info:build make[1]: Leaving directory `/opt/local/var/macports/build/_opt_local_var_macports_sources_rsync.macports.org_release_ports_science_clhep/clhep/work/2.0.4.5/CLHEP/Units'
47:info:build Making all in Vector
48:info:build make[1]: Entering directory `/opt/local/var/macports/build/_opt_local_var_macports_sources_rsync.macports.org_release_ports_science_clhep/clhep/work/2.0.4.5/CLHEP/Vector'
49:info:build Making all in Vector
50:info:build make[2]: Entering directory `/opt/local/var/macports/build/_opt_local_var_macports_sources_rsync.macports.org_release_ports_science_clhep/clhep/work/2.0.4.5/CLHEP/Vector/Vector'
51:info:build /usr/bin/make  all-am
52:info:build make[3]: Entering directory `/opt/local/var/macports/build/_opt_local_var_macports_sources_rsync.macports.org_release_ports_science_clhep/clhep/work/2.0.4.5/CLHEP/Vector/Vector'
53:info:build make[3]: Nothing to be done for `all-am'.
54:info:build make[3]: Leaving directory `/opt/local/var/macports/build/_opt_local_var_macports_sources_rsync.macports.org_release_ports_science_clhep/clhep/work/2.0.4.5/CLHEP/Vector/Vector'
55:info:build make[2]: Leaving directory `/opt/local/var/macports/build/_opt_local_var_macports_sources_rsync.macports.org_release_ports_science_clhep/clhep/work/2.0.4.5/CLHEP/Vector/Vector'
56:info:build Making all in .
57:info:build make[2]: Entering directory `/opt/local/var/macports/build/_opt_local_var_macports_sources_rsync.macports.org_release_ports_science_clhep/clhep/work/2.0.4.5/CLHEP/Vector'
58:info:build /opt/local/var/macports/build/_opt_local_var_macports_sources_rsync.macports.org_release_ports_science_clhep/clhep/work/2.0.4.5/CLHEP/Vector/autotools/install-sh -d /opt/local/var/macports/build/_opt_local_var_macports_sources_rsync.macports.org_release_ports_science_clhep/clhep/work/2.0.4.5/CLHEP/Vector/CLHEP;
59:info:build make[3]: Entering directory `/opt/local/var/macports/build/_opt_local_var_macports_sources_rsync.macports.org_release_ports_science_clhep/clhep/work/2.0.4.5/CLHEP/Vector/Vector'
60:info:build  install headers in /opt/local/var/macports/build/_opt_local_var_macports_sources_rsync.macports.org_release_ports_science_clhep/clhep/work/2.0.4.5/CLHEP/Vector/CLHEP/Vector
61:info:build make[3]: Leaving directory `/opt/local/var/macports/build/_opt_local_var_macports_sources_rsync.macports.org_release_ports_science_clhep/clhep/work/2.0.4.5/CLHEP/Vector/Vector'
62:info:build make[3]: Entering directory `/opt/local/var/macports/build/_opt_local_var_macports_sources_rsync.macports.org_release_ports_science_clhep/clhep/work/2.0.4.5/CLHEP/Units/Units'
63:info:build  install headers in /opt/local/var/macports/build/_opt_local_var_macports_sources_rsync.macports.org_release_ports_science_clhep/clhep/work/2.0.4.5/CLHEP/Vector/CLHEP/Units
64:info:build make[3]: Leaving directory `/opt/local/var/macports/build/_opt_local_var_macports_sources_rsync.macports.org_release_ports_science_clhep/clhep/work/2.0.4.5/CLHEP/Units/Units'
65:info:build make[2]: Leaving directory `/opt/local/var/macports/build/_opt_local_var_macports_sources_rsync.macports.org_release_ports_science_clhep/clhep/work/2.0.4.5/CLHEP/Vector'
66:info:build Making all in src
67:info:build make[2]: Entering directory `/opt/local/var/macports/build/_opt_local_var_macports_sources_rsync.macports.org_release_ports_science_clhep/clhep/work/2.0.4.5/CLHEP/Vector/src'
68:info:build make[2]: Nothing to be done for `all'.
69:info:build make[2]: Leaving directory `/opt/local/var/macports/build/_opt_local_var_macports_sources_rsync.macports.org_release_ports_science_clhep/clhep/work/2.0.4.5/CLHEP/Vector/src'
70:info:build Making all in test
71:info:build make[2]: Entering directory `/opt/local/var/macports/build/_opt_local_var_macports_sources_rsync.macports.org_release_ports_science_clhep/clhep/work/2.0.4.5/CLHEP/Vector/test'
72:info:build make[2]: Nothing to be done for `all'.
73:info:build make[2]: Leaving directory `/opt/local/var/macports/build/_opt_local_var_macports_sources_rsync.macports.org_release_ports_science_clhep/clhep/work/2.0.4.5/CLHEP/Vector/test'
74:info:build make[1]: Leaving directory `/opt/local/var/macports/build/_opt_local_var_macports_sources_rsync.macports.org_release_ports_science_clhep/clhep/work/2.0.4.5/CLHEP/Vector'
75:info:build Making all in Evaluator
76:info:build make[1]: Entering directory `/opt/local/var/macports/build/_opt_local_var_macports_sources_rsync.macports.org_release_ports_science_clhep/clhep/work/2.0.4.5/CLHEP/Evaluator'
77:info:build Making all in Evaluator
78:info:build make[2]: Entering directory `/opt/local/var/macports/build/_opt_local_var_macports_sources_rsync.macports.org_release_ports_science_clhep/clhep/work/2.0.4.5/CLHEP/Evaluator/Evaluator'
79:info:build /usr/bin/make  all-am
80:info:build make[3]: Entering directory `/opt/local/var/macports/build/_opt_local_var_macports_sources_rsync.macports.org_release_ports_science_clhep/clhep/work/2.0.4.5/CLHEP/Evaluator/Evaluator'
81:info:build make[3]: Nothing to be done for `all-am'.
82:info:build make[3]: Leaving directory `/opt/local/var/macports/build/_opt_local_var_macports_sources_rsync.macports.org_release_ports_science_clhep/clhep/work/2.0.4.5/CLHEP/Evaluator/Evaluator'
83:info:build make[2]: Leaving directory `/opt/local/var/macports/build/_opt_local_var_macports_sources_rsync.macports.org_release_ports_science_clhep/clhep/work/2.0.4.5/CLHEP/Evaluator/Evaluator'
84:info:build Making all in .
85:info:build make[2]: Entering directory `/opt/local/var/macports/build/_opt_local_var_macports_sources_rsync.macports.org_release_ports_science_clhep/clhep/work/2.0.4.5/CLHEP/Evaluator'
86:info:build /opt/local/var/macports/build/_opt_local_var_macports_sources_rsync.macports.org_release_ports_science_clhep/clhep/work/2.0.4.5/CLHEP/Evaluator/autotools/install-sh -d /opt/local/var/macports/build/_opt_local_var_macports_sources_rsync.macports.org_release_ports_science_clhep/clhep/work/2.0.4.5/CLHEP/Evaluator/CLHEP;
87:info:build make[3]: Entering directory `/opt/local/var/macports/build/_opt_local_var_macports_sources_rsync.macports.org_release_ports_science_clhep/clhep/work/2.0.4.5/CLHEP/Evaluator/Evaluator'
88:info:build  install headers in /opt/local/var/macports/build/_opt_local_var_macports_sources_rsync.macports.org_release_ports_science_clhep/clhep/work/2.0.4.5/CLHEP/Evaluator/CLHEP/Evaluator
89:info:build make[3]: Leaving directory `/opt/local/var/macports/build/_opt_local_var_macports_sources_rsync.macports.org_release_ports_science_clhep/clhep/work/2.0.4.5/CLHEP/Evaluator/Evaluator'
90:info:build make[2]: Leaving directory `/opt/local/var/macports/build/_opt_local_var_macports_sources_rsync.macports.org_release_ports_science_clhep/clhep/work/2.0.4.5/CLHEP/Evaluator'
91:info:build Making all in src
92:info:build make[2]: Entering directory `/opt/local/var/macports/build/_opt_local_var_macports_sources_rsync.macports.org_release_ports_science_clhep/clhep/work/2.0.4.5/CLHEP/Evaluator/src'
93:info:build make[2]: Nothing to be done for `all'.
94:info:build make[2]: Leaving directory `/opt/local/var/macports/build/_opt_local_var_macports_sources_rsync.macports.org_release_ports_science_clhep/clhep/work/2.0.4.5/CLHEP/Evaluator/src'
95:info:build Making all in test
96:info:build make[2]: Entering directory `/opt/local/var/macports/build/_opt_local_var_macports_sources_rsync.macports.org_release_ports_science_clhep/clhep/work/2.0.4.5/CLHEP/Evaluator/test'
97:info:build make[2]: Nothing to be done for `all'.
98:info:build make[2]: Leaving directory `/opt/local/var/macports/build/_opt_local_var_macports_sources_rsync.macports.org_release_ports_science_clhep/clhep/work/2.0.4.5/CLHEP/Evaluator/test'
99:info:build make[1]: Leaving directory `/opt/local/var/macports/build/_opt_local_var_macports_sources_rsync.macports.org_release_ports_science_clhep/clhep/work/2.0.4.5/CLHEP/Evaluator'
100:info:build Making all in GenericFunctions
101:info:build make[1]: Entering directory `/opt/local/var/macports/build/_opt_local_var_macports_sources_rsync.macports.org_release_ports_science_clhep/clhep/work/2.0.4.5/CLHEP/GenericFunctions'
102:info:build Making all in GenericFunctions
103:info:build make[2]: Entering directory `/opt/local/var/macports/build/_opt_local_var_macports_sources_rsync.macports.org_release_ports_science_clhep/clhep/work/2.0.4.5/CLHEP/GenericFunctions/GenericFunctions'
104:info:build /usr/bin/make  all-am
105:info:build make[3]: Entering directory `/opt/local/var/macports/build/_opt_local_var_macports_sources_rsync.macports.org_release_ports_science_clhep/clhep/work/2.0.4.5/CLHEP/GenericFunctions/GenericFunctions'
106:info:build make[3]: Nothing to be done for `all-am'.
107:info:build make[3]: Leaving directory `/opt/local/var/macports/build/_opt_local_var_macports_sources_rsync.macports.org_release_ports_science_clhep/clhep/work/2.0.4.5/CLHEP/GenericFunctions/GenericFunctions'
108:info:build make[2]: Leaving directory `/opt/local/var/macports/build/_opt_local_var_macports_sources_rsync.macports.org_release_ports_science_clhep/clhep/work/2.0.4.5/CLHEP/GenericFunctions/GenericFunctions'
109:info:build Making all in .
110:info:build make[2]: Entering directory `/opt/local/var/macports/build/_opt_local_var_macports_sources_rsync.macports.org_release_ports_science_clhep/clhep/work/2.0.4.5/CLHEP/GenericFunctions'
111:info:build /opt/local/var/macports/build/_opt_local_var_macports_sources_rsync.macports.org_release_ports_science_clhep/clhep/work/2.0.4.5/CLHEP/GenericFunctions/autotools/install-sh -d /opt/local/var/macports/build/_opt_local_var_macports_sources_rsync.macports.org_release_ports_science_clhep/clhep/work/2.0.4.5/CLHEP/GenericFunctions/CLHEP;
112:info:build make[3]: Entering directory `/opt/local/var/macports/build/_opt_local_var_macports_sources_rsync.macports.org_release_ports_science_clhep/clhep/work/2.0.4.5/CLHEP/GenericFunctions/GenericFunctions'
113:info:build  install headers in /opt/local/var/macports/build/_opt_local_var_macports_sources_rsync.macports.org_release_ports_science_clhep/clhep/work/2.0.4.5/CLHEP/GenericFunctions/CLHEP/GenericFunctions
114:info:build make[3]: Leaving directory `/opt/local/var/macports/build/_opt_local_var_macports_sources_rsync.macports.org_release_ports_science_clhep/clhep/work/2.0.4.5/CLHEP/GenericFunctions/GenericFunctions'
115:info:build make[2]: Leaving directory `/opt/local/var/macports/build/_opt_local_var_macports_sources_rsync.macports.org_release_ports_science_clhep/clhep/work/2.0.4.5/CLHEP/GenericFunctions'
116:info:build Making all in src
117:info:build make[2]: Entering directory `/opt/local/var/macports/build/_opt_local_var_macports_sources_rsync.macports.org_release_ports_science_clhep/clhep/work/2.0.4.5/CLHEP/GenericFunctions/src'
118:info:build make[2]: Nothing to be done for `all'.
119:info:build make[2]: Leaving directory `/opt/local/var/macports/build/_opt_local_var_macports_sources_rsync.macports.org_release_ports_science_clhep/clhep/work/2.0.4.5/CLHEP/GenericFunctions/src'
120:info:build Making all in test
121:info:build make[2]: Entering directory `/opt/local/var/macports/build/_opt_local_var_macports_sources_rsync.macports.org_release_ports_science_clhep/clhep/work/2.0.4.5/CLHEP/GenericFunctions/test'
122:info:build make[2]: Nothing to be done for `all'.
123:info:build make[2]: Leaving directory `/opt/local/var/macports/build/_opt_local_var_macports_sources_rsync.macports.org_release_ports_science_clhep/clhep/work/2.0.4.5/CLHEP/GenericFunctions/test'
124:info:build make[1]: Leaving directory `/opt/local/var/macports/build/_opt_local_var_macports_sources_rsync.macports.org_release_ports_science_clhep/clhep/work/2.0.4.5/CLHEP/GenericFunctions'
125:info:build Making all in Geometry
126:info:build make[1]: Entering directory `/opt/local/var/macports/build/_opt_local_var_macports_sources_rsync.macports.org_release_ports_science_clhep/clhep/work/2.0.4.5/CLHEP/Geometry'
127:info:build Making all in Geometry
128:info:build make[2]: Entering directory `/opt/local/var/macports/build/_opt_local_var_macports_sources_rsync.macports.org_release_ports_science_clhep/clhep/work/2.0.4.5/CLHEP/Geometry/Geometry'
129:info:build /usr/bin/make  all-am
130:info:build make[3]: Entering directory `/opt/local/var/macports/build/_opt_local_var_macports_sources_rsync.macports.org_release_ports_science_clhep/clhep/work/2.0.4.5/CLHEP/Geometry/Geometry'
131:info:build make[3]: Nothing to be done for `all-am'.
132:info:build make[3]: Leaving directory `/opt/local/var/macports/build/_opt_local_var_macports_sources_rsync.macports.org_release_ports_science_clhep/clhep/work/2.0.4.5/CLHEP/Geometry/Geometry'
133:info:build make[2]: Leaving directory `/opt/local/var/macports/build/_opt_local_var_macports_sources_rsync.macports.org_release_ports_science_clhep/clhep/work/2.0.4.5/CLHEP/Geometry/Geometry'
134:info:build Making all in .
135:info:build make[2]: Entering directory `/opt/local/var/macports/build/_opt_local_var_macports_sources_rsync.macports.org_release_ports_science_clhep/clhep/work/2.0.4.5/CLHEP/Geometry'
136:info:build /opt/local/var/macports/build/_opt_local_var_macports_sources_rsync.macports.org_release_ports_science_clhep/clhep/work/2.0.4.5/CLHEP/Geometry/autotools/install-sh -d /opt/local/var/macports/build/_opt_local_var_macports_sources_rsync.macports.org_release_ports_science_clhep/clhep/work/2.0.4.5/CLHEP/Geometry/CLHEP;
137:info:build make[3]: Entering directory `/opt/local/var/macports/build/_opt_local_var_macports_sources_rsync.macports.org_release_ports_science_clhep/clhep/work/2.0.4.5/CLHEP/Geometry/Geometry'
138:info:build  install headers in /opt/local/var/macports/build/_opt_local_var_macports_sources_rsync.macports.org_release_ports_science_clhep/clhep/work/2.0.4.5/CLHEP/Geometry/CLHEP/Geometry
139:info:build make[3]: Leaving directory `/opt/local/var/macports/build/_opt_local_var_macports_sources_rsync.macports.org_release_ports_science_clhep/clhep/work/2.0.4.5/CLHEP/Geometry/Geometry'
140:info:build make[3]: Entering directory `/opt/local/var/macports/build/_opt_local_var_macports_sources_rsync.macports.org_release_ports_science_clhep/clhep/work/2.0.4.5/CLHEP/Vector/Vector'
141:info:build  install headers in /opt/local/var/macports/build/_opt_local_var_macports_sources_rsync.macports.org_release_ports_science_clhep/clhep/work/2.0.4.5/CLHEP/Geometry/CLHEP/Vector
142:info:build make[3]: Leaving directory `/opt/local/var/macports/build/_opt_local_var_macports_sources_rsync.macports.org_release_ports_science_clhep/clhep/work/2.0.4.5/CLHEP/Vector/Vector'
143:info:build make[3]: Entering directory `/opt/local/var/macports/build/_opt_local_var_macports_sources_rsync.macports.org_release_ports_science_clhep/clhep/work/2.0.4.5/CLHEP/Units/Units'
144:info:build  install headers in /opt/local/var/macports/build/_opt_local_var_macports_sources_rsync.macports.org_release_ports_science_clhep/clhep/work/2.0.4.5/CLHEP/Geometry/CLHEP/Units
145:info:build make[3]: Leaving directory `/opt/local/var/macports/build/_opt_local_var_macports_sources_rsync.macports.org_release_ports_science_clhep/clhep/work/2.0.4.5/CLHEP/Units/Units'
146:info:build make[2]: Leaving directory `/opt/local/var/macports/build/_opt_local_var_macports_sources_rsync.macports.org_release_ports_science_clhep/clhep/work/2.0.4.5/CLHEP/Geometry'
147:info:build Making all in src
148:info:build make[2]: Entering directory `/opt/local/var/macports/build/_opt_local_var_macports_sources_rsync.macports.org_release_ports_science_clhep/clhep/work/2.0.4.5/CLHEP/Geometry/src'
149:info:build make[2]: Nothing to be done for `all'.
150:info:build make[2]: Leaving directory `/opt/local/var/macports/build/_opt_local_var_macports_sources_rsync.macports.org_release_ports_science_clhep/clhep/work/2.0.4.5/CLHEP/Geometry/src'
151:info:build Making all in test
152:info:build make[2]: Entering directory `/opt/local/var/macports/build/_opt_local_var_macports_sources_rsync.macports.org_release_ports_science_clhep/clhep/work/2.0.4.5/CLHEP/Geometry/test'
153:info:build make[2]: Nothing to be done for `all'.
154:info:build make[2]: Leaving directory `/opt/local/var/macports/build/_opt_local_var_macports_sources_rsync.macports.org_release_ports_science_clhep/clhep/work/2.0.4.5/CLHEP/Geometry/test'
155:info:build make[1]: Leaving directory `/opt/local/var/macports/build/_opt_local_var_macports_sources_rsync.macports.org_release_ports_science_clhep/clhep/work/2.0.4.5/CLHEP/Geometry'
156:info:build Making all in Random
157:info:build make[1]: Entering directory `/opt/local/var/macports/build/_opt_local_var_macports_sources_rsync.macports.org_release_ports_science_clhep/clhep/work/2.0.4.5/CLHEP/Random'
158:info:build Making all in Random
159:info:build make[2]: Entering directory `/opt/local/var/macports/build/_opt_local_var_macports_sources_rsync.macports.org_release_ports_science_clhep/clhep/work/2.0.4.5/CLHEP/Random/Random'
160:info:build /usr/bin/make  all-am
161:info:build make[3]: Entering directory `/opt/local/var/macports/build/_opt_local_var_macports_sources_rsync.macports.org_release_ports_science_clhep/clhep/work/2.0.4.5/CLHEP/Random/Random'
162:info:build make[3]: Nothing to be done for `all-am'.
163:info:build make[3]: Leaving directory `/opt/local/var/macports/build/_opt_local_var_macports_sources_rsync.macports.org_release_ports_science_clhep/clhep/work/2.0.4.5/CLHEP/Random/Random'
164:info:build make[2]: Leaving directory `/opt/local/var/macports/build/_opt_local_var_macports_sources_rsync.macports.org_release_ports_science_clhep/clhep/work/2.0.4.5/CLHEP/Random/Random'
165:info:build Making all in .
166:info:build make[2]: Entering directory `/opt/local/var/macports/build/_opt_local_var_macports_sources_rsync.macports.org_release_ports_science_clhep/clhep/work/2.0.4.5/CLHEP/Random'
167:info:build /opt/local/var/macports/build/_opt_local_var_macports_sources_rsync.macports.org_release_ports_science_clhep/clhep/work/2.0.4.5/CLHEP/Random/autotools/install-sh -d /opt/local/var/macports/build/_opt_local_var_macports_sources_rsync.macports.org_release_ports_science_clhep/clhep/work/2.0.4.5/CLHEP/Random/CLHEP;
168:info:build make[3]: Entering directory `/opt/local/var/macports/build/_opt_local_var_macports_sources_rsync.macports.org_release_ports_science_clhep/clhep/work/2.0.4.5/CLHEP/Random/Random'
169:info:build  install headers in /opt/local/var/macports/build/_opt_local_var_macports_sources_rsync.macports.org_release_ports_science_clhep/clhep/work/2.0.4.5/CLHEP/Random/CLHEP/Random
170:info:build make[3]: Leaving directory `/opt/local/var/macports/build/_opt_local_var_macports_sources_rsync.macports.org_release_ports_science_clhep/clhep/work/2.0.4.5/CLHEP/Random/Random'
171:info:build make[3]: Entering directory `/opt/local/var/macports/build/_opt_local_var_macports_sources_rsync.macports.org_release_ports_science_clhep/clhep/work/2.0.4.5/CLHEP/Units/Units'
172:info:build  install headers in /opt/local/var/macports/build/_opt_local_var_macports_sources_rsync.macports.org_release_ports_science_clhep/clhep/work/2.0.4.5/CLHEP/Random/CLHEP/Units
173:info:build make[3]: Leaving directory `/opt/local/var/macports/build/_opt_local_var_macports_sources_rsync.macports.org_release_ports_science_clhep/clhep/work/2.0.4.5/CLHEP/Units/Units'
174:info:build make[2]: Leaving directory `/opt/local/var/macports/build/_opt_local_var_macports_sources_rsync.macports.org_release_ports_science_clhep/clhep/work/2.0.4.5/CLHEP/Random'
175:info:build Making all in src
176:info:build make[2]: Entering directory `/opt/local/var/macports/build/_opt_local_var_macports_sources_rsync.macports.org_release_ports_science_clhep/clhep/work/2.0.4.5/CLHEP/Random/src'
177:info:build if /Developer/usr/bin/clang++ -DHAVE_CONFIG_H -I. -I. -I../Random -I.. -I..  -I/opt/local/include -O -ansi -pedantic -Wall -D_GNU_SOURCE -pipe -O2 -arch x86_64 -MT TripleRand.o -MD -MP -MF ".deps/TripleRand.Tpo" -c -o TripleRand.o TripleRand.cc; \
178:info:build     then mv -f ".deps/TripleRand.Tpo" ".deps/TripleRand.Po"; else rm -f ".deps/TripleRand.Tpo"; exit 1; fi
179:info:build /Developer/usr/bin/clang++ -DHAVE_CONFIG_H -I. -I. -I../Random -I.. -I..  -I/opt/local/include -O -ansi -pedantic -Wall -D_GNU_SOURCE -pipe -O2 -arch x86_64  -c -o shared/EngineFactory.o EngineFactory.cc
180:info:build /Developer/usr/bin/clang++ -DHAVE_CONFIG_H -I. -I. -I../Random -I.. -I..  -I/opt/local/include -O -ansi -pedantic -Wall -D_GNU_SOURCE -pipe -O2 -arch x86_64  -c -o shared/engineIDulong.o engineIDulong.cc
181:info:build /Developer/usr/bin/clang++ -DHAVE_CONFIG_H -I. -I. -I../Random -I.. -I..  -I/opt/local/include -O -ansi -pedantic -Wall -D_GNU_SOURCE -pipe -O2 -arch x86_64  -c -o shared/erfQ.o erfQ.cc
182:info:build /Developer/usr/bin/clang++ -DHAVE_CONFIG_H -I. -I. -I../Random -I.. -I..  -I/opt/local/include -O -ansi -pedantic -Wall -D_GNU_SOURCE -pipe -O2 -arch x86_64  -c -o shared/flatToGaussian.o flatToGaussian.cc
183:info:build /Developer/usr/bin/clang++ -DHAVE_CONFIG_H -I. -I. -I../Random -I.. -I..  -I/opt/local/include -O -ansi -pedantic -Wall -D_GNU_SOURCE -pipe -O2 -arch x86_64  -c -o shared/gammln.o gammln.cc
184:info:build /Developer/usr/bin/clang++ -DHAVE_CONFIG_H -I. -I. -I../Random -I.. -I..  -I/opt/local/include -O -ansi -pedantic -Wall -D_GNU_SOURCE -pipe -O2 -arch x86_64  -c -o shared/Hurd160Engine.o Hurd160Engine.cc
185:info:build TripleRand.cc:227:34: error: use of overloaded operator '^' is ambiguous (with operand types 'unsigned int' and 'CLHEP::Hurd288Engine')
186:info:build     ( ( integerCong ^ tausworthe ^ hurd ) * twoToMinus_32
187:info:build         ~~~~~~~~~~~~~~~~~~~~~~~~ ^ ~~~~
188:info:build TripleRand.cc:227:34: note: because of ambiguity in conversion of 'CLHEP::Hurd288Engine' to 'int'
189:info:build ../CLHEP/Random/Hurd288Engine.h:78:3: note: candidate function
190:info:build   operator float();      // flat value, without worrying about filling bits
191:info:build   ^
192:info:build ../CLHEP/Random/Hurd288Engine.h:79:3: note: candidate function
193:info:build   operator unsigned int();  // 32-bit flat value, quickest of all
194:info:build   ^
195:info:build ../CLHEP/Random/RandomEngine.h:120:11: note: candidate function
196:info:build   virtual operator double();        // Returns same as flat()
197:info:build           ^
198:info:build TripleRand.cc:227:34: note: built-in candidate operator^(unsigned int, int)
199:info:build     ( ( integerCong ^ tausworthe ^ hurd ) * twoToMinus_32
200:info:build                                  ^
201:info:build TripleRand.cc:227:34: note: built-in candidate operator^(unsigned int, long)
202:info:build TripleRand.cc:227:34: note: built-in candidate operator^(unsigned int, long long)
203:info:build TripleRand.cc:227:34: note: built-in candidate operator^(unsigned int, unsigned int)
204:info:build TripleRand.cc:227:34: note: built-in candidate operator^(unsigned int, unsigned long)
205:info:build TripleRand.cc:227:34: note: built-in candidate operator^(unsigned int, unsigned long long)
206:info:build TripleRand.cc:227:34: note: built-in candidate operator^(unsigned long, int)
207:info:build TripleRand.cc:227:34: note: built-in candidate operator^(unsigned long, long)
208:info:build TripleRand.cc:227:34: note: built-in candidate operator^(unsigned long, long long)
209:info:build TripleRand.cc:227:34: note: built-in candidate operator^(unsigned long, unsigned int)
210:info:build TripleRand.cc:227:34: note: built-in candidate operator^(unsigned long, unsigned long)
211:info:build TripleRand.cc:227:34: note: built-in candidate operator^(unsigned long, unsigned long long)
212:info:build TripleRand.cc:227:34: note: built-in candidate operator^(unsigned long long, int)
213:info:build TripleRand.cc:227:34: note: built-in candidate operator^(unsigned long long, long)
214:info:build TripleRand.cc:227:34: note: built-in candidate operator^(unsigned long long, long long)
215:info:build TripleRand.cc:227:34: note: built-in candidate operator^(unsigned long long, unsigned int)
216:info:build TripleRand.cc:227:34: note: built-in candidate operator^(unsigned long long, unsigned long)
217:info:build TripleRand.cc:227:34: note: built-in candidate operator^(unsigned long long, unsigned long long)
218:info:build TripleRand.cc:227:34: note: built-in candidate operator^(int, int)
219:info:build TripleRand.cc:227:34: note: built-in candidate operator^(int, long)
220:info:build TripleRand.cc:227:34: note: built-in candidate operator^(int, long long)
221:info:build TripleRand.cc:227:34: note: built-in candidate operator^(int, unsigned int)
222:info:build TripleRand.cc:227:34: note: built-in candidate operator^(int, unsigned long)
223:info:build TripleRand.cc:227:34: note: built-in candidate operator^(int, unsigned long long)
224:info:build TripleRand.cc:227:34: note: built-in candidate operator^(long, int)
225:info:build TripleRand.cc:227:34: note: built-in candidate operator^(long, long)
226:info:build TripleRand.cc:227:34: note: built-in candidate operator^(long, long long)
227:info:build TripleRand.cc:227:34: note: built-in candidate operator^(long, unsigned int)
228:info:build TripleRand.cc:227:34: note: built-in candidate operator^(long, unsigned long)
229:info:build TripleRand.cc:227:34: note: built-in candidate operator^(long, unsigned long long)
230:info:build TripleRand.cc:227:34: note: built-in candidate operator^(long long, int)
231:info:build TripleRand.cc:227:34: note: built-in candidate operator^(long long, long)
232:info:build TripleRand.cc:227:34: note: built-in candidate operator^(long long, long long)
233:info:build TripleRand.cc:227:34: note: built-in candidate operator^(long long, unsigned int)
234:info:build TripleRand.cc:227:34: note: built-in candidate operator^(long long, unsigned long)
235:info:build TripleRand.cc:227:34: note: built-in candidate operator^(long long, unsigned long long)
236:info:build TripleRand.cc:233:35: error: use of overloaded operator '^' is ambiguous (with operand types 'unsigned int' and 'CLHEP::Hurd288Engine')
237:info:build   return integerCong ^ tausworthe ^ hurd;
238:info:build          ~~~~~~~~~~~~~~~~~~~~~~~~ ^ ~~~~
239:info:build TripleRand.cc:233:35: note: because of ambiguity in conversion of 'CLHEP::Hurd288Engine' to 'int'
240:info:build ../CLHEP/Random/Hurd288Engine.h:78:3: note: candidate function
241:info:build   operator float();      // flat value, without worrying about filling bits
242:info:build   ^
243:info:build ../CLHEP/Random/Hurd288Engine.h:79:3: note: candidate function
244:info:build   operator unsigned int();  // 32-bit flat value, quickest of all
245:info:build   ^
246:info:build ../CLHEP/Random/RandomEngine.h:120:11: note: candidate function
247:info:build   virtual operator double();        // Returns same as flat()
248:info:build           ^
249:info:build TripleRand.cc:233:35: note: built-in candidate operator^(unsigned int, int)
250:info:build   return integerCong ^ tausworthe ^ hurd;
251:info:build                                   ^
252:info:build TripleRand.cc:233:35: note: built-in candidate operator^(unsigned int, long)
253:info:build TripleRand.cc:233:35: note: built-in candidate operator^(unsigned int, long long)
254:info:build TripleRand.cc:233:35: note: built-in candidate operator^(unsigned int, unsigned int)
255:info:build TripleRand.cc:233:35: note: built-in candidate operator^(unsigned int, unsigned long)
256:info:build TripleRand.cc:233:35: note: built-in candidate operator^(unsigned int, unsigned long long)
257:info:build TripleRand.cc:233:35: note: built-in candidate operator^(unsigned long, int)
258:info:build TripleRand.cc:233:35: note: built-in candidate operator^(unsigned long, long)
259:info:build TripleRand.cc:233:35: note: built-in candidate operator^(unsigned long, long long)
260:info:build TripleRand.cc:233:35: note: built-in candidate operator^(unsigned long, unsigned int)
261:info:build TripleRand.cc:233:35: note: built-in candidate operator^(unsigned long, unsigned long)
262:info:build TripleRand.cc:233:35: note: built-in candidate operator^(unsigned long, unsigned long long)
263:info:build TripleRand.cc:233:35: note: built-in candidate operator^(unsigned long long, int)
264:info:build TripleRand.cc:233:35: note: built-in candidate operator^(unsigned long long, long)
265:info:build TripleRand.cc:233:35: note: built-in candidate operator^(unsigned long long, long long)
266:info:build TripleRand.cc:233:35: note: built-in candidate operator^(unsigned long long, unsigned int)
267:info:build TripleRand.cc:233:35: note: built-in candidate operator^(unsigned long long, unsigned long)
268:info:build TripleRand.cc:233:35: note: built-in candidate operator^(unsigned long long, unsigned long long)
269:info:build TripleRand.cc:233:35: note: built-in candidate operator^(int, int)
270:info:build TripleRand.cc:233:35: note: built-in candidate operator^(int, long)
271:info:build TripleRand.cc:233:35: note: built-in candidate operator^(int, long long)
272:info:build TripleRand.cc:233:35: note: built-in candidate operator^(int, unsigned int)
273:info:build TripleRand.cc:233:35: note: built-in candidate operator^(int, unsigned long)
274:info:build TripleRand.cc:233:35: note: built-in candidate operator^(int, unsigned long long)
275:info:build TripleRand.cc:233:35: note: built-in candidate operator^(long, int)
276:info:build TripleRand.cc:233:35: note: built-in candidate operator^(long, long)
277:info:build TripleRand.cc:233:35: note: built-in candidate operator^(long, long long)
278:info:build TripleRand.cc:233:35: note: built-in candidate operator^(long, unsigned int)
279:info:build TripleRand.cc:233:35: note: built-in candidate operator^(long, unsigned long)
280:info:build TripleRand.cc:233:35: note: built-in candidate operator^(long, unsigned long long)
281:info:build TripleRand.cc:233:35: note: built-in candidate operator^(long long, int)
282:info:build TripleRand.cc:233:35: note: built-in candidate operator^(long long, long)
283:info:build TripleRand.cc:233:35: note: built-in candidate operator^(long long, long long)
284:info:build TripleRand.cc:233:35: note: built-in candidate operator^(long long, unsigned int)
285:info:build TripleRand.cc:233:35: note: built-in candidate operator^(long long, unsigned long)
286:info:build TripleRand.cc:233:35: note: built-in candidate operator^(long long, unsigned long long)
287:info:build 2 errors generated.
288:info:build make[2]: *** [TripleRand.o] Error 1
289:info:build make[2]: *** Waiting for unfinished jobs....
290:info:build make[2]: Leaving directory `/opt/local/var/macports/build/_opt_local_var_macports_sources_rsync.macports.org_release_ports_science_clhep/clhep/work/2.0.4.5/CLHEP/Random/src'
291:info:build make[1]: *** [all-recursive] Error 1
292:info:build make[1]: Leaving directory `/opt/local/var/macports/build/_opt_local_var_macports_sources_rsync.macports.org_release_ports_science_clhep/clhep/work/2.0.4.5/CLHEP/Random'
293:info:build make: *** [all-recursive] Error 1
294:info:build make: Leaving directory `/opt/local/var/macports/build/_opt_local_var_macports_sources_rsync.macports.org_release_ports_science_clhep/clhep/work/2.0.4.5/CLHEP'
295:info:build shell command " cd "/opt/local/var/macports/build/_opt_local_var_macports_sources_rsync.macports.org_release_ports_science_clhep/clhep/work/2.0.4.5/CLHEP" && /usr/bin/make -j4 -w all " returned error 2
296:error:build Target org.macports.build returned: shell command failed (see log for details)
297:debug:build Backtrace: shell command failed (see log for details)
298    while executing
299"command_exec build"
300    (procedure "portbuild::build_main" line 8)
301    invoked from within
302"$procedure $targetname"
303:info:build Warning: the following items did not execute (for clhep): org.macports.activate org.macports.build org.macports.destroot org.macports.install
304:error:build Failed to install clhep
305:debug:build Registry error: xercesc3 not registered as installed & active.
306    invoked from within
307"registry_active ${subport}"
308    invoked from within
309"$workername eval registry_active \${subport}"
310:notice:build Log for clhep is at: /opt/local/var/macports/logs/_opt_local_var_macports_sources_rsync.macports.org_release_ports_science_clhep/clhep/main.log