Ticket #32723: main.log

File main.log, 11.5 KB (added by wanliqunn@…, 7 years ago)

ports error log

Line 
1version:1
2:debug:main epoch: in tree: 0 installed: 0
3:debug:main zlib 1.2.5_0 exists in the ports tree
4:debug:main zlib 1.2.5_0  is the latest installed
5:debug:main zlib 1.2.5_0  is active
6:debug:main Merging existing variants '' into variants
7:debug:main new fully merged portvariants:
8:debug:main Changing to port directory: /opt/local/var/macports/sources/rsync.macports.org/release/tarballs/ports/archivers/zlib
9:debug:main OS darwin/10.8.0 (Mac OS X 10.6) arch i386
10:debug:main org.macports.load registered provides 'load', a pre-existing procedure. Target override will not be provided
11:debug:main org.macports.unload registered provides 'unload', a pre-existing procedure. Target override will not be provided
12:debug:main org.macports.distfiles registered provides 'distfiles', a pre-existing procedure. Target override will not be provided
13:debug:main Using group file /opt/local/var/macports/sources/rsync.macports.org/release/tarballs/ports/_resources/port1.0/group/xcodeversion-1.0.tcl
14:debug:main adding the default universal variant
15:debug:main Reading variant descriptions from /opt/local/var/macports/sources/rsync.macports.org/release/tarballs/ports/_resources/port1.0/variant_descriptions.conf
16:debug:main No need to upgrade! zlib 1.2.5_0 >= zlib 1.2.5_0
17:debug:main epoch: in tree: 1 installed: 1
18:debug:main openssl 1.0.0e_1 exists in the ports tree
19:debug:main openssl 1.0.0e_1  is the latest installed
20:debug:main openssl 1.0.0e_1  is active
21:debug:main Merging existing variants '' into variants
22:debug:main new fully merged portvariants:
23:debug:main Changing to port directory: /opt/local/var/macports/sources/rsync.macports.org/release/tarballs/ports/devel/openssl
24:debug:main OS darwin/10.8.0 (Mac OS X 10.6) arch i386
25:debug:main org.macports.load registered provides 'load', a pre-existing procedure. Target override will not be provided
26:debug:main org.macports.unload registered provides 'unload', a pre-existing procedure. Target override will not be provided
27:debug:main org.macports.distfiles registered provides 'distfiles', a pre-existing procedure. Target override will not be provided
28:debug:main Using group file /opt/local/var/macports/sources/rsync.macports.org/release/tarballs/ports/_resources/port1.0/group/muniversal-1.0.tcl
29:debug:main Reading variant descriptions from /opt/local/var/macports/sources/rsync.macports.org/release/tarballs/ports/_resources/port1.0/variant_descriptions.conf
30:debug:main universal variant already exists, so not adding the default one
31:debug:main No need to upgrade! openssl 1.0.0e_1 >= openssl 1.0.0e_1
32:debug:main epoch: in tree: 0 installed: 0
33:debug:main readline 6.2.000_0 exists in the ports tree
34:debug:main readline 6.2.000_0  is the latest installed
35:debug:main readline 6.2.000_0  is active
36:debug:main Merging existing variants '' into variants
37:debug:main new fully merged portvariants:
38:debug:main Changing to port directory: /opt/local/var/macports/sources/rsync.macports.org/release/tarballs/ports/devel/readline
39:debug:main OS darwin/10.8.0 (Mac OS X 10.6) arch i386
40:debug:main org.macports.load registered provides 'load', a pre-existing procedure. Target override will not be provided
41:debug:main org.macports.unload registered provides 'unload', a pre-existing procedure. Target override will not be provided
42:debug:main org.macports.distfiles registered provides 'distfiles', a pre-existing procedure. Target override will not be provided
43:debug:main Using group file /opt/local/var/macports/sources/rsync.macports.org/release/tarballs/ports/_resources/port1.0/group/muniversal-1.0.tcl
44:debug:main Reading variant descriptions from /opt/local/var/macports/sources/rsync.macports.org/release/tarballs/ports/_resources/port1.0/variant_descriptions.conf
45:debug:main universal variant already exists, so not adding the default one
46:debug:main No need to upgrade! readline 6.2.000_0 >= readline 6.2.000_0
47:debug:main epoch: in tree: 0 installed: 0
48:debug:main ncurses 5.9_1 exists in the ports tree
49:debug:main ncurses 5.9_1  is the latest installed
50:debug:main ncurses 5.9_1  is active
51:debug:main Merging existing variants '' into variants
52:debug:main new fully merged portvariants:
53:debug:main Changing to port directory: /opt/local/var/macports/sources/rsync.macports.org/release/tarballs/ports/devel/ncurses
54:debug:main OS darwin/10.8.0 (Mac OS X 10.6) arch i386
55:debug:main org.macports.load registered provides 'load', a pre-existing procedure. Target override will not be provided
56:debug:main org.macports.unload registered provides 'unload', a pre-existing procedure. Target override will not be provided
57:debug:main org.macports.distfiles registered provides 'distfiles', a pre-existing procedure. Target override will not be provided
58:debug:main adding the default universal variant
59:debug:main Reading variant descriptions from /opt/local/var/macports/sources/rsync.macports.org/release/tarballs/ports/_resources/port1.0/variant_descriptions.conf
60:debug:main No need to upgrade! ncurses 5.9_1 >= ncurses 5.9_1
61:msg:main --->  Computing dependencies for mysql5-devel:info:main .:debug:main Checking for conflicts against mysql5-devel
62:debug:main Searching for dependency: mysql5
63:debug:main Didn't find receipt, going to depspec regex for: mysql5
64:debug:main Searching for dependency: mysql4
65:debug:main Didn't find receipt, going to depspec regex for: mysql4
66:debug:main Searching for dependency: mariadb
67:debug:main Didn't find receipt, going to depspec regex for: mariadb
68:debug:main Searching for dependency: zlib
69:debug:main Found Dependency: receipt exists for zlib
70:debug:main Searching for dependency: openssl
71:debug:main Found Dependency: receipt exists for openssl
72:debug:main Searching for dependency: readline
73:debug:main Found Dependency: receipt exists for readline
74:msg:main
75:debug:main Executing org.macports.main (mysql5-devel)
76:debug:main changing euid/egid - current euid: 0 - current egid: 0
77:debug:main egid changed to: 501
78:debug:main euid changed to: 502
79:debug:main Skipping completed org.macports.archivefetch (mysql5-devel)
80:debug:main Privilege de-escalation not attempted as not running as root.
81:debug:main Skipping completed org.macports.fetch (mysql5-devel)
82:debug:main Privilege de-escalation not attempted as not running as root.
83:debug:main Skipping completed org.macports.checksum (mysql5-devel)
84:debug:main Privilege de-escalation not attempted as not running as root.
85:debug:main Skipping completed org.macports.extract (mysql5-devel)
86:debug:main Privilege de-escalation not attempted as not running as root.
87:debug:main Skipping completed org.macports.patch (mysql5-devel)
88:debug:main Privilege de-escalation not attempted as not running as root.
89:debug:main Skipping completed org.macports.configure (mysql5-devel)
90:debug:main Privilege de-escalation not attempted as not running as root.
91:debug:build build phase started at Mon Jan  2 13:15:27 CST 2012
92:notice:build --->  Building mysql5-devel
93:debug:build Executing org.macports.build (mysql5-devel)
94:debug:build Environment: CPATH='/opt/local/include' CC_PRINT_OPTIONS_FILE='/opt/local/var/macports/build/_opt_local_var_macports_sources_rsync.macports.org_release_tarballs_ports_databases_mysql5-devel/mysql5-devel/work/.CC_PRINT_OPTIONS' LIBRARY_PATH='/opt/local/lib' CC_PRINT_OPTIONS='YES' MACOSX_DEPLOYMENT_TARGET='10.6'
95:debug:build Assembled command: 'cd "/opt/local/var/macports/build/_opt_local_var_macports_sources_rsync.macports.org_release_tarballs_ports_databases_mysql5-devel/mysql5-devel/work/mysql-5.5.2-m2" && /usr/bin/make -j4 -w all'
96:debug:build Executing command line:  cd "/opt/local/var/macports/build/_opt_local_var_macports_sources_rsync.macports.org_release_tarballs_ports_databases_mysql5-devel/mysql5-devel/work/mysql-5.5.2-m2" && /usr/bin/make -j4 -w all
97:info:build make: Entering directory `/opt/local/var/macports/build/_opt_local_var_macports_sources_rsync.macports.org_release_tarballs_ports_databases_mysql5-devel/mysql5-devel/work/mysql-5.5.2-m2'
98:info:build Making all in .
99:info:build make[1]: Entering directory `/opt/local/var/macports/build/_opt_local_var_macports_sources_rsync.macports.org_release_tarballs_ports_databases_mysql5-devel/mysql5-devel/work/mysql-5.5.2-m2'
100:info:build /usr/bin/make abi_headers="include/mysql/plugin.h include/mysql.h" do_abi_check
101:info:build make[2]: Entering directory `/opt/local/var/macports/build/_opt_local_var_macports_sources_rsync.macports.org_release_tarballs_ports_databases_mysql5-devel/mysql5-devel/work/mysql-5.5.2-m2'
102:info:build set -ex; \
103:info:build     for file in include/mysql/plugin.h include/mysql.h; do \
104:info:build              /Developer/usr/bin/clang -E -nostdinc -dI \
105:info:build                       -I./include \
106:info:build                       -I./include/mysql \
107:info:build                       -I./sql \
108:info:build                       -I./include \
109:info:build                       -I./include/mysql \
110:info:build                       -I./sql \
111:info:build                                      $file 2>/dev/null | \
112:info:build                       /opt/local/bin/gsed -e '/^# /d' \
113:info:build                                 -e '/^[     ]*$/d' \
114:info:build                                 -e '/^#pragma GCC set_debug_pwd/d' \
115:info:build                                 -e '/^#ident/d' > \
116:info:build                                            ./abi_check.out; \
117:info:build                       /usr/bin/diff -w $file.pp ./abi_check.out; \
118:info:build                       /bin/rm ./abi_check.out; \
119:info:build     done
120:info:build + for file in include/mysql/plugin.h include/mysql.h
121:info:build + /Developer/usr/bin/clang -E -nostdinc -dI -I./include -I./include/mysql -I./sql -I./include -I./include/mysql -I./sql include/mysql/plugin.h
122:info:build + /opt/local/bin/gsed -e '/^# /d' -e '/^[   ]*$/d' -e '/^#pragma GCC set_debug_pwd/d' -e '/^#ident/d'
123:info:build + /usr/bin/diff -w include/mysql/plugin.h.pp ./abi_check.out
124:info:build 1,4d0
125:info:build < #include <mysql/services.h>
126:info:build < #include <mysql/service_my_snprintf.h>
127:info:build < #include <stdarg.h>
128:info:build < #include <stdlib.h>
129:info:build 11,12d6
130:info:build < #include <mysql/service_thd_alloc.h>
131:info:build < #include <stdlib.h>
132:info:build make[2]: *** [do_abi_check] Error 1
133:info:build make[2]: Leaving directory `/opt/local/var/macports/build/_opt_local_var_macports_sources_rsync.macports.org_release_tarballs_ports_databases_mysql5-devel/mysql5-devel/work/mysql-5.5.2-m2'
134:info:build make[1]: *** [abi_check] Error 2
135:info:build make[1]: Leaving directory `/opt/local/var/macports/build/_opt_local_var_macports_sources_rsync.macports.org_release_tarballs_ports_databases_mysql5-devel/mysql5-devel/work/mysql-5.5.2-m2'
136:info:build make: *** [all-recursive] Error 1
137:info:build make: Leaving directory `/opt/local/var/macports/build/_opt_local_var_macports_sources_rsync.macports.org_release_tarballs_ports_databases_mysql5-devel/mysql5-devel/work/mysql-5.5.2-m2'
138:info:build shell command " cd "/opt/local/var/macports/build/_opt_local_var_macports_sources_rsync.macports.org_release_tarballs_ports_databases_mysql5-devel/mysql5-devel/work/mysql-5.5.2-m2" && /usr/bin/make -j4 -w all " returned error 2
139:error:build Target org.macports.build returned: shell command failed (see log for details)
140:debug:build Backtrace: shell command failed (see log for details)
141    while executing
142"command_exec build"
143    (procedure "portbuild::build_main" line 8)
144    invoked from within
145"$procedure $targetname"
146:info:build Warning: the following items did not execute (for mysql5-devel): org.macports.activate org.macports.build org.macports.destroot org.macports.install
147:notice:build Log for mysql5-devel is at: /opt/local/var/macports/logs/_opt_local_var_macports_sources_rsync.macports.org_release_tarballs_ports_databases_mysql5-devel/mysql5-devel/main.log