Ticket #34886: main.log

File main.log, 41.6 KB (added by yanokwa@…, 8 years ago)
Line 
1version:1
2:debug:main epoch: in tree: 0 installed: 0
3:debug:main pkgconfig 0.26_1 exists in the ports tree
4:debug:main pkgconfig 0.26_1  is the latest installed
5:debug:main pkgconfig 0.26_1  is active
6:debug:main Merging existing variants '' into variants
7:debug:main new fully merged portvariants:
8:debug:main Changing to port directory: /opt/local/var/macports/sources/rsync.macports.org/release/ports/devel/pkgconfig
9:debug:main OS darwin/11.4.0 (Mac OS X 10.7) arch i386
10:debug:main org.macports.load registered provides 'load', a pre-existing procedure. Target override will not be provided
11:debug:main org.macports.unload registered provides 'unload', a pre-existing procedure. Target override will not be provided
12:debug:main org.macports.distfiles registered provides 'distfiles', a pre-existing procedure. Target override will not be provided
13:debug:main adding the default universal variant
14:debug:main Reading variant descriptions from /opt/local/var/macports/sources/rsync.macports.org/release/ports/_resources/port1.0/variant_descriptions.conf
15:debug:main No need to upgrade! pkgconfig 0.26_1 >= pkgconfig 0.26_1
16:debug:main epoch: in tree: 0 installed: 0
17:debug:main glib2 2.32.3_1 exists in the ports tree
18:debug:main glib2 2.32.3_1  is the latest installed
19:debug:main glib2 2.32.3_1  is active
20:debug:main Merging existing variants '' into variants
21:debug:main new fully merged portvariants:
22:debug:main Changing to port directory: /opt/local/var/macports/sources/rsync.macports.org/release/ports/devel/glib2
23:debug:main OS darwin/11.4.0 (Mac OS X 10.7) arch i386
24:debug:main org.macports.load registered provides 'load', a pre-existing procedure. Target override will not be provided
25:debug:main org.macports.unload registered provides 'unload', a pre-existing procedure. Target override will not be provided
26:debug:main org.macports.distfiles registered provides 'distfiles', a pre-existing procedure. Target override will not be provided
27:debug:main Using group file /opt/local/var/macports/sources/rsync.macports.org/release/ports/_resources/port1.0/group/archcheck-1.0.tcl
28:debug:main adding the default universal variant
29:debug:main Reading variant descriptions from /opt/local/var/macports/sources/rsync.macports.org/release/ports/_resources/port1.0/variant_descriptions.conf
30:debug:main No need to upgrade! glib2 2.32.3_1 >= glib2 2.32.3_1
31:debug:main epoch: in tree: 0 installed: 0
32:debug:main gettext 0.18.1.1_2 exists in the ports tree
33:debug:main gettext 0.18.1.1_2  is the latest installed
34:debug:main gettext 0.18.1.1_2  is active
35:debug:main Merging existing variants '' into variants
36:debug:main new fully merged portvariants:
37:debug:main Changing to port directory: /opt/local/var/macports/sources/rsync.macports.org/release/ports/devel/gettext
38:debug:main OS darwin/11.4.0 (Mac OS X 10.7) arch i386
39:debug:main org.macports.load registered provides 'load', a pre-existing procedure. Target override will not be provided
40:debug:main org.macports.unload registered provides 'unload', a pre-existing procedure. Target override will not be provided
41:debug:main org.macports.distfiles registered provides 'distfiles', a pre-existing procedure. Target override will not be provided
42:debug:main Using group file /opt/local/var/macports/sources/rsync.macports.org/release/ports/_resources/port1.0/group/muniversal-1.0.tcl
43:debug:main Reading variant descriptions from /opt/local/var/macports/sources/rsync.macports.org/release/ports/_resources/port1.0/variant_descriptions.conf
44:debug:main Using group file /opt/local/var/macports/sources/rsync.macports.org/release/ports/_resources/port1.0/group/archcheck-1.0.tcl
45:debug:main universal variant already exists, so not adding the default one
46:debug:main No need to upgrade! gettext 0.18.1.1_2 >= gettext 0.18.1.1_2
47:debug:main epoch: in tree: 0 installed: 0
48:debug:main libiconv 1.14_0 exists in the ports tree
49:debug:main libiconv 1.14_0  is the latest installed
50:debug:main libiconv 1.14_0  is active
51:debug:main Merging existing variants '' into variants
52:debug:main new fully merged portvariants:
53:debug:main Changing to port directory: /opt/local/var/macports/sources/rsync.macports.org/release/ports/textproc/libiconv
54:debug:main OS darwin/11.4.0 (Mac OS X 10.7) arch i386
55:debug:main org.macports.load registered provides 'load', a pre-existing procedure. Target override will not be provided
56:debug:main org.macports.unload registered provides 'unload', a pre-existing procedure. Target override will not be provided
57:debug:main org.macports.distfiles registered provides 'distfiles', a pre-existing procedure. Target override will not be provided
58:debug:main Using group file /opt/local/var/macports/sources/rsync.macports.org/release/ports/_resources/port1.0/group/muniversal-1.0.tcl
59:debug:main Reading variant descriptions from /opt/local/var/macports/sources/rsync.macports.org/release/ports/_resources/port1.0/variant_descriptions.conf
60:debug:main universal variant already exists, so not adding the default one
61:debug:main No need to upgrade! libiconv 1.14_0 >= libiconv 1.14_0
62:debug:main epoch: in tree: 0 installed: 0
63:debug:main ncurses 5.9_1 exists in the ports tree
64:debug:main ncurses 5.9_1  is the latest installed
65:debug:main ncurses 5.9_1  is active
66:debug:main Merging existing variants '' into variants
67:debug:main new fully merged portvariants:
68:debug:main Changing to port directory: /opt/local/var/macports/sources/rsync.macports.org/release/ports/devel/ncurses
69:debug:main OS darwin/11.4.0 (Mac OS X 10.7) arch i386
70:debug:main org.macports.load registered provides 'load', a pre-existing procedure. Target override will not be provided
71:debug:main org.macports.unload registered provides 'unload', a pre-existing procedure. Target override will not be provided
72:debug:main org.macports.distfiles registered provides 'distfiles', a pre-existing procedure. Target override will not be provided
73:debug:main adding the default universal variant
74:debug:main Reading variant descriptions from /opt/local/var/macports/sources/rsync.macports.org/release/ports/_resources/port1.0/variant_descriptions.conf
75:debug:main No need to upgrade! ncurses 5.9_1 >= ncurses 5.9_1
76:debug:main epoch: in tree: 0 installed: 0
77:debug:main expat 2.1.0_0 exists in the ports tree
78:debug:main expat 2.1.0_0  is the latest installed
79:debug:main expat 2.1.0_0  is active
80:debug:main Merging existing variants '' into variants
81:debug:main new fully merged portvariants:
82:debug:main Changing to port directory: /opt/local/var/macports/sources/rsync.macports.org/release/ports/textproc/expat
83:debug:main OS darwin/11.4.0 (Mac OS X 10.7) arch i386
84:debug:main org.macports.load registered provides 'load', a pre-existing procedure. Target override will not be provided
85:debug:main org.macports.unload registered provides 'unload', a pre-existing procedure. Target override will not be provided
86:debug:main org.macports.distfiles registered provides 'distfiles', a pre-existing procedure. Target override will not be provided
87:debug:main adding the default universal variant
88:debug:main Reading variant descriptions from /opt/local/var/macports/sources/rsync.macports.org/release/ports/_resources/port1.0/variant_descriptions.conf
89:debug:main No need to upgrade! expat 2.1.0_0 >= expat 2.1.0_0
90:debug:main epoch: in tree: 0 installed: 0
91:debug:main zlib 1.2.7_0 exists in the ports tree
92:debug:main zlib 1.2.7_0  is the latest installed
93:debug:main zlib 1.2.7_0  is active
94:debug:main Merging existing variants '' into variants
95:debug:main new fully merged portvariants:
96:debug:main Changing to port directory: /opt/local/var/macports/sources/rsync.macports.org/release/ports/archivers/zlib
97:debug:main OS darwin/11.4.0 (Mac OS X 10.7) arch i386
98:debug:main org.macports.load registered provides 'load', a pre-existing procedure. Target override will not be provided
99:debug:main org.macports.unload registered provides 'unload', a pre-existing procedure. Target override will not be provided
100:debug:main org.macports.distfiles registered provides 'distfiles', a pre-existing procedure. Target override will not be provided
101:debug:main Using group file /opt/local/var/macports/sources/rsync.macports.org/release/ports/_resources/port1.0/group/xcodeversion-1.0.tcl
102:debug:main adding the default universal variant
103:debug:main Reading variant descriptions from /opt/local/var/macports/sources/rsync.macports.org/release/ports/_resources/port1.0/variant_descriptions.conf
104:debug:main No need to upgrade! zlib 1.2.7_0 >= zlib 1.2.7_0
105:debug:main epoch: in tree: 0 installed: 0
106:debug:main libffi 3.0.11_0 exists in the ports tree
107:debug:main libffi 3.0.11_0  is the latest installed
108:debug:main libffi 3.0.11_0  is active
109:debug:main Merging existing variants '' into variants
110:debug:main new fully merged portvariants:
111:debug:main Changing to port directory: /opt/local/var/macports/sources/rsync.macports.org/release/ports/devel/libffi
112:debug:main OS darwin/11.4.0 (Mac OS X 10.7) arch i386
113:debug:main org.macports.load registered provides 'load', a pre-existing procedure. Target override will not be provided
114:debug:main org.macports.unload registered provides 'unload', a pre-existing procedure. Target override will not be provided
115:debug:main org.macports.distfiles registered provides 'distfiles', a pre-existing procedure. Target override will not be provided
116:debug:main Using group file /opt/local/var/macports/sources/rsync.macports.org/release/ports/_resources/port1.0/group/muniversal-1.0.tcl
117:debug:main Reading variant descriptions from /opt/local/var/macports/sources/rsync.macports.org/release/ports/_resources/port1.0/variant_descriptions.conf
118:debug:main universal variant already exists, so not adding the default one
119:debug:main No need to upgrade! libffi 3.0.11_0 >= libffi 3.0.11_0
120:debug:main epoch: in tree: 0 installed: 0
121:debug:main libxml2 2.7.8_0 exists in the ports tree
122:debug:main libxml2 2.7.8_2  is the latest installed
123:debug:main libxml2 2.7.8_2  is active
124:debug:main Merging existing variants '' into variants
125:debug:main new fully merged portvariants:
126:debug:main Changing to port directory: /opt/local/var/macports/sources/rsync.macports.org/release/ports/textproc/libxml2
127:debug:main OS darwin/11.4.0 (Mac OS X 10.7) arch i386
128:debug:main org.macports.load registered provides 'load', a pre-existing procedure. Target override will not be provided
129:debug:main org.macports.unload registered provides 'unload', a pre-existing procedure. Target override will not be provided
130:debug:main org.macports.distfiles registered provides 'distfiles', a pre-existing procedure. Target override will not be provided
131:debug:main adding the default universal variant
132:debug:main Reading variant descriptions from /opt/local/var/macports/sources/rsync.macports.org/release/ports/_resources/port1.0/variant_descriptions.conf
133:debug:main No need to upgrade! libxml2 2.7.8_2 >= libxml2 2.7.8_0
134:debug:main epoch: in tree: 0 installed: 0
135:debug:main perl5 5.12.4_0 exists in the ports tree
136:debug:main perl5 5.12.4_0 +perl5_12 is the latest installed
137:debug:main perl5 5.12.4_0 +perl5_12 is active
138:debug:main Merging existing variants '+perl5_12' into variants
139:debug:main new fully merged portvariants: perl5_12 +
140:debug:main Changing to port directory: /opt/local/var/macports/sources/rsync.macports.org/release/ports/lang/perl5
141:debug:main OS darwin/11.4.0 (Mac OS X 10.7) arch i386
142:debug:main org.macports.load registered provides 'load', a pre-existing procedure. Target override will not be provided
143:debug:main org.macports.unload registered provides 'unload', a pre-existing procedure. Target override will not be provided
144:debug:main org.macports.distfiles registered provides 'distfiles', a pre-existing procedure. Target override will not be provided
145:debug:main universal_variant is false, so not adding the default universal variant
146:debug:main Executing variant perl5_12 provides perl5_12
147:debug:main No need to upgrade! perl5 5.12.4_0 >= perl5 5.12.4_0
148:debug:main epoch: in tree: 0 installed: 0
149:debug:main perl5.12 5.12.4_0 exists in the ports tree
150:debug:main perl5.12 5.12.4_0  is the latest installed
151:debug:main perl5.12 5.12.4_0  is active
152:debug:main Merging existing variants '' into variants
153:debug:main new fully merged portvariants:
154:debug:main Changing to port directory: /opt/local/var/macports/sources/rsync.macports.org/release/ports/lang/perl5.12
155:debug:main OS darwin/11.4.0 (Mac OS X 10.7) arch i386
156:debug:main org.macports.load registered provides 'load', a pre-existing procedure. Target override will not be provided
157:debug:main org.macports.unload registered provides 'unload', a pre-existing procedure. Target override will not be provided
158:debug:main org.macports.distfiles registered provides 'distfiles', a pre-existing procedure. Target override will not be provided
159:debug:main adding the default universal variant
160:debug:main Reading variant descriptions from /opt/local/var/macports/sources/rsync.macports.org/release/ports/_resources/port1.0/variant_descriptions.conf
161:debug:main No need to upgrade! perl5.12 5.12.4_0 >= perl5.12 5.12.4_0
162:debug:main epoch: in tree: 0 installed: 0
163:debug:main gdbm 1.10_1 exists in the ports tree
164:debug:main gdbm 1.10_1  is the latest installed
165:debug:main gdbm 1.10_1  is active
166:debug:main Merging existing variants '' into variants
167:debug:main new fully merged portvariants:
168:debug:main Changing to port directory: /opt/local/var/macports/sources/rsync.macports.org/release/ports/databases/gdbm
169:debug:main OS darwin/11.4.0 (Mac OS X 10.7) arch i386
170:debug:main org.macports.load registered provides 'load', a pre-existing procedure. Target override will not be provided
171:debug:main org.macports.unload registered provides 'unload', a pre-existing procedure. Target override will not be provided
172:debug:main org.macports.distfiles registered provides 'distfiles', a pre-existing procedure. Target override will not be provided
173:debug:main adding the default universal variant
174:debug:main Reading variant descriptions from /opt/local/var/macports/sources/rsync.macports.org/release/ports/_resources/port1.0/variant_descriptions.conf
175:debug:main No need to upgrade! gdbm 1.10_1 >= gdbm 1.10_1
176:debug:main epoch: in tree: 0 installed: 0
177:debug:main gmime 2.4.23_0 exists in the ports tree
178:debug:main gmime 2.4.23_0  is the latest installed
179:debug:main gmime 2.4.23_0  is active
180:debug:main Merging existing variants '' into variants
181:debug:main new fully merged portvariants:
182:debug:main Changing to port directory: /opt/local/var/macports/sources/rsync.macports.org/release/ports/mail/gmime
183:debug:main OS darwin/11.4.0 (Mac OS X 10.7) arch i386
184:debug:main org.macports.load registered provides 'load', a pre-existing procedure. Target override will not be provided
185:debug:main org.macports.unload registered provides 'unload', a pre-existing procedure. Target override will not be provided
186:debug:main org.macports.distfiles registered provides 'distfiles', a pre-existing procedure. Target override will not be provided
187:debug:main adding the default universal variant
188:debug:main Reading variant descriptions from /opt/local/var/macports/sources/rsync.macports.org/release/ports/_resources/port1.0/variant_descriptions.conf
189:debug:main No need to upgrade! gmime 2.4.23_0 >= gmime 2.4.23_0
190:debug:main epoch: in tree: 0 installed: 0
191:debug:main xapian-core 1.2.8_0 exists in the ports tree
192:debug:main xapian-core 1.2.8_0  is the latest installed
193:debug:main xapian-core 1.2.8_0  is active
194:debug:main Merging existing variants '' into variants
195:debug:main new fully merged portvariants:
196:debug:main Changing to port directory: /opt/local/var/macports/sources/rsync.macports.org/release/ports/devel/xapian-core
197:debug:main OS darwin/11.4.0 (Mac OS X 10.7) arch i386
198:debug:main org.macports.load registered provides 'load', a pre-existing procedure. Target override will not be provided
199:debug:main org.macports.unload registered provides 'unload', a pre-existing procedure. Target override will not be provided
200:debug:main org.macports.distfiles registered provides 'distfiles', a pre-existing procedure. Target override will not be provided
201:debug:main adding the default universal variant
202:debug:main Reading variant descriptions from /opt/local/var/macports/sources/rsync.macports.org/release/ports/_resources/port1.0/variant_descriptions.conf
203:debug:main No need to upgrade! xapian-core 1.2.8_0 >= xapian-core 1.2.8_0
204:msg:main --->  Computing dependencies for mu:info:main .:debug:main mu has no conflicts
205:debug:main Searching for dependency: pkgconfig
206:debug:main Found Dependency: receipt exists for pkgconfig
207:debug:main Searching for dependency: gmime
208:debug:main Found Dependency: receipt exists for gmime
209:debug:main Searching for dependency: xapian-core
210:debug:main Found Dependency: receipt exists for xapian-core
211:msg:main
212:debug:main Executing org.macports.main (mu)
213:debug:archivefetch archivefetch phase started at Sat Jun 16 09:29:53 PDT 2012
214:msg:archivefetch --->  Fetching archive for mu
215:debug:archivefetch Executing org.macports.archivefetch (mu)
216:info:archivefetch --->  mu-0.9.8.4_0.darwin_11.x86_64.tbz2 doesn't seem to exist in /opt/local/var/macports/incoming/verified
217:msg:archivefetch --->  Attempting to fetch mu-0.9.8.4_0.darwin_11.x86_64.tbz2 from http://packages.macports.org/mu
218:debug:archivefetch Fetching archive failed:: The requested URL returned error: 404
219:debug:fetch fetch phase started at Sat Jun 16 09:29:54 PDT 2012
220:notice:fetch --->  Fetching distfiles for mu
221:debug:fetch Executing org.macports.fetch (mu)
222:debug:checksum checksum phase started at Sat Jun 16 09:29:54 PDT 2012
223:notice:checksum --->  Verifying checksum(s) for mu
224:debug:checksum Executing org.macports.checksum (mu)
225:info:checksum --->  Checksumming mu-0.9.8.4.tar.gz
226:debug:checksum Correct (sha1) checksum for mu-0.9.8.4.tar.gz
227:debug:checksum Correct (rmd160) checksum for mu-0.9.8.4.tar.gz
228:debug:extract extract phase started at Sat Jun 16 09:29:54 PDT 2012
229:notice:extract --->  Extracting mu
230:debug:extract Executing org.macports.extract (mu)
231:info:extract --->  Extracting mu-0.9.8.4.tar.gz
232:debug:extract setting option extract.args to '/opt/local/var/macports/distfiles/mu/mu-0.9.8.4.tar.gz'
233:debug:extract Environment: CPATH='/opt/local/include' CC_PRINT_OPTIONS_FILE='/opt/local/var/macports/build/_opt_local_var_macports_sources_rsync.macports.org_release_ports_mail_mu/mu/work/.CC_PRINT_OPTIONS' LIBRARY_PATH='/opt/local/lib' CC_PRINT_OPTIONS='YES' MACOSX_DEPLOYMENT_TARGET='10.7'
234:debug:extract Assembled command: 'cd "/opt/local/var/macports/build/_opt_local_var_macports_sources_rsync.macports.org_release_ports_mail_mu/mu/work" && /usr/bin/gzip -dc '/opt/local/var/macports/distfiles/mu/mu-0.9.8.4.tar.gz' | /usr/bin/gnutar --no-same-owner -xf -'
235:debug:extract Executing command line:  cd "/opt/local/var/macports/build/_opt_local_var_macports_sources_rsync.macports.org_release_ports_mail_mu/mu/work" && /usr/bin/gzip -dc '/opt/local/var/macports/distfiles/mu/mu-0.9.8.4.tar.gz' | /usr/bin/gnutar --no-same-owner -xf -
236:debug:patch patch phase started at Sat Jun 16 09:29:54 PDT 2012
237:debug:patch Executing org.macports.patch (mu)
238:debug:configure configure phase started at Sat Jun 16 09:29:54 PDT 2012
239:notice:configure --->  Configuring mu
240:debug:configure Using compiler 'Mac OS X clang'
241:debug:configure Executing org.macports.configure (mu)
242:debug:configure Environment: CPATH='/opt/local/include' CFLAGS='-O2 -arch x86_64' CPPFLAGS='-I/opt/local/include' CXXFLAGS='-O2 -arch x86_64' LIBRARY_PATH='/opt/local/lib' MACOSX_DEPLOYMENT_TARGET='10.7' CXX='/usr/bin/clang++' CC_PRINT_OPTIONS_FILE='/opt/local/var/macports/build/_opt_local_var_macports_sources_rsync.macports.org_release_ports_mail_mu/mu/work/.CC_PRINT_OPTIONS' F90FLAGS='-O2 -m64' LDFLAGS='-L/opt/local/lib -arch x86_64' OBJC='/usr/bin/clang' FCFLAGS='-O2 -m64' INSTALL='/usr/bin/install -c' OBJCFLAGS='-O2 -arch x86_64' FFLAGS='-O2 -m64' CC_PRINT_OPTIONS='YES' CC='/usr/bin/clang'
243:debug:configure Assembled command: 'cd "/opt/local/var/macports/build/_opt_local_var_macports_sources_rsync.macports.org_release_ports_mail_mu/mu/work/mu-0.9.8.4" && ./configure --prefix=/opt/local --with-gui=none'
244:debug:configure Executing command line:  cd "/opt/local/var/macports/build/_opt_local_var_macports_sources_rsync.macports.org_release_ports_mail_mu/mu/work/mu-0.9.8.4" && ./configure --prefix=/opt/local --with-gui=none
245:info:configure checking for a BSD-compatible install... /usr/bin/install -c
246:info:configure checking whether build environment is sane... yes
247:info:configure checking for a thread-safe mkdir -p... ./install-sh -c -d
248:info:configure checking for gawk... no
249:info:configure checking for mawk... no
250:info:configure checking for nawk... no
251:info:configure checking for awk... awk
252:info:configure checking whether make sets $(MAKE)... yes
253:info:configure checking whether make supports nested variables... yes
254:info:configure checking build system type... x86_64-apple-darwin11.4.0
255:info:configure checking host system type... x86_64-apple-darwin11.4.0
256:info:configure checking how to print strings... printf
257:info:configure checking for style of include used by make... GNU
258:info:configure checking for gcc... /usr/bin/clang
259:info:configure checking whether the C compiler works... yes
260:info:configure checking for C compiler default output file name... a.out
261:info:configure checking for suffix of executables...
262:info:configure checking whether we are cross compiling... no
263:info:configure checking for suffix of object files... o
264:info:configure checking whether we are using the GNU C compiler... yes
265:info:configure checking whether /usr/bin/clang accepts -g... yes
266:info:configure checking for /usr/bin/clang option to accept ISO C89... none needed
267:info:configure checking dependency style of /usr/bin/clang... gcc3
268:info:configure checking for a sed that does not truncate output... /opt/local/bin/gsed
269:info:configure checking for grep that handles long lines and -e... /opt/local/bin/grep
270:info:configure checking for egrep... /opt/local/bin/grep -E
271:info:configure checking for fgrep... /opt/local/bin/grep -F
272:info:configure checking for ld used by /usr/bin/clang... /usr/bin/ld
273:info:configure checking if the linker (/usr/bin/ld) is GNU ld... no
274:info:configure checking for BSD- or MS-compatible name lister (nm)... /usr/bin/nm
275:info:configure checking the name lister (/usr/bin/nm) interface... BSD nm
276:info:configure checking whether ln -s works... yes
277:info:configure checking the maximum length of command line arguments... 196608
278:info:configure checking whether the shell understands some XSI constructs... yes
279:info:configure checking whether the shell understands "+="... yes
280:info:configure checking how to convert x86_64-apple-darwin11.4.0 file names to x86_64-apple-darwin11.4.0 format... func_convert_file_noop
281:info:configure checking how to convert x86_64-apple-darwin11.4.0 file names to toolchain format... func_convert_file_noop
282:info:configure checking for /usr/bin/ld option to reload object files... -r
283:info:configure checking for objdump... no
284:info:configure checking how to recognize dependent libraries... pass_all
285:info:configure checking for dlltool... no
286:info:configure checking how to associate runtime and link libraries... printf %s\n
287:info:configure checking for ar... ar
288:info:configure checking for archiver @FILE support... no
289:info:configure checking for strip... strip
290:info:configure checking for ranlib... ranlib
291:info:configure checking command to parse /usr/bin/nm output from /usr/bin/clang object... ok
292:info:configure checking for sysroot... no
293:info:configure checking for mt... no
294:info:configure checking if : is a manifest tool... no
295:info:configure checking for dsymutil... dsymutil
296:info:configure checking for nmedit... nmedit
297:info:configure checking for lipo... lipo
298:info:configure checking for otool... otool
299:info:configure checking for otool64... no
300:info:configure checking for -single_module linker flag... yes
301:info:configure checking for -exported_symbols_list linker flag... yes
302:info:configure checking for -force_load linker flag... yes
303:info:configure checking how to run the C preprocessor... /usr/bin/clang -E
304:info:configure checking for ANSI C header files... yes
305:info:configure checking for sys/types.h... yes
306:info:configure checking for sys/stat.h... yes
307:info:configure checking for stdlib.h... yes
308:info:configure checking for string.h... yes
309:info:configure checking for memory.h... yes
310:info:configure checking for strings.h... yes
311:info:configure checking for inttypes.h... yes
312:info:configure checking for stdint.h... yes
313:info:configure checking for unistd.h... yes
314:info:configure checking for dlfcn.h... yes
315:info:configure checking for objdir... .libs
316:info:configure checking if /usr/bin/clang supports -fno-rtti -fno-exceptions... yes
317:info:configure checking for /usr/bin/clang option to produce PIC... -fno-common -DPIC
318:info:configure checking if /usr/bin/clang PIC flag -fno-common -DPIC works... yes
319:info:configure checking if /usr/bin/clang static flag -static works... no
320:info:configure checking if /usr/bin/clang supports -c -o file.o... yes
321:info:configure checking if /usr/bin/clang supports -c -o file.o... (cached) yes
322:info:configure checking whether the /usr/bin/clang linker (/usr/bin/ld) supports shared libraries... yes
323:info:configure checking dynamic linker characteristics... darwin11.4.0 dyld
324:info:configure checking how to hardcode library paths into programs... immediate
325:info:configure checking whether stripping libraries is possible... yes
326:info:configure checking if libtool supports shared libraries... yes
327:info:configure checking whether to build shared libraries... yes
328:info:configure checking whether to build static libraries... yes
329:info:configure checking for gcc... (cached) /usr/bin/clang
330:info:configure checking whether we are using the GNU C compiler... (cached) yes
331:info:configure checking whether /usr/bin/clang accepts -g... (cached) yes
332:info:configure checking for /usr/bin/clang option to accept ISO C89... (cached) none needed
333:info:configure checking dependency style of /usr/bin/clang... (cached) gcc3
334:info:configure checking whether /usr/bin/clang and cc understand -c and -o together... yes
335:info:configure checking for /usr/bin/clang option to accept ISO C99... none needed
336:info:configure checking for /usr/bin/clang option to accept ISO Standard C... (cached) none needed
337:info:configure checking whether we are using the GNU C++ compiler... yes
338:info:configure checking whether /usr/bin/clang++ accepts -g... yes
339:info:configure checking dependency style of /usr/bin/clang++... gcc3
340:info:configure checking how to run the C++ preprocessor... /usr/bin/clang++ -E
341:info:configure checking for ld used by /usr/bin/clang++... /usr/bin/ld
342:info:configure checking if the linker (/usr/bin/ld) is GNU ld... no
343:info:configure checking whether the /usr/bin/clang++ linker (/usr/bin/ld) supports shared libraries... yes
344:info:configure checking for /usr/bin/clang++ option to produce PIC... -fno-common -DPIC
345:info:configure checking if /usr/bin/clang++ PIC flag -fno-common -DPIC works... yes
346:info:configure checking if /usr/bin/clang++ static flag -static works... no
347:info:configure checking if /usr/bin/clang++ supports -c -o file.o... yes
348:info:configure checking if /usr/bin/clang++ supports -c -o file.o... (cached) yes
349:info:configure checking whether the /usr/bin/clang++ linker (/usr/bin/ld) supports shared libraries... yes
350:info:configure checking dynamic linker characteristics... darwin11.4.0 dyld
351:info:configure checking how to hardcode library paths into programs... immediate
352:info:configure checking for ANSI C header files... (cached) yes
353:info:configure checking locale.h usability... yes
354:info:configure checking locale.h presence... yes
355:info:configure checking for locale.h... yes
356:info:configure checking langinfo.h usability... yes
357:info:configure checking langinfo.h presence... yes
358:info:configure checking for langinfo.h... yes
359:info:configure checking for special C compiler options needed for large files... no
360:info:configure checking for _FILE_OFFSET_BITS value needed for large files... no
361:info:configure checking for makeinfo... yes
362:info:configure checking for emacs... emacs
363:info:configure checking where .elc files should go... ${datarootdir}/emacs/site-lisp
364:info:configure checking for dirent.h that defines DIR... yes
365:info:configure checking for library containing opendir... none required
366:info:configure checking for struct dirent.d_type... yes
367:info:configure checking for struct dirent.d_ino... yes
368:info:configure checking for memset... yes
369:info:configure checking for memcpy... yes
370:info:configure checking for realpath... yes
371:info:configure checking for setlocale... yes
372:info:configure checking for strerror... yes
373:info:configure checking for pkg-config... /opt/local/bin/pkg-config
374:info:configure checking pkg-config is at least version 0.9.0... yes
375:info:configure checking for GLIB... yes
376:info:configure checking for g_test... yes
377:info:configure checking for GMIME... no
378:info:configure checking for GMIME... yes
379:info:configure checking for xapian-config... xapian-config
380:info:configure checking for GIO... yes
381:info:configure checking for GUILE... no
382:info:configure checking for makeinfo... (cached) yes
383:info:configure checking for pmccabe... pmccabe
384:info:configure configure: creating ./config.status
385:info:configure config.status: creating Makefile
386:info:configure config.status: creating src/Makefile
387:info:configure config.status: creating src/tests/Makefile
388:info:configure config.status: creating widgets/Makefile
389:info:configure config.status: creating emacs/Makefile
390:info:configure config.status: creating emacs/mu4e-meta.el
391:info:configure config.status: creating emacs/version.texi
392:info:configure config.status: creating guile/Makefile
393:info:configure config.status: creating guile/mu/Makefile
394:info:configure config.status: creating guile/examples/Makefile
395:info:configure config.status: creating toys/Makefile
396:info:configure config.status: creating toys/mug/Makefile
397:info:configure config.status: creating toys/mug2/Makefile
398:info:configure config.status: creating toys/msg2pdf/Makefile
399:info:configure config.status: creating man/Makefile
400:info:configure config.status: creating m4/Makefile
401:info:configure config.status: creating contrib/Makefile
402:info:configure config.status: creating config.h
403:info:configure config.status: executing depfiles commands
404:info:configure config.status: executing libtool commands
405:info:configure
406:info:configure mu configuration is complete.
407:info:configure -----------------------------
408:info:configure Xapian version                       : 1.2.8
409:info:configure GLib version                         : 2.32.3
410:info:configure GMime version                        : 2.4.23
411:info:configure GIO version                          : 2.32.3
412:info:configure
413:info:configure Build unit tests (glib >= 2.22)      : yes
414:info:configure Build 'mug' toy-ui (requires GTK+)   : no
415:info:configure McCabe's Cyclomatic Complexity tool  : yes
416:info:configure
417:info:configure Have direntry->d_ino                 : yes
418:info:configure Have direntry->d_type                : yes
419:info:configure -----------------------------
420:info:configure
421:info:configure
422:info:configure type 'make' to build mu, or 'make check' to run the unit tests.
423:info:configure use 'make V=1' to show the detailed output during the build
424:debug:build build phase started at Sat Jun 16 09:30:12 PDT 2012
425:notice:build --->  Building mu
426:debug:build Executing org.macports.build (mu)
427:debug:build Environment: CPATH='/opt/local/include' CC_PRINT_OPTIONS_FILE='/opt/local/var/macports/build/_opt_local_var_macports_sources_rsync.macports.org_release_ports_mail_mu/mu/work/.CC_PRINT_OPTIONS' LIBRARY_PATH='/opt/local/lib' CC_PRINT_OPTIONS='YES' MACOSX_DEPLOYMENT_TARGET='10.7'
428:debug:build Assembled command: 'cd "/opt/local/var/macports/build/_opt_local_var_macports_sources_rsync.macports.org_release_ports_mail_mu/mu/work/mu-0.9.8.4" && /usr/bin/make -j2 -w all'
429:debug:build Executing command line:  cd "/opt/local/var/macports/build/_opt_local_var_macports_sources_rsync.macports.org_release_ports_mail_mu/mu/work/mu-0.9.8.4" && /usr/bin/make -j2 -w all
430:info:build make: Entering directory `/opt/local/var/macports/build/_opt_local_var_macports_sources_rsync.macports.org_release_ports_mail_mu/mu/work/mu-0.9.8.4'
431:info:build /usr/bin/make  all-recursive
432:info:build make[1]: Entering directory `/opt/local/var/macports/build/_opt_local_var_macports_sources_rsync.macports.org_release_ports_mail_mu/mu/work/mu-0.9.8.4'
433:info:build Making all in m4
434:info:build make[2]: Entering directory `/opt/local/var/macports/build/_opt_local_var_macports_sources_rsync.macports.org_release_ports_mail_mu/mu/work/mu-0.9.8.4/m4'
435:info:build make[2]: Nothing to be done for `all'.
436:info:build make[2]: Leaving directory `/opt/local/var/macports/build/_opt_local_var_macports_sources_rsync.macports.org_release_ports_mail_mu/mu/work/mu-0.9.8.4/m4'
437:info:build Making all in man
438:info:build make[2]: Entering directory `/opt/local/var/macports/build/_opt_local_var_macports_sources_rsync.macports.org_release_ports_mail_mu/mu/work/mu-0.9.8.4/man'
439:info:build make[2]: Nothing to be done for `all'.
440:info:build make[2]: Leaving directory `/opt/local/var/macports/build/_opt_local_var_macports_sources_rsync.macports.org_release_ports_mail_mu/mu/work/mu-0.9.8.4/man'
441:info:build Making all in src
442:info:build make[2]: Entering directory `/opt/local/var/macports/build/_opt_local_var_macports_sources_rsync.macports.org_release_ports_mail_mu/mu/work/mu-0.9.8.4/src'
443:info:build Making all in .
444:info:build make[3]: Entering directory `/opt/local/var/macports/build/_opt_local_var_macports_sources_rsync.macports.org_release_ports_mail_mu/mu/work/mu-0.9.8.4/src'
445:info:build   CC     mu-cmd-cfind.lo
446:info:build   CC     mu-bookmarks.lo
447:info:build   CC     mu-cmd-extract.lo
448:info:build   CC     mu-cmd-find.lo
449:info:build   CC     mu-cmd-index.lo
450:info:build   CC     mu-cmd-server.lo
451:info:build   CC     mu-cmd.lo
452:info:build   CC     mu-config.lo
453:info:build   CC     mu-contacts.lo
454:info:build   CC     mu-container.lo
455:info:build   CC     mu-date.lo
456:info:build   CC     mu-flags.lo
457:info:build   CC     mu-index.lo
458:info:build   CC     mu-log.lo
459:info:build   CC     mu-maildir.lo
460:info:build   CC     mu-msg-cache.lo
461:info:build   CXX    mu-msg-doc.lo
462:info:build   CC     mu-msg-fields.lo
463:info:build   CC     mu-msg-file.lo
464:info:build   CXX    mu-msg-iter.lo
465:info:build   CC     mu-msg-part.lo
466:info:build   CC     mu-msg-prio.lo
467:info:build   CC     mu-msg-sexp.lo
468:info:build   CC     mu-msg.lo
469:info:build   CXX    mu-query.lo
470:info:build   CC     mu-runtime.lo
471:info:build   CXX    mu-store.lo
472:info:build   CXX    mu-store-read.lo
473:info:build   CXX    mu-store-write.lo
474:info:build   CC     mu-str-normalize.lo
475:info:build   CC     mu-str.lo
476:info:build   CC     mu-threader.lo
477:info:build   CC     mu-util.lo
478:info:build   CXX    mu.o
479:info:build   CXXLD  libmu.la
480:info:build   CXXLD  mu
481:info:build make[3]: Leaving directory `/opt/local/var/macports/build/_opt_local_var_macports_sources_rsync.macports.org_release_ports_mail_mu/mu/work/mu-0.9.8.4/src'
482:info:build Making all in tests
483:info:build make[3]: Entering directory `/opt/local/var/macports/build/_opt_local_var_macports_sources_rsync.macports.org_release_ports_mail_mu/mu/work/mu-0.9.8.4/src/tests'
484:info:build   CC     test-mu-common.lo
485:info:build   CC     test-mu-util.o
486:info:build   CXX    dummy.o
487:info:build   CC     test-mu-str.o
488:info:build   CC     test-mu-maildir.o
489:info:build   CC     test-mu-msg-fields.o
490:info:build   CC     test-mu-query.o
491:info:build   CC     test-mu-contacts.o
492:info:build   CC     test-mu-cmd.o
493:info:build   CC     test-mu-cmd-cfind.o
494:info:build   CC     test-mu-msg.o
495:info:build   CC     test-mu-runtime.o
496:info:build   CC     test-mu-store.o
497:info:build   CC     test-mu-threads.o
498:info:build   CC     test-mu-date.o
499:info:build   CC     test-mu-flags.o
500:info:build   CCLD   libtestmucommon.la
501:info:build   CXXLD  test-mu-str
502:info:build   CXXLD  test-mu-util
503:info:build   CXXLD  test-mu-maildir
504:info:build   CXXLD  test-mu-msg-fields
505:info:build   CXXLD  test-mu-query
506:info:build   CXXLD  test-mu-contacts
507:info:build   CXXLD  test-mu-cmd
508:info:build   CXXLD  test-mu-cmd-cfind
509:info:build   CXXLD  test-mu-msg
510:info:build   CXXLD  test-mu-runtime
511:info:build   CXXLD  test-mu-store
512:info:build   CXXLD  test-mu-threads
513:info:build   CXXLD  test-mu-date
514:info:build   CXXLD  test-mu-flags
515:info:build make[3]: Leaving directory `/opt/local/var/macports/build/_opt_local_var_macports_sources_rsync.macports.org_release_ports_mail_mu/mu/work/mu-0.9.8.4/src/tests'
516:info:build make[2]: Leaving directory `/opt/local/var/macports/build/_opt_local_var_macports_sources_rsync.macports.org_release_ports_mail_mu/mu/work/mu-0.9.8.4/src'
517:info:build Making all in emacs
518:info:build make[2]: Entering directory `/opt/local/var/macports/build/_opt_local_var_macports_sources_rsync.macports.org_release_ports_mail_mu/mu/work/mu-0.9.8.4/emacs'
519:info:build make[3]: Entering directory `/opt/local/var/macports/build/_opt_local_var_macports_sources_rsync.macports.org_release_ports_mail_mu/mu/work/mu-0.9.8.4/emacs'
520:info:build restore=: && backupdir=".am$$" && \
521:info:build     am__cwd=`pwd` && CDPATH="${ZSH_VERSION+.}:" && cd . && \
522:info:build     rm -rf $backupdir && mkdir $backupdir && \
523:info:build     if (/bin/sh /opt/local/var/macports/build/_opt_local_var_macports_sources_rsync.macports.org_release_ports_mail_mu/mu/work/mu-0.9.8.4/missing --run makeinfo --version) >/dev/null 2>&1; then \
524:info:build       for f in mu4e.info mu4e.info-[0-9] mu4e.info-[0-9][0-9] mu4e.i[0-9] mu4e.i[0-9][0-9]; do \
525:info:build         if test -f $f; then mv $f $backupdir; restore=mv; else :; fi; \
526:info:build       done; \
527:info:build     else :; fi && \
528:info:build     cd "$am__cwd"; \
529:info:build     if /bin/sh /opt/local/var/macports/build/_opt_local_var_macports_sources_rsync.macports.org_release_ports_mail_mu/mu/work/mu-0.9.8.4/missing --run makeinfo   -I . \
530:info:build      -o mu4e.info mu4e.texi; \
531:info:build     then \
532:info:build       rc=0; \
533:info:build       CDPATH="${ZSH_VERSION+.}:" && cd .; \
534:info:build     else \
535:info:build       rc=$?; \
536:info:build       CDPATH="${ZSH_VERSION+.}:" && cd . && \
537:info:build       $restore $backupdir/* `echo "./mu4e.info" | sed 's|[^/]*$||'`; \
538:info:build     fi; \
539:info:build     rm -rf $backupdir; exit $rc
540:info:build WARNING: Warnings can be ignored. :-)
541:info:build if test "emacs" != no; then \
542:info:build       set x; \
543:info:build       list='mu4e-actions.el mu4e-compose.el mu4e-headers.el mu4e-main.el mu4e-mark.el mu4e-meta.el mu4e-proc.el mu4e-speedbar.el mu4e-utils.el mu4e-vars.el mu4e-view.el mu4e.el org-mu4e.el'; for p in $list; do \
544:info:build         if test -f "$p"; then d=; else d="./"; fi; \
545:info:build         set x "$@" "$d$p"; shift; \
546:info:build       done; \
547:info:build       shift; \
548:info:build       EMACS="emacs" /bin/sh ../elisp-comp "$@" || exit 1; \
549:info:build     else : ; fi
550:info:build
551:info:build In toplevel form:
552:info:build mu4e-actions.el:30:1:Error: Unknown keyword :safe
553:info:build
554:info:build In toplevel form:
555:info:build mu4e-compose.el:35:1:Error: Unknown keyword :safe
556:info:build
557:info:build In toplevel form:
558:info:build mu4e-headers.el:33:1:Error: Unknown keyword :safe
559:info:build
560:info:build In toplevel form:
561:info:build mu4e-main.el:27:1:Error: Unknown keyword :safe
562:info:build
563:info:build In toplevel form:
564:info:build mu4e-mark.el:29:1:Error: Unknown keyword :safe
565:info:build Wrote /opt/local/var/macports/build/_opt_local_var_macports_sources_rsync.macports.org_release_ports_mail_mu/mu/work/mu-0.9.8.4/emacs/elc.80394/mu4e-meta.elc
566:info:build
567:info:build In toplevel form:
568:info:build mu4e-proc.el:26:1:Error: Unknown keyword :safe
569:info:build
570:info:build In toplevel form:
571:info:build mu4e-speedbar.el:43:1:Error: Unknown keyword :safe
572:info:build
573:info:build In toplevel form:
574:info:build mu4e-utils.el:30:1:Error: Unknown keyword :safe
575:info:build
576:info:build In toplevel form:
577:info:build mu4e-vars.el:143:1:Warning: defcustom for `mu4e-maildir-shortcuts' fails to
578:info:build     specify containing group
579:info:build Wrote /opt/local/var/macports/build/_opt_local_var_macports_sources_rsync.macports.org_release_ports_mail_mu/mu/work/mu-0.9.8.4/emacs/elc.80394/mu4e-vars.elc
580:info:build
581:info:build In toplevel form:
582:info:build mu4e-view.el:29:1:Error: Unknown keyword :safe
583:info:build
584:info:build In toplevel form:
585:info:build mu4e.el:32:1:Error: Unknown keyword :safe
586:info:build
587:info:build In toplevel form:
588:info:build org-mu4e.el:31:30:Error: Unknown keyword :safe
589:info:build make[3]: *** [elc-stamp] Error 1
590:info:build make[3]: Leaving directory `/opt/local/var/macports/build/_opt_local_var_macports_sources_rsync.macports.org_release_ports_mail_mu/mu/work/mu-0.9.8.4/emacs'
591:info:build make[2]: *** [all-recursive] Error 1
592:info:build make[2]: Leaving directory `/opt/local/var/macports/build/_opt_local_var_macports_sources_rsync.macports.org_release_ports_mail_mu/mu/work/mu-0.9.8.4/emacs'
593:info:build make[1]: *** [all-recursive] Error 1
594:info:build make[1]: Leaving directory `/opt/local/var/macports/build/_opt_local_var_macports_sources_rsync.macports.org_release_ports_mail_mu/mu/work/mu-0.9.8.4'
595:info:build make: *** [all] Error 2
596:info:build make: Leaving directory `/opt/local/var/macports/build/_opt_local_var_macports_sources_rsync.macports.org_release_ports_mail_mu/mu/work/mu-0.9.8.4'
597:info:build Command failed:  cd "/opt/local/var/macports/build/_opt_local_var_macports_sources_rsync.macports.org_release_ports_mail_mu/mu/work/mu-0.9.8.4" && /usr/bin/make -j2 -w all
598:info:build Exit code: 2
599:error:build org.macports.build for port mu returned: command execution failed
600:debug:build Error code: CHILDSTATUS 76414 2
601:debug:build Backtrace: command execution failed
602    while executing
603"system -nice 0 $fullcmdstring"
604    ("eval" body line 1)
605    invoked from within
606"eval system $notty $nice \$fullcmdstring"
607    invoked from within
608"command_exec build"
609    (procedure "portbuild::build_main" line 8)
610    invoked from within
611"$procedure $targetname"
612:info:build Warning: targets not executed for mu: org.macports.activate org.macports.build org.macports.destroot org.macports.install
613:notice:build Please see the log file for port mu for details:
614    /opt/local/var/macports/logs/_opt_local_var_macports_sources_rsync.macports.org_release_ports_mail_mu/mu/main.log