Ticket #35118: mongodb.log

File mongodb.log, 41.8 KB (added by hapaguy (Brian Kurt Fujikawa), 6 years ago)

mongodb build log

Line 
1version:1
2:debug:main epoch: in tree: 0 installed: 0
3:debug:main scons 2.0.1_1 exists in the ports tree
4:debug:main scons 2.0.1_1  is the latest installed
5:debug:main scons 2.0.1_1  is active
6:debug:main Merging existing variants '' into variants
7:debug:main new fully merged portvariants:
8:debug:main Changing to port directory: /opt/local/var/macports/sources/rsync.macports.org/release/tarballs/ports/devel/scons
9:debug:main OS darwin/11.4.0 (Mac OS X 10.7) arch i386
10:debug:main org.macports.load registered provides 'load', a pre-existing procedure. Target override will not be provided
11:debug:main org.macports.unload registered provides 'unload', a pre-existing procedure. Target override will not be provided
12:debug:main org.macports.distfiles registered provides 'distfiles', a pre-existing procedure. Target override will not be provided
13:debug:main Using group file /opt/local/var/macports/sources/rsync.macports.org/release/tarballs/ports/_resources/port1.0/group/python27-1.0.tcl
14:debug:main only one arch supported, so not adding the default universal variant
15:debug:main No need to upgrade! scons 2.0.1_1 >= scons 2.0.1_1
16:debug:main epoch: in tree: 2 installed: 2
17:debug:main python27 2.7.3_0 exists in the ports tree
18:debug:main python27 2.7.3_0 +universal is the latest installed
19:debug:main python27 2.7.3_0 +universal is active
20:debug:main Merging existing variants '+universal' into variants
21:debug:main new fully merged portvariants: universal +
22:debug:main Changing to port directory: /opt/local/var/macports/sources/rsync.macports.org/release/tarballs/ports/lang/python27
23:debug:main OS darwin/11.4.0 (Mac OS X 10.7) arch i386
24:debug:main org.macports.load registered provides 'load', a pre-existing procedure. Target override will not be provided
25:debug:main org.macports.unload registered provides 'unload', a pre-existing procedure. Target override will not be provided
26:debug:main org.macports.distfiles registered provides 'distfiles', a pre-existing procedure. Target override will not be provided
27:debug:main Using group file /opt/local/var/macports/sources/rsync.macports.org/release/tarballs/ports/_resources/port1.0/group/select-1.0.tcl
28:debug:main Reading variant descriptions from /opt/local/var/macports/sources/rsync.macports.org/release/tarballs/ports/_resources/port1.0/variant_descriptions.conf
29:debug:main universal variant already exists, so not adding the default one
30:debug:main Executing variant universal provides universal
31:debug:main No need to upgrade! python27 2.7.3_0 >= python27 2.7.3_0
32:debug:main epoch: in tree: 0 installed: 0
33:debug:main gettext 0.18.1.1_2 exists in the ports tree
34:debug:main gettext 0.18.1.1_2 +universal is the latest installed
35:debug:main gettext 0.18.1.1_2 +universal is active
36:debug:main Merging existing variants '+universal' into variants
37:debug:main new fully merged portvariants: universal +
38:debug:main Changing to port directory: /opt/local/var/macports/sources/rsync.macports.org/release/tarballs/ports/devel/gettext
39:debug:main OS darwin/11.4.0 (Mac OS X 10.7) arch i386
40:debug:main org.macports.load registered provides 'load', a pre-existing procedure. Target override will not be provided
41:debug:main org.macports.unload registered provides 'unload', a pre-existing procedure. Target override will not be provided
42:debug:main org.macports.distfiles registered provides 'distfiles', a pre-existing procedure. Target override will not be provided
43:debug:main Using group file /opt/local/var/macports/sources/rsync.macports.org/release/tarballs/ports/_resources/port1.0/group/muniversal-1.0.tcl
44:debug:main Reading variant descriptions from /opt/local/var/macports/sources/rsync.macports.org/release/tarballs/ports/_resources/port1.0/variant_descriptions.conf
45:debug:main Using group file /opt/local/var/macports/sources/rsync.macports.org/release/tarballs/ports/_resources/port1.0/group/archcheck-1.0.tcl
46:debug:main universal variant already exists, so not adding the default one
47:debug:main Executing variant universal provides universal
48:debug:main No need to upgrade! gettext 0.18.1.1_2 >= gettext 0.18.1.1_2
49:debug:main epoch: in tree: 0 installed: 0
50:debug:main libiconv 1.14_0 exists in the ports tree
51:debug:main libiconv 1.14_0 +universal is the latest installed
52:debug:main libiconv 1.14_0 +universal is active
53:debug:main Merging existing variants '+universal' into variants
54:debug:main new fully merged portvariants: universal +
55:debug:main Changing to port directory: /opt/local/var/macports/sources/rsync.macports.org/release/tarballs/ports/textproc/libiconv
56:debug:main OS darwin/11.4.0 (Mac OS X 10.7) arch i386
57:debug:main org.macports.load registered provides 'load', a pre-existing procedure. Target override will not be provided
58:debug:main org.macports.unload registered provides 'unload', a pre-existing procedure. Target override will not be provided
59:debug:main org.macports.distfiles registered provides 'distfiles', a pre-existing procedure. Target override will not be provided
60:debug:main Using group file /opt/local/var/macports/sources/rsync.macports.org/release/tarballs/ports/_resources/port1.0/group/muniversal-1.0.tcl
61:debug:main Reading variant descriptions from /opt/local/var/macports/sources/rsync.macports.org/release/tarballs/ports/_resources/port1.0/variant_descriptions.conf
62:debug:main universal variant already exists, so not adding the default one
63:debug:main Executing variant universal provides universal
64:debug:main No need to upgrade! libiconv 1.14_0 >= libiconv 1.14_0
65:debug:main epoch: in tree: 0 installed: 0
66:debug:main ncurses 5.9_1 exists in the ports tree
67:debug:main ncurses 5.9_1  is the latest installed
68:debug:main ncurses 5.9_1 +universal is active
69:debug:main Merging existing variants '+universal' into variants
70:debug:main new fully merged portvariants: universal +
71:debug:main Changing to port directory: /opt/local/var/macports/sources/rsync.macports.org/release/tarballs/ports/devel/ncurses
72:debug:main OS darwin/11.4.0 (Mac OS X 10.7) arch i386
73:debug:main org.macports.load registered provides 'load', a pre-existing procedure. Target override will not be provided
74:debug:main org.macports.unload registered provides 'unload', a pre-existing procedure. Target override will not be provided
75:debug:main org.macports.distfiles registered provides 'distfiles', a pre-existing procedure. Target override will not be provided
76:debug:main adding the default universal variant
77:debug:main Reading variant descriptions from /opt/local/var/macports/sources/rsync.macports.org/release/tarballs/ports/_resources/port1.0/variant_descriptions.conf
78:debug:main Executing variant universal provides universal
79:debug:main No need to upgrade! ncurses 5.9_1 >= ncurses 5.9_1
80:debug:main epoch: in tree: 0 installed: 0
81:debug:main expat 2.1.0_0 exists in the ports tree
82:debug:main expat 2.1.0_0 +universal is the latest installed
83:debug:main expat 2.1.0_0 +universal is active
84:debug:main Merging existing variants '+universal' into variants
85:debug:main new fully merged portvariants: universal +
86:debug:main Changing to port directory: /opt/local/var/macports/sources/rsync.macports.org/release/tarballs/ports/textproc/expat
87:debug:main OS darwin/11.4.0 (Mac OS X 10.7) arch i386
88:debug:main org.macports.load registered provides 'load', a pre-existing procedure. Target override will not be provided
89:debug:main org.macports.unload registered provides 'unload', a pre-existing procedure. Target override will not be provided
90:debug:main org.macports.distfiles registered provides 'distfiles', a pre-existing procedure. Target override will not be provided
91:debug:main adding the default universal variant
92:debug:main Reading variant descriptions from /opt/local/var/macports/sources/rsync.macports.org/release/tarballs/ports/_resources/port1.0/variant_descriptions.conf
93:debug:main Executing variant universal provides universal
94:debug:main No need to upgrade! expat 2.1.0_0 >= expat 2.1.0_0
95:debug:main epoch: in tree: 0 installed: 0
96:debug:main zlib 1.2.7_0 exists in the ports tree
97:debug:main zlib 1.2.7_0  is the latest installed
98:debug:main zlib 1.2.7_0 +universal is active
99:debug:main Merging existing variants '+universal' into variants
100:debug:main new fully merged portvariants: universal +
101:debug:main Changing to port directory: /opt/local/var/macports/sources/rsync.macports.org/release/tarballs/ports/archivers/zlib
102:debug:main OS darwin/11.4.0 (Mac OS X 10.7) arch i386
103:debug:main org.macports.load registered provides 'load', a pre-existing procedure. Target override will not be provided
104:debug:main org.macports.unload registered provides 'unload', a pre-existing procedure. Target override will not be provided
105:debug:main org.macports.distfiles registered provides 'distfiles', a pre-existing procedure. Target override will not be provided
106:debug:main Using group file /opt/local/var/macports/sources/rsync.macports.org/release/tarballs/ports/_resources/port1.0/group/xcodeversion-1.0.tcl
107:debug:main adding the default universal variant
108:debug:main Reading variant descriptions from /opt/local/var/macports/sources/rsync.macports.org/release/tarballs/ports/_resources/port1.0/variant_descriptions.conf
109:debug:main Executing variant universal provides universal
110:debug:main No need to upgrade! zlib 1.2.7_0 >= zlib 1.2.7_0
111:debug:main epoch: in tree: 1 installed: 1
112:debug:main openssl 1.0.1c_0 exists in the ports tree
113:debug:main openssl 1.0.1c_0  is the latest installed
114:debug:main openssl 1.0.1c_0 +universal is active
115:debug:main Merging existing variants '+universal' into variants
116:debug:main new fully merged portvariants: universal +
117:debug:main Changing to port directory: /opt/local/var/macports/sources/rsync.macports.org/release/tarballs/ports/devel/openssl
118:debug:main OS darwin/11.4.0 (Mac OS X 10.7) arch i386
119:debug:main org.macports.load registered provides 'load', a pre-existing procedure. Target override will not be provided
120:debug:main org.macports.unload registered provides 'unload', a pre-existing procedure. Target override will not be provided
121:debug:main org.macports.distfiles registered provides 'distfiles', a pre-existing procedure. Target override will not be provided
122:debug:main Using group file /opt/local/var/macports/sources/rsync.macports.org/release/tarballs/ports/_resources/port1.0/group/muniversal-1.0.tcl
123:debug:main Reading variant descriptions from /opt/local/var/macports/sources/rsync.macports.org/release/tarballs/ports/_resources/port1.0/variant_descriptions.conf
124:debug:main universal variant already exists, so not adding the default one
125:debug:main Executing variant universal provides universal
126:debug:main No need to upgrade! openssl 1.0.1c_0 >= openssl 1.0.1c_0
127:debug:main epoch: in tree: 0 installed: 0
128:debug:main sqlite3 3.7.13_0 exists in the ports tree
129:debug:main sqlite3 3.7.13_0 +universal is the latest installed
130:debug:main sqlite3 3.7.13_0 +universal is active
131:debug:main Merging existing variants '+universal' into variants
132:debug:main new fully merged portvariants: universal +
133:debug:main Changing to port directory: /opt/local/var/macports/sources/rsync.macports.org/release/tarballs/ports/databases/sqlite3
134:debug:main OS darwin/11.4.0 (Mac OS X 10.7) arch i386
135:debug:main org.macports.load registered provides 'load', a pre-existing procedure. Target override will not be provided
136:debug:main org.macports.unload registered provides 'unload', a pre-existing procedure. Target override will not be provided
137:debug:main org.macports.distfiles registered provides 'distfiles', a pre-existing procedure. Target override will not be provided
138:debug:main adding the default universal variant
139:debug:main Reading variant descriptions from /opt/local/var/macports/sources/rsync.macports.org/release/tarballs/ports/_resources/port1.0/variant_descriptions.conf
140:debug:main Executing variant universal provides universal
141:debug:main No need to upgrade! sqlite3 3.7.13_0 >= sqlite3 3.7.13_0
142:debug:main epoch: in tree: 20090923 installed: 20090923
143:debug:main libedit 20120601-3.0_0 exists in the ports tree
144:debug:main libedit 20120601-3.0_0 +universal is the latest installed
145:debug:main libedit 20120601-3.0_0 +universal is active
146:debug:main Merging existing variants '+universal' into variants
147:debug:main new fully merged portvariants: universal +
148:debug:main Changing to port directory: /opt/local/var/macports/sources/rsync.macports.org/release/tarballs/ports/devel/libedit
149:debug:main OS darwin/11.4.0 (Mac OS X 10.7) arch i386
150:debug:main org.macports.load registered provides 'load', a pre-existing procedure. Target override will not be provided
151:debug:main org.macports.unload registered provides 'unload', a pre-existing procedure. Target override will not be provided
152:debug:main org.macports.distfiles registered provides 'distfiles', a pre-existing procedure. Target override will not be provided
153:debug:main Using group file /opt/local/var/macports/sources/rsync.macports.org/release/tarballs/ports/_resources/port1.0/group/muniversal-1.0.tcl
154:debug:main Reading variant descriptions from /opt/local/var/macports/sources/rsync.macports.org/release/tarballs/ports/_resources/port1.0/variant_descriptions.conf
155:debug:main universal variant already exists, so not adding the default one
156:debug:main Executing variant universal provides universal
157:debug:main No need to upgrade! libedit 20120601-3.0_0 >= libedit 20120601-3.0_0
158:debug:main epoch: in tree: 0 installed: 0
159:debug:main db46 4.6.21_6 exists in the ports tree
160:debug:main db46 4.6.21_6 +universal is the latest installed
161:debug:main db46 4.6.21_6 +universal is active
162:debug:main Merging existing variants '+universal' into variants
163:debug:main new fully merged portvariants: universal +
164:debug:main Changing to port directory: /opt/local/var/macports/sources/rsync.macports.org/release/tarballs/ports/databases/db46
165:debug:main OS darwin/11.4.0 (Mac OS X 10.7) arch i386
166:debug:main org.macports.load registered provides 'load', a pre-existing procedure. Target override will not be provided
167:debug:main org.macports.unload registered provides 'unload', a pre-existing procedure. Target override will not be provided
168:debug:main org.macports.distfiles registered provides 'distfiles', a pre-existing procedure. Target override will not be provided
169:debug:main Using group file /opt/local/var/macports/sources/rsync.macports.org/release/tarballs/ports/_resources/port1.0/group/muniversal-1.0.tcl
170:debug:main Reading variant descriptions from /opt/local/var/macports/sources/rsync.macports.org/release/tarballs/ports/_resources/port1.0/variant_descriptions.conf
171:debug:main universal variant already exists, so not adding the default one
172:debug:main Executing variant universal provides universal
173:debug:main No need to upgrade! db46 4.6.21_6 >= db46 4.6.21_6
174:debug:main epoch: in tree: 0 installed: 0
175:debug:main bzip2 1.0.6_0 exists in the ports tree
176:debug:main bzip2 1.0.6_0 +universal is the latest installed
177:debug:main bzip2 1.0.6_0 +universal is active
178:debug:main Merging existing variants '+universal' into variants
179:debug:main new fully merged portvariants: universal +
180:debug:main Changing to port directory: /opt/local/var/macports/sources/rsync.macports.org/release/tarballs/ports/archivers/bzip2
181:debug:main OS darwin/11.4.0 (Mac OS X 10.7) arch i386
182:debug:main org.macports.load registered provides 'load', a pre-existing procedure. Target override will not be provided
183:debug:main org.macports.unload registered provides 'unload', a pre-existing procedure. Target override will not be provided
184:debug:main org.macports.distfiles registered provides 'distfiles', a pre-existing procedure. Target override will not be provided
185:debug:main Reading variant descriptions from /opt/local/var/macports/sources/rsync.macports.org/release/tarballs/ports/_resources/port1.0/variant_descriptions.conf
186:debug:main universal variant already exists, so not adding the default one
187:debug:main Executing variant universal provides universal
188:debug:main No need to upgrade! bzip2 1.0.6_0 >= bzip2 1.0.6_0
189:debug:main epoch: in tree: 0 installed: 0
190:debug:main python_select 0.3_1 exists in the ports tree
191:debug:main python_select 0.3_1  is the latest installed
192:debug:main python_select 0.3_1  is active
193:debug:main Merging existing variants '' into variants
194:debug:main new fully merged portvariants:
195:debug:main Changing to port directory: /opt/local/var/macports/sources/rsync.macports.org/release/tarballs/ports/sysutils/python_select
196:debug:main OS darwin/11.4.0 (Mac OS X 10.7) arch i386
197:debug:main org.macports.load registered provides 'load', a pre-existing procedure. Target override will not be provided
198:debug:main org.macports.unload registered provides 'unload', a pre-existing procedure. Target override will not be provided
199:debug:main org.macports.distfiles registered provides 'distfiles', a pre-existing procedure. Target override will not be provided
200:debug:main Using group file /opt/local/var/macports/sources/rsync.macports.org/release/tarballs/ports/_resources/port1.0/group/select-1.0.tcl
201:debug:main universal_variant is false, so not adding the default universal variant
202:debug:main No need to upgrade! python_select 0.3_1 >= python_select 0.3_1
203:debug:main epoch: in tree: 0 installed: 0
204:debug:main boost 1.50.0_0 exists in the ports tree
205:debug:main boost 1.50.0_0  is the latest installed
206:debug:main boost 1.50.0_0  is active
207:debug:main Merging existing variants '' into variants
208:debug:main new fully merged portvariants:
209:debug:main Changing to port directory: /opt/local/var/macports/sources/rsync.macports.org/release/tarballs/ports/devel/boost
210:debug:main OS darwin/11.4.0 (Mac OS X 10.7) arch i386
211:debug:main org.macports.load registered provides 'load', a pre-existing procedure. Target override will not be provided
212:debug:main org.macports.unload registered provides 'unload', a pre-existing procedure. Target override will not be provided
213:debug:main org.macports.distfiles registered provides 'distfiles', a pre-existing procedure. Target override will not be provided
214:debug:main Reading variant descriptions from /opt/local/var/macports/sources/rsync.macports.org/release/tarballs/ports/_resources/port1.0/variant_descriptions.conf
215:debug:main universal variant already exists, so not adding the default one
216:debug:main No need to upgrade! boost 1.50.0_0 >= boost 1.50.0_0
217:debug:main epoch: in tree: 0 installed: 0
218:debug:main icu 4.8.1_0 exists in the ports tree
219:debug:main icu 4.8.1_0  is the latest installed
220:debug:main icu 4.8.1_0  is active
221:debug:main Merging existing variants '' into variants
222:debug:main new fully merged portvariants:
223:debug:main Changing to port directory: /opt/local/var/macports/sources/rsync.macports.org/release/tarballs/ports/devel/icu
224:debug:main OS darwin/11.4.0 (Mac OS X 10.7) arch i386
225:debug:main org.macports.load registered provides 'load', a pre-existing procedure. Target override will not be provided
226:debug:main org.macports.unload registered provides 'unload', a pre-existing procedure. Target override will not be provided
227:debug:main org.macports.distfiles registered provides 'distfiles', a pre-existing procedure. Target override will not be provided
228:debug:main Using group file /opt/local/var/macports/sources/rsync.macports.org/release/tarballs/ports/_resources/port1.0/group/muniversal-1.0.tcl
229:debug:main Reading variant descriptions from /opt/local/var/macports/sources/rsync.macports.org/release/tarballs/ports/_resources/port1.0/variant_descriptions.conf
230:debug:main universal variant already exists, so not adding the default one
231:debug:main No need to upgrade! icu 4.8.1_0 >= icu 4.8.1_0
232:debug:main epoch: in tree: 0 installed: 0
233:debug:main pcre 8.30_1 exists in the ports tree
234:debug:main pcre 8.30_1  is the latest installed
235:debug:main pcre 8.30_1  is active
236:debug:main Merging existing variants '' into variants
237:debug:main new fully merged portvariants:
238:debug:main Changing to port directory: /opt/local/var/macports/sources/rsync.macports.org/release/tarballs/ports/devel/pcre
239:debug:main OS darwin/11.4.0 (Mac OS X 10.7) arch i386
240:debug:main org.macports.load registered provides 'load', a pre-existing procedure. Target override will not be provided
241:debug:main org.macports.unload registered provides 'unload', a pre-existing procedure. Target override will not be provided
242:debug:main org.macports.distfiles registered provides 'distfiles', a pre-existing procedure. Target override will not be provided
243:debug:main adding the default universal variant
244:debug:main Reading variant descriptions from /opt/local/var/macports/sources/rsync.macports.org/release/tarballs/ports/_resources/port1.0/variant_descriptions.conf
245:debug:main No need to upgrade! pcre 8.30_1 >= pcre 8.30_1
246:debug:main epoch: in tree: 1 installed: 1
247:debug:main spidermonkey 1.7.0_5 exists in the ports tree
248:debug:main spidermonkey 1.7.0_5  is the latest installed
249:debug:main spidermonkey 1.7.0_5  is active
250:debug:main Merging existing variants '' into variants
251:debug:main new fully merged portvariants:
252:debug:main Changing to port directory: /opt/local/var/macports/sources/rsync.macports.org/release/tarballs/ports/lang/spidermonkey
253:debug:main OS darwin/11.4.0 (Mac OS X 10.7) arch i386
254:debug:main org.macports.load registered provides 'load', a pre-existing procedure. Target override will not be provided
255:debug:main org.macports.unload registered provides 'unload', a pre-existing procedure. Target override will not be provided
256:debug:main org.macports.distfiles registered provides 'distfiles', a pre-existing procedure. Target override will not be provided
257:debug:main Using group file /opt/local/var/macports/sources/rsync.macports.org/release/tarballs/ports/_resources/port1.0/group/muniversal-1.0.tcl
258:debug:main Reading variant descriptions from /opt/local/var/macports/sources/rsync.macports.org/release/tarballs/ports/_resources/port1.0/variant_descriptions.conf
259:debug:main universal variant already exists, so not adding the default one
260:debug:main No need to upgrade! spidermonkey 1.7.0_5 >= spidermonkey 1.7.0_5
261:debug:main epoch: in tree: 0 installed: 0
262:debug:main nspr 4.8.9_0 exists in the ports tree
263:debug:main nspr 4.8.9_0  is the latest installed
264:debug:main nspr 4.8.9_0  is active
265:debug:main Merging existing variants '' into variants
266:debug:main new fully merged portvariants:
267:debug:main Changing to port directory: /opt/local/var/macports/sources/rsync.macports.org/release/tarballs/ports/devel/nspr
268:debug:main OS darwin/11.4.0 (Mac OS X 10.7) arch i386
269:debug:main org.macports.load registered provides 'load', a pre-existing procedure. Target override will not be provided
270:debug:main org.macports.unload registered provides 'unload', a pre-existing procedure. Target override will not be provided
271:debug:main org.macports.distfiles registered provides 'distfiles', a pre-existing procedure. Target override will not be provided
272:debug:main Using group file /opt/local/var/macports/sources/rsync.macports.org/release/tarballs/ports/_resources/port1.0/group/muniversal-1.0.tcl
273:debug:main Reading variant descriptions from /opt/local/var/macports/sources/rsync.macports.org/release/tarballs/ports/_resources/port1.0/variant_descriptions.conf
274:debug:main universal variant already exists, so not adding the default one
275:debug:main No need to upgrade! nspr 4.8.9_0 >= nspr 4.8.9_0
276:debug:main epoch: in tree: 0 installed: 0
277:debug:main libpcap 1.2.1_0 exists in the ports tree
278:debug:main libpcap 1.2.1_0  is the latest installed
279:debug:main libpcap 1.2.1_0  is active
280:debug:main Merging existing variants '' into variants
281:debug:main new fully merged portvariants:
282:debug:main Changing to port directory: /opt/local/var/macports/sources/rsync.macports.org/release/tarballs/ports/net/libpcap
283:debug:main OS darwin/11.4.0 (Mac OS X 10.7) arch i386
284:debug:main org.macports.load registered provides 'load', a pre-existing procedure. Target override will not be provided
285:debug:main org.macports.unload registered provides 'unload', a pre-existing procedure. Target override will not be provided
286:debug:main org.macports.distfiles registered provides 'distfiles', a pre-existing procedure. Target override will not be provided
287:debug:main adding the default universal variant
288:debug:main Reading variant descriptions from /opt/local/var/macports/sources/rsync.macports.org/release/tarballs/ports/_resources/port1.0/variant_descriptions.conf
289:debug:main No need to upgrade! libpcap 1.2.1_0 >= libpcap 1.2.1_0
290:debug:main epoch: in tree: 0 installed: 0
291:debug:main snappy 1.0.4_0 exists in the ports tree
292:debug:main snappy 1.0.4_0  is the latest installed
293:debug:main snappy 1.0.4_0  is active
294:debug:main Merging existing variants '' into variants
295:debug:main new fully merged portvariants:
296:debug:main Changing to port directory: /opt/local/var/macports/sources/rsync.macports.org/release/tarballs/ports/archivers/snappy
297:debug:main OS darwin/11.4.0 (Mac OS X 10.7) arch i386
298:debug:main org.macports.load registered provides 'load', a pre-existing procedure. Target override will not be provided
299:debug:main org.macports.unload registered provides 'unload', a pre-existing procedure. Target override will not be provided
300:debug:main org.macports.distfiles registered provides 'distfiles', a pre-existing procedure. Target override will not be provided
301:debug:main adding the default universal variant
302:debug:main Reading variant descriptions from /opt/local/var/macports/sources/rsync.macports.org/release/tarballs/ports/_resources/port1.0/variant_descriptions.conf
303:debug:main No need to upgrade! snappy 1.0.4_0 >= snappy 1.0.4_0
304:debug:main epoch: in tree: 0 installed: 0
305:debug:main lzo2 2.05_1 exists in the ports tree
306:debug:main lzo2 2.05_1  is the latest installed
307:debug:main lzo2 2.05_1  is active
308:debug:main Merging existing variants '' into variants
309:debug:main new fully merged portvariants:
310:debug:main Changing to port directory: /opt/local/var/macports/sources/rsync.macports.org/release/tarballs/ports/archivers/lzo2
311:debug:main OS darwin/11.4.0 (Mac OS X 10.7) arch i386
312:debug:main org.macports.load registered provides 'load', a pre-existing procedure. Target override will not be provided
313:debug:main org.macports.unload registered provides 'unload', a pre-existing procedure. Target override will not be provided
314:debug:main org.macports.distfiles registered provides 'distfiles', a pre-existing procedure. Target override will not be provided
315:debug:main Using group file /opt/local/var/macports/sources/rsync.macports.org/release/tarballs/ports/_resources/port1.0/group/muniversal-1.0.tcl
316:debug:main Reading variant descriptions from /opt/local/var/macports/sources/rsync.macports.org/release/tarballs/ports/_resources/port1.0/variant_descriptions.conf
317:debug:main universal variant already exists, so not adding the default one
318:debug:main No need to upgrade! lzo2 2.05_1 >= lzo2 2.05_1
319:msg:main --->  Computing dependencies for mongodb:info:main .:debug:main mongodb has no conflicts
320:debug:main Searching for dependency: scons
321:debug:main Found Dependency: receipt exists for scons
322:debug:main Searching for dependency: boost
323:debug:main Found Dependency: receipt exists for boost
324:debug:main Searching for dependency: pcre
325:debug:main Found Dependency: receipt exists for pcre
326:debug:main Searching for dependency: spidermonkey
327:debug:main Found Dependency: receipt exists for spidermonkey
328:debug:main Searching for dependency: libpcap
329:debug:main Found Dependency: receipt exists for libpcap
330:debug:main Searching for dependency: snappy
331:debug:main Found Dependency: receipt exists for snappy
332:msg:main
333:debug:main Executing org.macports.main (mongodb)
334:debug:main changing euid/egid - current euid: 0 - current egid: 0
335:debug:main egid changed to: 501
336:debug:main euid changed to: 502
337:debug:archivefetch archivefetch phase started at Sun Jul  8 09:31:18 PDT 2012
338:debug:archivefetch Executing org.macports.archivefetch (mongodb)
339:debug:archivefetch Privilege de-escalation not attempted as not running as root.
340:debug:fetch fetch phase started at Sun Jul  8 09:31:19 PDT 2012
341:notice:fetch --->  Fetching distfiles for mongodb
342:debug:fetch Can't run fetch on this port without elevated privileges. Escalating privileges back to root.
343:debug:fetch euid changed to: 0. egid changed to: 0.
344:debug:fetch changing euid/egid - current euid: 0 - current egid: 0
345:debug:fetch egid changed to: 501
346:debug:fetch euid changed to: 502
347:debug:fetch Executing org.macports.fetch (mongodb)
348:info:fetch --->  mongodb-src-r2.0.6.tar.gz doesn't seem to exist in /opt/local/var/macports/distfiles/mongodb
349:notice:fetch --->  Attempting to fetch mongodb-src-r2.0.6.tar.gz from http://distfiles.macports.org/mongodb
350:debug:fetch Privilege de-escalation not attempted as not running as root.
351:debug:checksum checksum phase started at Sun Jul  8 09:31:21 PDT 2012
352:notice:checksum --->  Verifying checksum(s) for mongodb
353:debug:checksum Executing org.macports.checksum (mongodb)
354:info:checksum --->  Checksumming mongodb-src-r2.0.6.tar.gz
355:debug:checksum Correct (rmd160) checksum for mongodb-src-r2.0.6.tar.gz
356:debug:checksum Correct (sha256) checksum for mongodb-src-r2.0.6.tar.gz
357:debug:checksum Privilege de-escalation not attempted as not running as root.
358:debug:extract extract phase started at Sun Jul  8 09:31:24 PDT 2012
359:notice:extract --->  Extracting mongodb
360:debug:extract Executing org.macports.extract (mongodb)
361:info:extract --->  Extracting mongodb-src-r2.0.6.tar.gz
362:debug:extract setting option extract.args to '/opt/local/var/macports/distfiles/mongodb/mongodb-src-r2.0.6.tar.gz'
363:debug:extract Environment: CPATH='/opt/local/include' CC_PRINT_OPTIONS_FILE='/opt/local/var/macports/build/_opt_local_var_macports_sources_rsync.macports.org_release_tarballs_ports_databases_mongodb/mongodb/work/.CC_PRINT_OPTIONS' LIBRARY_PATH='/opt/local/lib' CC_PRINT_OPTIONS='YES' MACOSX_DEPLOYMENT_TARGET='10.7'
364:debug:extract Assembled command: 'cd "/opt/local/var/macports/build/_opt_local_var_macports_sources_rsync.macports.org_release_tarballs_ports_databases_mongodb/mongodb/work" && /usr/bin/gzip -dc '/opt/local/var/macports/distfiles/mongodb/mongodb-src-r2.0.6.tar.gz' | /usr/bin/gnutar --no-same-owner -xf -'
365:debug:extract Executing command line:  cd "/opt/local/var/macports/build/_opt_local_var_macports_sources_rsync.macports.org_release_tarballs_ports_databases_mongodb/mongodb/work" && /usr/bin/gzip -dc '/opt/local/var/macports/distfiles/mongodb/mongodb-src-r2.0.6.tar.gz' | /usr/bin/gnutar --no-same-owner -xf -
366:debug:extract changing euid/egid - current euid: 0 - current egid: 0
367:debug:extract egid changed to: 501
368:debug:extract euid changed to: 502
369:debug:patch patch phase started at Sun Jul  8 09:31:26 PDT 2012
370:debug:patch Executing org.macports.patch (mongodb)
371:notice:patch --->  Applying patches to mongodb
372:info:patch --->  Applying patch-SConstruct.diff
373:debug:patch Environment: CPATH='/opt/local/include' CC_PRINT_OPTIONS_FILE='/opt/local/var/macports/build/_opt_local_var_macports_sources_rsync.macports.org_release_tarballs_ports_databases_mongodb/mongodb/work/.CC_PRINT_OPTIONS' LIBRARY_PATH='/opt/local/lib' CC_PRINT_OPTIONS='YES' MACOSX_DEPLOYMENT_TARGET='10.7'
374:debug:patch Assembled command: 'cd "/opt/local/var/macports/build/_opt_local_var_macports_sources_rsync.macports.org_release_tarballs_ports_databases_mongodb/mongodb/work/mongodb-src-r2.0.6" && /usr/bin/patch -p0'
375:debug:patch Executing command line:  cd "/opt/local/var/macports/build/_opt_local_var_macports_sources_rsync.macports.org_release_tarballs_ports_databases_mongodb/mongodb/work/mongodb-src-r2.0.6" && /usr/bin/patch -p0 < '/opt/local/var/macports/sources/rsync.macports.org/release/tarballs/ports/databases/mongodb/files/patch-SConstruct.diff'
376:info:patch patching file SConstruct
377:info:patch --->  Applying patch-distsrc-client-SConstruct.diff
378:debug:patch Environment: CPATH='/opt/local/include' CC_PRINT_OPTIONS_FILE='/opt/local/var/macports/build/_opt_local_var_macports_sources_rsync.macports.org_release_tarballs_ports_databases_mongodb/mongodb/work/.CC_PRINT_OPTIONS' LIBRARY_PATH='/opt/local/lib' CC_PRINT_OPTIONS='YES' MACOSX_DEPLOYMENT_TARGET='10.7'
379:debug:patch Assembled command: 'cd "/opt/local/var/macports/build/_opt_local_var_macports_sources_rsync.macports.org_release_tarballs_ports_databases_mongodb/mongodb/work/mongodb-src-r2.0.6" && /usr/bin/patch -p0'
380:debug:patch Executing command line:  cd "/opt/local/var/macports/build/_opt_local_var_macports_sources_rsync.macports.org_release_tarballs_ports_databases_mongodb/mongodb/work/mongodb-src-r2.0.6" && /usr/bin/patch -p0 < '/opt/local/var/macports/sources/rsync.macports.org/release/tarballs/ports/databases/mongodb/files/patch-distsrc-client-SConstruct.diff'
381:info:patch patching file distsrc/client/SConstruct
382:info:patch --->  Applying patch-util-compress.cpp.diff
383:debug:patch Environment: CPATH='/opt/local/include' CC_PRINT_OPTIONS_FILE='/opt/local/var/macports/build/_opt_local_var_macports_sources_rsync.macports.org_release_tarballs_ports_databases_mongodb/mongodb/work/.CC_PRINT_OPTIONS' LIBRARY_PATH='/opt/local/lib' CC_PRINT_OPTIONS='YES' MACOSX_DEPLOYMENT_TARGET='10.7'
384:debug:patch Assembled command: 'cd "/opt/local/var/macports/build/_opt_local_var_macports_sources_rsync.macports.org_release_tarballs_ports_databases_mongodb/mongodb/work/mongodb-src-r2.0.6" && /usr/bin/patch -p0'
385:debug:patch Executing command line:  cd "/opt/local/var/macports/build/_opt_local_var_macports_sources_rsync.macports.org_release_tarballs_ports_databases_mongodb/mongodb/work/mongodb-src-r2.0.6" && /usr/bin/patch -p0 < '/opt/local/var/macports/sources/rsync.macports.org/release/tarballs/ports/databases/mongodb/files/patch-util-compress.cpp.diff'
386:info:patch patching file util/compress.cpp
387:debug:patch Executing proc-post-org.macports.patch-patch-0
388:debug:patch Executing reinplace: /usr/bin/sed s|@@PREFIX@@|/opt/local|g < /opt/local/var/macports/build/_opt_local_var_macports_sources_rsync.macports.org_release_tarballs_ports_databases_mongodb/mongodb/work/mongodb-src-r2.0.6/SConstruct >@ file10
389:debug:patch euid/egid changed to: 0/0
390:debug:patch chowned /opt/local/var/macports/build/_opt_local_var_macports_sources_rsync.macports.org_release_tarballs_ports_databases_mongodb/mongodb/work/mongodb-src-r2.0.6/SConstruct to macports
391:debug:patch euid/egid changed to: 502/501
392:debug:patch euid/egid changed to: 0/0
393:debug:patch setting attributes on /opt/local/var/macports/build/_opt_local_var_macports_sources_rsync.macports.org_release_tarballs_ports_databases_mongodb/mongodb/work/mongodb-src-r2.0.6/SConstruct
394:debug:patch euid/egid changed to: 502/501
395:debug:patch Executing reinplace: /usr/bin/sed s|@@PREFIX@@|/opt/local|g < /opt/local/var/macports/build/_opt_local_var_macports_sources_rsync.macports.org_release_tarballs_ports_databases_mongodb/mongodb/work/mongodb-src-r2.0.6/distsrc/client/SConstruct >@ file10
396:debug:patch euid/egid changed to: 0/0
397:debug:patch chowned /opt/local/var/macports/build/_opt_local_var_macports_sources_rsync.macports.org_release_tarballs_ports_databases_mongodb/mongodb/work/mongodb-src-r2.0.6/distsrc/client/SConstruct to macports
398:debug:patch euid/egid changed to: 502/501
399:debug:patch euid/egid changed to: 0/0
400:debug:patch setting attributes on /opt/local/var/macports/build/_opt_local_var_macports_sources_rsync.macports.org_release_tarballs_ports_databases_mongodb/mongodb/work/mongodb-src-r2.0.6/distsrc/client/SConstruct
401:debug:patch euid/egid changed to: 502/501
402:debug:patch Privilege de-escalation not attempted as not running as root.
403:debug:configure configure phase started at Sun Jul  8 09:31:26 PDT 2012
404:notice:configure --->  Configuring mongodb
405:debug:configure Using compiler 'Mac OS X clang'
406:debug:configure Executing org.macports.configure (mongodb)
407:debug:configure Privilege de-escalation not attempted as not running as root.
408:debug:build build phase started at Sun Jul  8 09:31:26 PDT 2012
409:notice:build --->  Building mongodb
410:debug:build Executing org.macports.build (mongodb)
411:debug:build Environment: CPATH='/opt/local/include' CC_PRINT_OPTIONS_FILE='/opt/local/var/macports/build/_opt_local_var_macports_sources_rsync.macports.org_release_tarballs_ports_databases_mongodb/mongodb/work/.CC_PRINT_OPTIONS' CXXFLAGS='-arch x86_64' CPPFLAGS='-I/opt/local/include/js' CFLAGS='-arch x86_64' TERM='xterm' LIBRARY_PATH='/opt/local/lib' CC_PRINT_OPTIONS='YES' MACOSX_DEPLOYMENT_TARGET='10.7' LINKFLAGS='-arch x86_64 -lpcre'
412:debug:build Assembled command: 'cd "/opt/local/var/macports/build/_opt_local_var_macports_sources_rsync.macports.org_release_tarballs_ports_databases_mongodb/mongodb/work/mongodb-src-r2.0.6" && scons -j2 all mongobridge mongosniff --cxx=/usr/bin/clang++ --full --use-system-all --usesm'
413:debug:build Executing command line:  cd "/opt/local/var/macports/build/_opt_local_var_macports_sources_rsync.macports.org_release_tarballs_ports_databases_mongodb/mongodb/work/mongodb-src-r2.0.6" && scons -j2 all mongobridge mongosniff --cxx=/usr/bin/clang++ --full --use-system-all --usesm
414:info:build scons: Reading SConscript files ...
415:info:build scons version: 2.0.1
416:info:build python version: 2 7 3 'final' 0
417:info:build using system version of: pcre
418:info:build using system version of: sm
419:info:build using system version of: snappy
420:info:build Checking whether the C++ compiler worksyes
421:info:build Checking for C library stdc++... yes
422:info:build Checking for C++ header file boost/filesystem/operations.hpp... yes
423:info:build Checking for C library boost_system-mt... yes
424:info:build Checking for C library boost_thread-mt... yes
425:info:build Checking for C library boost_filesystem-mt... yes
426:info:build Checking for C library boost_program_options-mt... yes
427:info:build Checking for C++ header file execinfo.h... yes
428:info:build Checking for C library pcap... yes
429:info:build Checking whether the C++ compiler worksyes
430:info:build Checking for C++ header file boost/filesystem/operations.hpp... yes
431:info:build Checking for C library boost_system-mt... yes
432:info:build Checking for C library boost_thread-mt... yes
433:info:build Checking for C library boost_filesystem-mt... yes
434:info:build Checking for C library boost_program_options-mt... yes
435:info:build Checking for C++ header file execinfo.h... yes
436:info:build Checking for C library pcap... yes
437:info:build scons: done reading SConscript files.
438:info:build scons: Building targets ...
439:info:build /usr/bin/clang++ -o pch.o -c -arch x86_64 -Wnon-virtual-dtor -I/opt/local/include/js -fPIC -fno-strict-aliasing -ggdb -pthread -Wall -Wsign-compare -Wno-unknown-pragmas -Winvalid-pch -O3 -D_SCONS -DMONGO_EXPOSE_MACROS -D_FILE_OFFSET_BITS=64 -DXP_UNIX -I. -I/opt/local/include pch.cpp
440:info:build clang: warning: argument unused during compilation: '-ggdb'
441:info:build /usr/bin/clang++ -o buildinfo.o -c -arch x86_64 -Wnon-virtual-dtor -I/opt/local/include/js -fPIC -fno-strict-aliasing -ggdb -pthread -Wall -Wsign-compare -Wno-unknown-pragmas -Winvalid-pch -O3 -D_SCONS -DMONGO_EXPOSE_MACROS -D_FILE_OFFSET_BITS=64 -DXP_UNIX -I. -I/opt/local/include buildinfo.cpp
442:info:build clang: warning: argument unused during compilation: '-ggdb'
443:info:build In file included from pch.cpp:18:
444:info:build In file included from ./pch.h:83:
445:info:build In file included from /opt/local/include/boost/filesystem/convenience.hpp:22:
446:info:build In file included from /opt/local/include/boost/filesystem/operations.hpp:24:
447:info:build /opt/local/include/boost/filesystem/config.hpp:16:5: error: #error Compiling Filesystem version 3 file with BOOST_FILESYSTEM_VERSION defined != 3
448:info:build In file included from buildinfo.cpp:1:
449:info:build In file included from ./pch.h:83:
450:info:build In file included from /opt/local/include/boost/filesystem/convenience.hpp:22:
451:info:build In file included from /opt/local/include/boost/filesystem/operations.hpp:24:
452:info:build /opt/local/include/boost/filesystem/config.hpp:16:5: error: #error Compiling Filesystem version 3 file with BOOST_FILESYSTEM_VERSION defined != 3
453:info:build #   error Compiling Filesystem version 3 file with BOOST_FILESYSTEM_VERSION defined != 3
454:info:build     ^
455:info:build #   error Compiling Filesystem version 3 file with BOOST_FILESYSTEM_VERSION defined != 3
456:info:build     ^
457:info:build In file included from pch.cpp:18:
458:info:build In file included from ./pch.h:161:
459:info:build In file included from ./util/goodies.h:22:
460:info:build ./util/concurrency/mutex.h:32:38: error: no member named 'TIME_UTC' in namespace 'boost'; did you mean 'TIME_UTC_'?
461:info:build         boost::xtime_get(&xt, boost::TIME_UTC);
462:info:build                               ~~~~~~~^~~~~~~~
463:info:build                                      TIME_UTC_
464:info:build /opt/local/include/boost/thread/xtime.hpp:23:5: note: 'TIME_UTC_' declared here
465:info:build     TIME_UTC_=1
466:info:build     ^
467:info:build In file included from buildinfo.cpp:1:
468:info:build In file included from ./pch.h:161:
469:info:build In file included from ./util/goodies.h:22:
470:info:build ./util/concurrency/mutex.h:32:38: error: no member named 'TIME_UTC' in namespace 'boost'; did you mean 'TIME_UTC_'?
471:info:build         boost::xtime_get(&xt, boost::TIME_UTC);
472:info:build                               ~~~~~~~^~~~~~~~
473:info:build                                      TIME_UTC_
474:info:build /opt/local/include/boost/thread/xtime.hpp:23:5: note: 'TIME_UTC_' declared here
475:info:build     TIME_UTC_=1
476:info:build     ^
477:info:build 2 errors generated.
478:info:build 2 errors generated.
479:info:build scons: *** [buildinfo.o] Error 1
480:info:build scons: *** [pch.o] Error 1
481:info:build scons: building terminated because of errors.
482:info:build Command failed:  cd "/opt/local/var/macports/build/_opt_local_var_macports_sources_rsync.macports.org_release_tarballs_ports_databases_mongodb/mongodb/work/mongodb-src-r2.0.6" && scons -j2 all mongobridge mongosniff --cxx=/usr/bin/clang++ --full --use-system-all --usesm
483:info:build Exit code: 2
484:error:build org.macports.build for port mongodb returned: command execution failed
485:debug:build Error code: CHILDSTATUS 88858 2
486:debug:build Backtrace: command execution failed
487    while executing
488"system -nice 0 $fullcmdstring"
489    ("eval" body line 1)
490    invoked from within
491"eval system $notty $nice \$fullcmdstring"
492    invoked from within
493"command_exec build"
494    (procedure "portbuild::build_main" line 8)
495    invoked from within
496"$procedure $targetname"
497:info:build Warning: targets not executed for mongodb: org.macports.activate org.macports.build org.macports.destroot org.macports.install
498:notice:build Please see the log file for port mongodb for details:
499    /opt/local/var/macports/logs/_opt_local_var_macports_sources_rsync.macports.org_release_tarballs_ports_databases_mongodb/mongodb/main.log