New Ticket     Tickets     Wiki     Browse Source     Timeline     Roadmap     Ticket Reports     Search

Ticket #36632: main.log

File main.log, 230.1 KB (added by ajacobo@…, 18 months ago)
Line 
1version:1
2:debug:main epoch: in tree: 1 installed: 1
3:debug:main mesa 8.0.4_1 exists in the ports tree
4:debug:main mesa 8.0.4_1 +python27 is the latest installed
5:debug:main mesa 8.0.4_1 +python27 is active
6:debug:main Merging existing variants '+python27' into variants
7:debug:main new fully merged portvariants: python27 +
8:debug:main Changing to port directory: /opt/local/var/macports/sources/rsync.macports.org/release/tarballs/ports/x11/mesa
9:debug:main OS darwin/12.2.0 (Mac OS X 10.8) arch i386
10:debug:main org.macports.load registered provides 'load', a pre-existing procedure. Target override will not be provided
11:debug:main org.macports.unload registered provides 'unload', a pre-existing procedure. Target override will not be provided
12:debug:main org.macports.distfiles registered provides 'distfiles', a pre-existing procedure. Target override will not be provided
13:debug:main Reading variant descriptions from /opt/local/var/macports/sources/rsync.macports.org/release/tarballs/ports/_resources/port1.0/variant_descriptions.conf
14:debug:main universal variant already exists, so not adding the default one
15:debug:main Executing variant python27 provides python27
16:debug:main No need to upgrade! mesa 8.0.4_1 >= mesa 8.0.4_1
17:debug:main epoch: in tree: 0 installed: 0
18:debug:main xorg-glproto 1.4.16_0 exists in the ports tree
19:debug:main xorg-glproto 1.4.16_0  is the latest installed
20:debug:main xorg-glproto 1.4.16_0  is active
21:debug:main Merging existing variants '' into variants
22:debug:main new fully merged portvariants:
23:debug:main Changing to port directory: /opt/local/var/macports/sources/rsync.macports.org/release/tarballs/ports/x11/xorg-glproto
24:debug:main OS darwin/12.2.0 (Mac OS X 10.8) arch i386
25:debug:main org.macports.load registered provides 'load', a pre-existing procedure. Target override will not be provided
26:debug:main org.macports.unload registered provides 'unload', a pre-existing procedure. Target override will not be provided
27:debug:main org.macports.distfiles registered provides 'distfiles', a pre-existing procedure. Target override will not be provided
28:debug:main only one arch supported, so not adding the default universal variant
29:debug:main No need to upgrade! xorg-glproto 1.4.16_0 >= xorg-glproto 1.4.16_0
30:debug:main epoch: in tree: 0 installed: 0
31:debug:main xorg-dri2proto 2.8_0 exists in the ports tree
32:debug:main xorg-dri2proto 2.8_0  is the latest installed
33:debug:main xorg-dri2proto 2.8_0  is active
34:debug:main Merging existing variants '' into variants
35:debug:main new fully merged portvariants:
36:debug:main Changing to port directory: /opt/local/var/macports/sources/rsync.macports.org/release/tarballs/ports/x11/xorg-dri2proto
37:debug:main OS darwin/12.2.0 (Mac OS X 10.8) arch i386
38:debug:main org.macports.load registered provides 'load', a pre-existing procedure. Target override will not be provided
39:debug:main org.macports.unload registered provides 'unload', a pre-existing procedure. Target override will not be provided
40:debug:main org.macports.distfiles registered provides 'distfiles', a pre-existing procedure. Target override will not be provided
41:debug:main only one arch supported, so not adding the default universal variant
42:debug:main No need to upgrade! xorg-dri2proto 2.8_0 >= xorg-dri2proto 2.8_0
43:debug:main epoch: in tree: 0 installed: 0
44:debug:main xorg-libXfixes 5.0_0 exists in the ports tree
45:debug:main xorg-libXfixes 5.0_0  is the latest installed
46:debug:main xorg-libXfixes 5.0_0  is active
47:debug:main Merging existing variants '' into variants
48:debug:main new fully merged portvariants:
49:debug:main Changing to port directory: /opt/local/var/macports/sources/rsync.macports.org/release/tarballs/ports/x11/xorg-libXfixes
50:debug:main OS darwin/12.2.0 (Mac OS X 10.8) arch i386
51:debug:main org.macports.load registered provides 'load', a pre-existing procedure. Target override will not be provided
52:debug:main org.macports.unload registered provides 'unload', a pre-existing procedure. Target override will not be provided
53:debug:main org.macports.distfiles registered provides 'distfiles', a pre-existing procedure. Target override will not be provided
54:debug:main adding the default universal variant
55:debug:main Reading variant descriptions from /opt/local/var/macports/sources/rsync.macports.org/release/tarballs/ports/_resources/port1.0/variant_descriptions.conf
56:debug:main No need to upgrade! xorg-libXfixes 5.0_0 >= xorg-libXfixes 5.0_0
57:debug:main epoch: in tree: 0 installed: 0
58:debug:main xorg-libX11 1.5.0_0 exists in the ports tree
59:debug:main xorg-libX11 1.5.0_0  is the latest installed
60:debug:main xorg-libX11 1.5.0_0  is active
61:debug:main Merging existing variants '' into variants
62:debug:main new fully merged portvariants:
63:debug:main Changing to port directory: /opt/local/var/macports/sources/rsync.macports.org/release/tarballs/ports/x11/xorg-libX11
64:debug:main OS darwin/12.2.0 (Mac OS X 10.8) arch i386
65:debug:main org.macports.load registered provides 'load', a pre-existing procedure. Target override will not be provided
66:debug:main org.macports.unload registered provides 'unload', a pre-existing procedure. Target override will not be provided
67:debug:main org.macports.distfiles registered provides 'distfiles', a pre-existing procedure. Target override will not be provided
68:debug:main adding the default universal variant
69:debug:main Reading variant descriptions from /opt/local/var/macports/sources/rsync.macports.org/release/tarballs/ports/_resources/port1.0/variant_descriptions.conf
70:debug:main No need to upgrade! xorg-libX11 1.5.0_0 >= xorg-libX11 1.5.0_0
71:debug:main epoch: in tree: 0 installed: 0
72:debug:main xorg-libXdmcp 1.1.1_0 exists in the ports tree
73:debug:main xorg-libXdmcp 1.1.1_0  is the latest installed
74:debug:main xorg-libXdmcp 1.1.1_0  is active
75:debug:main Merging existing variants '' into variants
76:debug:main new fully merged portvariants:
77:debug:main Changing to port directory: /opt/local/var/macports/sources/rsync.macports.org/release/tarballs/ports/x11/xorg-libXdmcp
78:debug:main OS darwin/12.2.0 (Mac OS X 10.8) arch i386
79:debug:main org.macports.load registered provides 'load', a pre-existing procedure. Target override will not be provided
80:debug:main org.macports.unload registered provides 'unload', a pre-existing procedure. Target override will not be provided
81:debug:main org.macports.distfiles registered provides 'distfiles', a pre-existing procedure. Target override will not be provided
82:debug:main adding the default universal variant
83:debug:main Reading variant descriptions from /opt/local/var/macports/sources/rsync.macports.org/release/tarballs/ports/_resources/port1.0/variant_descriptions.conf
84:debug:main No need to upgrade! xorg-libXdmcp 1.1.1_0 >= xorg-libXdmcp 1.1.1_0
85:debug:main epoch: in tree: 0 installed: 0
86:debug:main xorg-libXau 1.0.7_0 exists in the ports tree
87:debug:main xorg-libXau 1.0.7_0  is the latest installed
88:debug:main xorg-libXau 1.0.7_0  is active
89:debug:main Merging existing variants '' into variants
90:debug:main new fully merged portvariants:
91:debug:main Changing to port directory: /opt/local/var/macports/sources/rsync.macports.org/release/tarballs/ports/x11/xorg-libXau
92:debug:main OS darwin/12.2.0 (Mac OS X 10.8) arch i386
93:debug:main org.macports.load registered provides 'load', a pre-existing procedure. Target override will not be provided
94:debug:main org.macports.unload registered provides 'unload', a pre-existing procedure. Target override will not be provided
95:debug:main org.macports.distfiles registered provides 'distfiles', a pre-existing procedure. Target override will not be provided
96:debug:main adding the default universal variant
97:debug:main Reading variant descriptions from /opt/local/var/macports/sources/rsync.macports.org/release/tarballs/ports/_resources/port1.0/variant_descriptions.conf
98:debug:main No need to upgrade! xorg-libXau 1.0.7_0 >= xorg-libXau 1.0.7_0
99:debug:main epoch: in tree: 0 installed: 0
100:debug:main xorg-xproto 7.0.23_0 exists in the ports tree
101:debug:main xorg-xproto 7.0.23_0  is the latest installed
102:debug:main xorg-xproto 7.0.23_0  is active
103:debug:main Merging existing variants '' into variants
104:debug:main new fully merged portvariants:
105:debug:main Changing to port directory: /opt/local/var/macports/sources/rsync.macports.org/release/tarballs/ports/x11/xorg-xproto
106:debug:main OS darwin/12.2.0 (Mac OS X 10.8) arch i386
107:debug:main org.macports.load registered provides 'load', a pre-existing procedure. Target override will not be provided
108:debug:main org.macports.unload registered provides 'unload', a pre-existing procedure. Target override will not be provided
109:debug:main org.macports.distfiles registered provides 'distfiles', a pre-existing procedure. Target override will not be provided
110:debug:main only one arch supported, so not adding the default universal variant
111:debug:main No need to upgrade! xorg-xproto 7.0.23_0 >= xorg-xproto 7.0.23_0
112:debug:main epoch: in tree: 0 installed: 0
113:debug:main xorg-libxcb 1.8.1_2 exists in the ports tree
114:debug:main xorg-libxcb 1.8.1_2 +python27 is the latest installed
115:debug:main xorg-libxcb 1.8.1_2 +python27 is active
116:debug:main Merging existing variants '+python27' into variants
117:debug:main new fully merged portvariants: python27 +
118:debug:main Changing to port directory: /opt/local/var/macports/sources/rsync.macports.org/release/tarballs/ports/x11/xorg-libxcb
119:debug:main OS darwin/12.2.0 (Mac OS X 10.8) arch i386
120:debug:main org.macports.load registered provides 'load', a pre-existing procedure. Target override will not be provided
121:debug:main org.macports.unload registered provides 'unload', a pre-existing procedure. Target override will not be provided
122:debug:main org.macports.distfiles registered provides 'distfiles', a pre-existing procedure. Target override will not be provided
123:debug:main adding the default universal variant
124:debug:main Reading variant descriptions from /opt/local/var/macports/sources/rsync.macports.org/release/tarballs/ports/_resources/port1.0/variant_descriptions.conf
125:debug:main Executing variant python27 provides python27
126:debug:main No need to upgrade! xorg-libxcb 1.8.1_2 >= xorg-libxcb 1.8.1_2
127:debug:main epoch: in tree: 0 installed: 0
128:debug:main xorg-xcb-proto 1.7.1_0 exists in the ports tree
129:debug:main xorg-xcb-proto 1.7.1_0 +python27 is the latest installed
130:debug:main xorg-xcb-proto 1.7.1_0 +python27 is active
131:debug:main Merging existing variants '+python27' into variants
132:debug:main new fully merged portvariants: python27 +
133:debug:main Changing to port directory: /opt/local/var/macports/sources/rsync.macports.org/release/tarballs/ports/x11/xorg-xcb-proto
134:debug:main OS darwin/12.2.0 (Mac OS X 10.8) arch i386
135:debug:main org.macports.load registered provides 'load', a pre-existing procedure. Target override will not be provided
136:debug:main org.macports.unload registered provides 'unload', a pre-existing procedure. Target override will not be provided
137:debug:main org.macports.distfiles registered provides 'distfiles', a pre-existing procedure. Target override will not be provided
138:debug:main only one arch supported, so not adding the default universal variant
139:debug:main Executing variant python27 provides python27
140:debug:main No need to upgrade! xorg-xcb-proto 1.7.1_0 >= xorg-xcb-proto 1.7.1_0
141:debug:main epoch: in tree: 0 installed: 0
142:debug:main libxml2 2.8.0_0 exists in the ports tree
143:debug:main libxml2 2.8.0_0  is the latest installed
144:debug:main libxml2 2.8.0_0  is active
145:debug:main Merging existing variants '' into variants
146:debug:main new fully merged portvariants:
147:debug:main Changing to port directory: /opt/local/var/macports/sources/rsync.macports.org/release/tarballs/ports/textproc/libxml2
148:debug:main OS darwin/12.2.0 (Mac OS X 10.8) arch i386
149:debug:main org.macports.load registered provides 'load', a pre-existing procedure. Target override will not be provided
150:debug:main org.macports.unload registered provides 'unload', a pre-existing procedure. Target override will not be provided
151:debug:main org.macports.distfiles registered provides 'distfiles', a pre-existing procedure. Target override will not be provided
152:debug:main adding the default universal variant
153:debug:main Reading variant descriptions from /opt/local/var/macports/sources/rsync.macports.org/release/tarballs/ports/_resources/port1.0/variant_descriptions.conf
154:debug:main No need to upgrade! libxml2 2.8.0_0 >= libxml2 2.8.0_0
155:debug:main epoch: in tree: 0 installed: 0
156:debug:main libiconv 1.14_0 exists in the ports tree
157:debug:main libiconv 1.14_0  is the latest installed
158:debug:main libiconv 1.14_0 +universal is active
159:debug:main Merging existing variants '+universal' into variants
160:debug:main new fully merged portvariants: universal +
161:debug:main Changing to port directory: /opt/local/var/macports/sources/rsync.macports.org/release/tarballs/ports/textproc/libiconv
162:debug:main OS darwin/12.2.0 (Mac OS X 10.8) arch i386
163:debug:main org.macports.load registered provides 'load', a pre-existing procedure. Target override will not be provided
164:debug:main org.macports.unload registered provides 'unload', a pre-existing procedure. Target override will not be provided
165:debug:main org.macports.distfiles registered provides 'distfiles', a pre-existing procedure. Target override will not be provided
166:debug:main Using group file /opt/local/var/macports/sources/rsync.macports.org/release/tarballs/ports/_resources/port1.0/group/muniversal-1.0.tcl
167:debug:main Reading variant descriptions from /opt/local/var/macports/sources/rsync.macports.org/release/tarballs/ports/_resources/port1.0/variant_descriptions.conf
168:debug:main universal variant already exists, so not adding the default one
169:debug:main Executing variant universal provides universal
170:debug:main No need to upgrade! libiconv 1.14_0 >= libiconv 1.14_0
171:debug:main epoch: in tree: 0 installed: 0
172:debug:main zlib 1.2.7_0 exists in the ports tree
173:debug:main zlib 1.2.7_0  is the latest installed
174:debug:main zlib 1.2.7_0 +universal is active
175:debug:main Merging existing variants '+universal' into variants
176:debug:main new fully merged portvariants: universal +
177:debug:main Changing to port directory: /opt/local/var/macports/sources/rsync.macports.org/release/tarballs/ports/archivers/zlib
178:debug:main OS darwin/12.2.0 (Mac OS X 10.8) arch i386
179:debug:main org.macports.load registered provides 'load', a pre-existing procedure. Target override will not be provided
180:debug:main org.macports.unload registered provides 'unload', a pre-existing procedure. Target override will not be provided
181:debug:main org.macports.distfiles registered provides 'distfiles', a pre-existing procedure. Target override will not be provided
182:debug:main Using group file /opt/local/var/macports/sources/rsync.macports.org/release/tarballs/ports/_resources/port1.0/group/xcodeversion-1.0.tcl
183:debug:main adding the default universal variant
184:debug:main Reading variant descriptions from /opt/local/var/macports/sources/rsync.macports.org/release/tarballs/ports/_resources/port1.0/variant_descriptions.conf
185:debug:main Executing variant universal provides universal
186:debug:main No need to upgrade! zlib 1.2.7_0 >= zlib 1.2.7_0
187:debug:main epoch: in tree: 0 installed: 0
188:debug:main xz 5.0.4_0 exists in the ports tree
189:debug:main xz 5.0.4_0  is the latest installed
190:debug:main xz 5.0.4_0  is active
191:debug:main Merging existing variants '' into variants
192:debug:main new fully merged portvariants:
193:debug:main Changing to port directory: /opt/local/var/macports/sources/rsync.macports.org/release/tarballs/ports/archivers/xz
194:debug:main OS darwin/12.2.0 (Mac OS X 10.8) arch i386
195:debug:main org.macports.load registered provides 'load', a pre-existing procedure. Target override will not be provided
196:debug:main org.macports.unload registered provides 'unload', a pre-existing procedure. Target override will not be provided
197:debug:main org.macports.distfiles registered provides 'distfiles', a pre-existing procedure. Target override will not be provided
198:debug:main adding the default universal variant
199:debug:main Reading variant descriptions from /opt/local/var/macports/sources/rsync.macports.org/release/tarballs/ports/_resources/port1.0/variant_descriptions.conf
200:debug:main No need to upgrade! xz 5.0.4_0 >= xz 5.0.4_0
201:debug:main epoch: in tree: 0 installed: 0
202:debug:main gettext 0.18.1.1_2 exists in the ports tree
203:debug:main gettext 0.18.1.1_2  is the latest installed
204:debug:main gettext 0.18.1.1_2 +universal is active
205:debug:main Merging existing variants '+universal' into variants
206:debug:main new fully merged portvariants: universal +
207:debug:main Changing to port directory: /opt/local/var/macports/sources/rsync.macports.org/release/tarballs/ports/devel/gettext
208:debug:main OS darwin/12.2.0 (Mac OS X 10.8) arch i386
209:debug:main org.macports.load registered provides 'load', a pre-existing procedure. Target override will not be provided
210:debug:main org.macports.unload registered provides 'unload', a pre-existing procedure. Target override will not be provided
211:debug:main org.macports.distfiles registered provides 'distfiles', a pre-existing procedure. Target override will not be provided
212:debug:main Using group file /opt/local/var/macports/sources/rsync.macports.org/release/tarballs/ports/_resources/port1.0/group/muniversal-1.0.tcl
213:debug:main Reading variant descriptions from /opt/local/var/macports/sources/rsync.macports.org/release/tarballs/ports/_resources/port1.0/variant_descriptions.conf
214:debug:main Using group file /opt/local/var/macports/sources/rsync.macports.org/release/tarballs/ports/_resources/port1.0/group/archcheck-1.0.tcl
215:debug:main universal variant already exists, so not adding the default one
216:debug:main Executing variant universal provides universal
217:debug:main No need to upgrade! gettext 0.18.1.1_2 >= gettext 0.18.1.1_2
218:debug:main epoch: in tree: 0 installed: 0
219:debug:main ncurses 5.9_1 exists in the ports tree
220:debug:main ncurses 5.9_1  is the latest installed
221:debug:main ncurses 5.9_1 +universal is active
222:debug:main Merging existing variants '+universal' into variants
223:debug:main new fully merged portvariants: universal +
224:debug:main Changing to port directory: /opt/local/var/macports/sources/rsync.macports.org/release/tarballs/ports/devel/ncurses
225:debug:main OS darwin/12.2.0 (Mac OS X 10.8) arch i386
226:debug:main org.macports.load registered provides 'load', a pre-existing procedure. Target override will not be provided
227:debug:main org.macports.unload registered provides 'unload', a pre-existing procedure. Target override will not be provided
228:debug:main org.macports.distfiles registered provides 'distfiles', a pre-existing procedure. Target override will not be provided
229:debug:main adding the default universal variant
230:debug:main Reading variant descriptions from /opt/local/var/macports/sources/rsync.macports.org/release/tarballs/ports/_resources/port1.0/variant_descriptions.conf
231:debug:main Executing variant universal provides universal
232:debug:main No need to upgrade! ncurses 5.9_1 >= ncurses 5.9_1
233:debug:main epoch: in tree: 0 installed: 0
234:debug:main expat 2.1.0_0 exists in the ports tree
235:debug:main expat 2.1.0_0  is the latest installed
236:debug:main expat 2.1.0_0 +universal is active
237:debug:main Merging existing variants '+universal' into variants
238:debug:main new fully merged portvariants: universal +
239:debug:main Changing to port directory: /opt/local/var/macports/sources/rsync.macports.org/release/tarballs/ports/textproc/expat
240:debug:main OS darwin/12.2.0 (Mac OS X 10.8) arch i386
241:debug:main org.macports.load registered provides 'load', a pre-existing procedure. Target override will not be provided
242:debug:main org.macports.unload registered provides 'unload', a pre-existing procedure. Target override will not be provided
243:debug:main org.macports.distfiles registered provides 'distfiles', a pre-existing procedure. Target override will not be provided
244:debug:main adding the default universal variant
245:debug:main Reading variant descriptions from /opt/local/var/macports/sources/rsync.macports.org/release/tarballs/ports/_resources/port1.0/variant_descriptions.conf
246:debug:main Executing variant universal provides universal
247:debug:main No need to upgrade! expat 2.1.0_0 >= expat 2.1.0_0
248:debug:main epoch: in tree: 2 installed: 2
249:debug:main python27 2.7.3_0 exists in the ports tree
250:debug:main python27 2.7.3_0  is the latest installed
251:debug:main python27 2.7.3_0 +universal is active
252:debug:main Merging existing variants '+universal' into variants
253:debug:main new fully merged portvariants: universal +
254:debug:main Changing to port directory: /opt/local/var/macports/sources/rsync.macports.org/release/tarballs/ports/lang/python27
255:debug:main OS darwin/12.2.0 (Mac OS X 10.8) arch i386
256:debug:main org.macports.load registered provides 'load', a pre-existing procedure. Target override will not be provided
257:debug:main org.macports.unload registered provides 'unload', a pre-existing procedure. Target override will not be provided
258:debug:main org.macports.distfiles registered provides 'distfiles', a pre-existing procedure. Target override will not be provided
259:debug:main Using group file /opt/local/var/macports/sources/rsync.macports.org/release/tarballs/ports/_resources/port1.0/group/select-1.0.tcl
260:debug:main Reading variant descriptions from /opt/local/var/macports/sources/rsync.macports.org/release/tarballs/ports/_resources/port1.0/variant_descriptions.conf
261:debug:main universal variant already exists, so not adding the default one
262:debug:main Executing variant universal provides universal
263:debug:main No need to upgrade! python27 2.7.3_0 >= python27 2.7.3_0
264:debug:main epoch: in tree: 1 installed: 1
265:debug:main openssl 1.0.1c_0 exists in the ports tree
266:debug:main openssl 1.0.1c_0  is the latest installed
267:debug:main openssl 1.0.1c_0 +universal is active
268:debug:main Merging existing variants '+universal' into variants
269:debug:main new fully merged portvariants: universal +
270:debug:main Changing to port directory: /opt/local/var/macports/sources/rsync.macports.org/release/tarballs/ports/devel/openssl
271:debug:main OS darwin/12.2.0 (Mac OS X 10.8) arch i386
272:debug:main org.macports.load registered provides 'load', a pre-existing procedure. Target override will not be provided
273:debug:main org.macports.unload registered provides 'unload', a pre-existing procedure. Target override will not be provided
274:debug:main org.macports.distfiles registered provides 'distfiles', a pre-existing procedure. Target override will not be provided
275:debug:main Using group file /opt/local/var/macports/sources/rsync.macports.org/release/tarballs/ports/_resources/port1.0/group/muniversal-1.0.tcl
276:debug:main Reading variant descriptions from /opt/local/var/macports/sources/rsync.macports.org/release/tarballs/ports/_resources/port1.0/variant_descriptions.conf
277:debug:main universal variant already exists, so not adding the default one
278:debug:main Executing variant universal provides universal
279:debug:main No need to upgrade! openssl 1.0.1c_0 >= openssl 1.0.1c_0
280:debug:main epoch: in tree: 0 installed: 0
281:debug:main sqlite3 3.7.14.1_0 exists in the ports tree
282:debug:main sqlite3 3.7.14.1_0 +universal is the latest installed
283:debug:main sqlite3 3.7.14.1_0 +universal is active
284:debug:main Merging existing variants '+universal' into variants
285:debug:main new fully merged portvariants: universal +
286:debug:main Changing to port directory: /opt/local/var/macports/sources/rsync.macports.org/release/tarballs/ports/databases/sqlite3
287:debug:main OS darwin/12.2.0 (Mac OS X 10.8) arch i386
288:debug:main org.macports.load registered provides 'load', a pre-existing procedure. Target override will not be provided
289:debug:main org.macports.unload registered provides 'unload', a pre-existing procedure. Target override will not be provided
290:debug:main org.macports.distfiles registered provides 'distfiles', a pre-existing procedure. Target override will not be provided
291:debug:main adding the default universal variant
292:debug:main Reading variant descriptions from /opt/local/var/macports/sources/rsync.macports.org/release/tarballs/ports/_resources/port1.0/variant_descriptions.conf
293:debug:main Executing variant universal provides universal
294:debug:main No need to upgrade! sqlite3 3.7.14.1_0 >= sqlite3 3.7.14.1_0
295:debug:main epoch: in tree: 20090923 installed: 20090923
296:debug:main libedit 20120601-3.0_0 exists in the ports tree
297:debug:main libedit 20120601-3.0_0  is the latest installed
298:debug:main libedit 20120601-3.0_0 +universal is active
299:debug:main Merging existing variants '+universal' into variants
300:debug:main new fully merged portvariants: universal +
301:debug:main Changing to port directory: /opt/local/var/macports/sources/rsync.macports.org/release/tarballs/ports/devel/libedit
302:debug:main OS darwin/12.2.0 (Mac OS X 10.8) arch i386
303:debug:main org.macports.load registered provides 'load', a pre-existing procedure. Target override will not be provided
304:debug:main org.macports.unload registered provides 'unload', a pre-existing procedure. Target override will not be provided
305:debug:main org.macports.distfiles registered provides 'distfiles', a pre-existing procedure. Target override will not be provided
306:debug:main Using group file /opt/local/var/macports/sources/rsync.macports.org/release/tarballs/ports/_resources/port1.0/group/muniversal-1.0.tcl
307:debug:main Reading variant descriptions from /opt/local/var/macports/sources/rsync.macports.org/release/tarballs/ports/_resources/port1.0/variant_descriptions.conf
308:debug:main universal variant already exists, so not adding the default one
309:debug:main Executing variant universal provides universal
310:debug:main No need to upgrade! libedit 20120601-3.0_0 >= libedit 20120601-3.0_0
311:debug:main epoch: in tree: 0 installed: 0
312:debug:main db46 4.6.21_7 exists in the ports tree
313:debug:main db46 4.6.21_7 +universal is the latest installed
314:debug:main db46 4.6.21_7 +universal is active
315:debug:main Merging existing variants '+universal' into variants
316:debug:main new fully merged portvariants: universal +
317:debug:main Changing to port directory: /opt/local/var/macports/sources/rsync.macports.org/release/tarballs/ports/databases/db46
318:debug:main OS darwin/12.2.0 (Mac OS X 10.8) arch i386
319:debug:main org.macports.load registered provides 'load', a pre-existing procedure. Target override will not be provided
320:debug:main org.macports.unload registered provides 'unload', a pre-existing procedure. Target override will not be provided
321:debug:main org.macports.distfiles registered provides 'distfiles', a pre-existing procedure. Target override will not be provided
322:debug:main Using group file /opt/local/var/macports/sources/rsync.macports.org/release/tarballs/ports/_resources/port1.0/group/muniversal-1.0.tcl
323:debug:main Reading variant descriptions from /opt/local/var/macports/sources/rsync.macports.org/release/tarballs/ports/_resources/port1.0/variant_descriptions.conf
324:debug:main universal variant already exists, so not adding the default one
325:debug:main Executing variant universal provides universal
326:debug:main No need to upgrade! db46 4.6.21_7 >= db46 4.6.21_7
327:debug:main epoch: in tree: 0 installed: 0
328:debug:main bzip2 1.0.6_0 exists in the ports tree
329:debug:main bzip2 1.0.6_0  is the latest installed
330:debug:main bzip2 1.0.6_0 +universal is active
331:debug:main Merging existing variants '+universal' into variants
332:debug:main new fully merged portvariants: universal +
333:debug:main Changing to port directory: /opt/local/var/macports/sources/rsync.macports.org/release/tarballs/ports/archivers/bzip2
334:debug:main OS darwin/12.2.0 (Mac OS X 10.8) arch i386
335:debug:main org.macports.load registered provides 'load', a pre-existing procedure. Target override will not be provided
336:debug:main org.macports.unload registered provides 'unload', a pre-existing procedure. Target override will not be provided
337:debug:main org.macports.distfiles registered provides 'distfiles', a pre-existing procedure. Target override will not be provided
338:debug:main Reading variant descriptions from /opt/local/var/macports/sources/rsync.macports.org/release/tarballs/ports/_resources/port1.0/variant_descriptions.conf
339:debug:main universal variant already exists, so not adding the default one
340:debug:main Executing variant universal provides universal
341:debug:main No need to upgrade! bzip2 1.0.6_0 >= bzip2 1.0.6_0
342:debug:main epoch: in tree: 0 installed: 0
343:debug:main python_select 0.3_1 exists in the ports tree
344:debug:main python_select 0.3_1  is the latest installed
345:debug:main python_select 0.3_1  is active
346:debug:main Merging existing variants '' into variants
347:debug:main new fully merged portvariants:
348:debug:main Changing to port directory: /opt/local/var/macports/sources/rsync.macports.org/release/tarballs/ports/sysutils/python_select
349:debug:main OS darwin/12.2.0 (Mac OS X 10.8) arch i386
350:debug:main org.macports.load registered provides 'load', a pre-existing procedure. Target override will not be provided
351:debug:main org.macports.unload registered provides 'unload', a pre-existing procedure. Target override will not be provided
352:debug:main org.macports.distfiles registered provides 'distfiles', a pre-existing procedure. Target override will not be provided
353:debug:main Using group file /opt/local/var/macports/sources/rsync.macports.org/release/tarballs/ports/_resources/port1.0/group/select-1.0.tcl
354:debug:main universal_variant is false, so not adding the default universal variant
355:debug:main No need to upgrade! python_select 0.3_1 >= python_select 0.3_1
356:debug:main epoch: in tree: 0 installed: 0
357:debug:main xorg-libpthread-stubs 0.3_0 exists in the ports tree
358:debug:main xorg-libpthread-stubs 0.3_0  is the latest installed
359:debug:main xorg-libpthread-stubs 0.3_0  is active
360:debug:main Merging existing variants '' into variants
361:debug:main new fully merged portvariants:
362:debug:main Changing to port directory: /opt/local/var/macports/sources/rsync.macports.org/release/tarballs/ports/x11/xorg-libpthread-stubs
363:debug:main OS darwin/12.2.0 (Mac OS X 10.8) arch i386
364:debug:main org.macports.load registered provides 'load', a pre-existing procedure. Target override will not be provided
365:debug:main org.macports.unload registered provides 'unload', a pre-existing procedure. Target override will not be provided
366:debug:main org.macports.distfiles registered provides 'distfiles', a pre-existing procedure. Target override will not be provided
367:debug:main only one arch supported, so not adding the default universal variant
368:debug:main No need to upgrade! xorg-libpthread-stubs 0.3_0 >= xorg-libpthread-stubs 0.3_0
369:debug:main epoch: in tree: 0 installed: 0
370:debug:main xorg-kbproto 1.0.6_0 exists in the ports tree
371:debug:main xorg-kbproto 1.0.6_0  is the latest installed
372:debug:main xorg-kbproto 1.0.6_0  is active
373:debug:main Merging existing variants '' into variants
374:debug:main new fully merged portvariants:
375:debug:main Changing to port directory: /opt/local/var/macports/sources/rsync.macports.org/release/tarballs/ports/x11/xorg-kbproto
376:debug:main OS darwin/12.2.0 (Mac OS X 10.8) arch i386
377:debug:main org.macports.load registered provides 'load', a pre-existing procedure. Target override will not be provided
378:debug:main org.macports.unload registered provides 'unload', a pre-existing procedure. Target override will not be provided
379:debug:main org.macports.distfiles registered provides 'distfiles', a pre-existing procedure. Target override will not be provided
380:debug:main only one arch supported, so not adding the default universal variant
381:debug:main No need to upgrade! xorg-kbproto 1.0.6_0 >= xorg-kbproto 1.0.6_0
382:debug:main epoch: in tree: 0 installed: 0
383:debug:main xorg-fixesproto 5.0_0 exists in the ports tree
384:debug:main xorg-fixesproto 5.0_0  is the latest installed
385:debug:main xorg-fixesproto 5.0_0  is active
386:debug:main Merging existing variants '' into variants
387:debug:main new fully merged portvariants:
388:debug:main Changing to port directory: /opt/local/var/macports/sources/rsync.macports.org/release/tarballs/ports/x11/xorg-fixesproto
389:debug:main OS darwin/12.2.0 (Mac OS X 10.8) arch i386
390:debug:main org.macports.load registered provides 'load', a pre-existing procedure. Target override will not be provided
391:debug:main org.macports.unload registered provides 'unload', a pre-existing procedure. Target override will not be provided
392:debug:main org.macports.distfiles registered provides 'distfiles', a pre-existing procedure. Target override will not be provided
393:debug:main only one arch supported, so not adding the default universal variant
394:debug:main No need to upgrade! xorg-fixesproto 5.0_0 >= xorg-fixesproto 5.0_0
395:debug:main epoch: in tree: 0 installed: 0
396:debug:main xorg-libXi 1.6.1_0 exists in the ports tree
397:debug:main xorg-libXi 1.6.1_0  is the latest installed
398:debug:main xorg-libXi 1.6.1_0  is active
399:debug:main Merging existing variants '' into variants
400:debug:main new fully merged portvariants:
401:debug:main Changing to port directory: /opt/local/var/macports/sources/rsync.macports.org/release/tarballs/ports/x11/xorg-libXi
402:debug:main OS darwin/12.2.0 (Mac OS X 10.8) arch i386
403:debug:main org.macports.load registered provides 'load', a pre-existing procedure. Target override will not be provided
404:debug:main org.macports.unload registered provides 'unload', a pre-existing procedure. Target override will not be provided
405:debug:main org.macports.distfiles registered provides 'distfiles', a pre-existing procedure. Target override will not be provided
406:debug:main adding the default universal variant
407:debug:main Reading variant descriptions from /opt/local/var/macports/sources/rsync.macports.org/release/tarballs/ports/_resources/port1.0/variant_descriptions.conf
408:debug:main No need to upgrade! xorg-libXi 1.6.1_0 >= xorg-libXi 1.6.1_0
409:debug:main epoch: in tree: 0 installed: 0
410:debug:main xorg-libXext 1.3.1_0 exists in the ports tree
411:debug:main xorg-libXext 1.3.1_0  is the latest installed
412:debug:main xorg-libXext 1.3.1_0  is active
413:debug:main Merging existing variants '' into variants
414:debug:main new fully merged portvariants:
415:debug:main Changing to port directory: /opt/local/var/macports/sources/rsync.macports.org/release/tarballs/ports/x11/xorg-libXext
416:debug:main OS darwin/12.2.0 (Mac OS X 10.8) arch i386
417:debug:main org.macports.load registered provides 'load', a pre-existing procedure. Target override will not be provided
418:debug:main org.macports.unload registered provides 'unload', a pre-existing procedure. Target override will not be provided
419:debug:main org.macports.distfiles registered provides 'distfiles', a pre-existing procedure. Target override will not be provided
420:debug:main adding the default universal variant
421:debug:main Reading variant descriptions from /opt/local/var/macports/sources/rsync.macports.org/release/tarballs/ports/_resources/port1.0/variant_descriptions.conf
422:debug:main No need to upgrade! xorg-libXext 1.3.1_0 >= xorg-libXext 1.3.1_0
423:debug:main epoch: in tree: 0 installed: 0
424:debug:main xorg-xextproto 7.2.1_0 exists in the ports tree
425:debug:main xorg-xextproto 7.2.1_0  is the latest installed
426:debug:main xorg-xextproto 7.2.1_0  is active
427:debug:main Merging existing variants '' into variants
428:debug:main new fully merged portvariants:
429:debug:main Changing to port directory: /opt/local/var/macports/sources/rsync.macports.org/release/tarballs/ports/x11/xorg-xextproto
430:debug:main OS darwin/12.2.0 (Mac OS X 10.8) arch i386
431:debug:main org.macports.load registered provides 'load', a pre-existing procedure. Target override will not be provided
432:debug:main org.macports.unload registered provides 'unload', a pre-existing procedure. Target override will not be provided
433:debug:main org.macports.distfiles registered provides 'distfiles', a pre-existing procedure. Target override will not be provided
434:debug:main only one arch supported, so not adding the default universal variant
435:debug:main No need to upgrade! xorg-xextproto 7.2.1_0 >= xorg-xextproto 7.2.1_0
436:debug:main epoch: in tree: 0 installed: 0
437:debug:main xorg-inputproto 2.2_0 exists in the ports tree
438:debug:main xorg-inputproto 2.2_0  is the latest installed
439:debug:main xorg-inputproto 2.2_0  is active
440:debug:main Merging existing variants '' into variants
441:debug:main new fully merged portvariants:
442:debug:main Changing to port directory: /opt/local/var/macports/sources/rsync.macports.org/release/tarballs/ports/x11/xorg-inputproto
443:debug:main OS darwin/12.2.0 (Mac OS X 10.8) arch i386
444:debug:main org.macports.load registered provides 'load', a pre-existing procedure. Target override will not be provided
445:debug:main org.macports.unload registered provides 'unload', a pre-existing procedure. Target override will not be provided
446:debug:main org.macports.distfiles registered provides 'distfiles', a pre-existing procedure. Target override will not be provided
447:debug:main only one arch supported, so not adding the default universal variant
448:debug:main No need to upgrade! xorg-inputproto 2.2_0 >= xorg-inputproto 2.2_0
449:debug:main epoch: in tree: 0 installed: 0
450:debug:main xorg-libXmu 1.1.1_0 exists in the ports tree
451:debug:main xorg-libXmu 1.1.1_0  is the latest installed
452:debug:main xorg-libXmu 1.1.1_0  is active
453:debug:main Merging existing variants '' into variants
454:debug:main new fully merged portvariants:
455:debug:main Changing to port directory: /opt/local/var/macports/sources/rsync.macports.org/release/tarballs/ports/x11/xorg-libXmu
456:debug:main OS darwin/12.2.0 (Mac OS X 10.8) arch i386
457:debug:main org.macports.load registered provides 'load', a pre-existing procedure. Target override will not be provided
458:debug:main org.macports.unload registered provides 'unload', a pre-existing procedure. Target override will not be provided
459:debug:main org.macports.distfiles registered provides 'distfiles', a pre-existing procedure. Target override will not be provided
460:debug:main adding the default universal variant
461:debug:main Reading variant descriptions from /opt/local/var/macports/sources/rsync.macports.org/release/tarballs/ports/_resources/port1.0/variant_descriptions.conf
462:debug:main No need to upgrade! xorg-libXmu 1.1.1_0 >= xorg-libXmu 1.1.1_0
463:debug:main epoch: in tree: 0 installed: 0
464:debug:main xorg-libXt 1.1.3_0 exists in the ports tree
465:debug:main xorg-libXt 1.1.3_0  is the latest installed
466:debug:main xorg-libXt 1.1.3_0  is active
467:debug:main Merging existing variants '' into variants
468:debug:main new fully merged portvariants:
469:debug:main Changing to port directory: /opt/local/var/macports/sources/rsync.macports.org/release/tarballs/ports/x11/xorg-libXt
470:debug:main OS darwin/12.2.0 (Mac OS X 10.8) arch i386
471:debug:main org.macports.load registered provides 'load', a pre-existing procedure. Target override will not be provided
472:debug:main org.macports.unload registered provides 'unload', a pre-existing procedure. Target override will not be provided
473:debug:main org.macports.distfiles registered provides 'distfiles', a pre-existing procedure. Target override will not be provided
474:debug:main adding the default universal variant
475:debug:main Reading variant descriptions from /opt/local/var/macports/sources/rsync.macports.org/release/tarballs/ports/_resources/port1.0/variant_descriptions.conf
476:debug:main No need to upgrade! xorg-libXt 1.1.3_0 >= xorg-libXt 1.1.3_0
477:debug:main epoch: in tree: 0 installed: 0
478:debug:main xorg-libsm 1.2.1_0 exists in the ports tree
479:debug:main xorg-libsm 1.2.1_0  is the latest installed
480:debug:main xorg-libsm 1.2.1_0  is active
481:debug:main Merging existing variants '' into variants
482:debug:main new fully merged portvariants:
483:debug:main Changing to port directory: /opt/local/var/macports/sources/rsync.macports.org/release/tarballs/ports/x11/xorg-libsm
484:debug:main OS darwin/12.2.0 (Mac OS X 10.8) arch i386
485:debug:main org.macports.load registered provides 'load', a pre-existing procedure. Target override will not be provided
486:debug:main org.macports.unload registered provides 'unload', a pre-existing procedure. Target override will not be provided
487:debug:main org.macports.distfiles registered provides 'distfiles', a pre-existing procedure. Target override will not be provided
488:debug:main adding the default universal variant
489:debug:main Reading variant descriptions from /opt/local/var/macports/sources/rsync.macports.org/release/tarballs/ports/_resources/port1.0/variant_descriptions.conf
490:debug:main No need to upgrade! xorg-libsm 1.2.1_0 >= xorg-libsm 1.2.1_0
491:debug:main epoch: in tree: 0 installed: 0
492:debug:main xorg-libice 1.0.8_0 exists in the ports tree
493:debug:main xorg-libice 1.0.8_0  is the latest installed
494:debug:main xorg-libice 1.0.8_0  is active
495:debug:main Merging existing variants '' into variants
496:debug:main new fully merged portvariants:
497:debug:main Changing to port directory: /opt/local/var/macports/sources/rsync.macports.org/release/tarballs/ports/x11/xorg-libice
498:debug:main OS darwin/12.2.0 (Mac OS X 10.8) arch i386
499:debug:main org.macports.load registered provides 'load', a pre-existing procedure. Target override will not be provided
500:debug:main org.macports.unload registered provides 'unload', a pre-existing procedure. Target override will not be provided
501:debug:main org.macports.distfiles registered provides 'distfiles', a pre-existing procedure. Target override will not be provided
502:debug:main adding the default universal variant
503:debug:main Reading variant descriptions from /opt/local/var/macports/sources/rsync.macports.org/release/tarballs/ports/_resources/port1.0/variant_descriptions.conf
504:debug:main No need to upgrade! xorg-libice 1.0.8_0 >= xorg-libice 1.0.8_0
505:debug:main epoch: in tree: 0 installed: 0
506:debug:main simage 1.7.0_2 exists in the ports tree
507:debug:main simage 1.7.0_2  is the latest installed
508:debug:main simage 1.7.0_2  is active
509:debug:main Merging existing variants '' into variants
510:debug:main new fully merged portvariants:
511:debug:main Changing to port directory: /opt/local/var/macports/sources/rsync.macports.org/release/tarballs/ports/graphics/simage
512:debug:main OS darwin/12.2.0 (Mac OS X 10.8) arch i386
513:debug:main org.macports.load registered provides 'load', a pre-existing procedure. Target override will not be provided
514:debug:main org.macports.unload registered provides 'unload', a pre-existing procedure. Target override will not be provided
515:debug:main org.macports.distfiles registered provides 'distfiles', a pre-existing procedure. Target override will not be provided
516:debug:main adding the default universal variant
517:debug:main Reading variant descriptions from /opt/local/var/macports/sources/rsync.macports.org/release/tarballs/ports/_resources/port1.0/variant_descriptions.conf
518:debug:main No need to upgrade! simage 1.7.0_2 >= simage 1.7.0_2
519:debug:main epoch: in tree: 0 installed: 0
520:debug:main jpeg 8d_0 exists in the ports tree
521:debug:main jpeg 8d_0  is the latest installed
522:debug:main jpeg 8d_0  is active
523:debug:main Merging existing variants '' into variants
524:debug:main new fully merged portvariants:
525:debug:main Changing to port directory: /opt/local/var/macports/sources/rsync.macports.org/release/tarballs/ports/graphics/jpeg
526:debug:main OS darwin/12.2.0 (Mac OS X 10.8) arch i386
527:debug:main org.macports.load registered provides 'load', a pre-existing procedure. Target override will not be provided
528:debug:main org.macports.unload registered provides 'unload', a pre-existing procedure. Target override will not be provided
529:debug:main org.macports.distfiles registered provides 'distfiles', a pre-existing procedure. Target override will not be provided
530:debug:main adding the default universal variant
531:debug:main Reading variant descriptions from /opt/local/var/macports/sources/rsync.macports.org/release/tarballs/ports/_resources/port1.0/variant_descriptions.conf
532:debug:main No need to upgrade! jpeg 8d_0 >= jpeg 8d_0
533:debug:main epoch: in tree: 0 installed: 0
534:debug:main libpng 1.5.13_0 exists in the ports tree
535:debug:main libpng 1.5.13_0  is the latest installed
536:debug:main libpng 1.5.13_0  is active
537:debug:main Merging existing variants '' into variants
538:debug:main new fully merged portvariants:
539:debug:main Changing to port directory: /opt/local/var/macports/sources/rsync.macports.org/release/tarballs/ports/graphics/libpng
540:debug:main OS darwin/12.2.0 (Mac OS X 10.8) arch i386
541:debug:main org.macports.load registered provides 'load', a pre-existing procedure. Target override will not be provided
542:debug:main org.macports.unload registered provides 'unload', a pre-existing procedure. Target override will not be provided
543:debug:main org.macports.distfiles registered provides 'distfiles', a pre-existing procedure. Target override will not be provided
544:debug:main adding the default universal variant
545:debug:main Reading variant descriptions from /opt/local/var/macports/sources/rsync.macports.org/release/tarballs/ports/_resources/port1.0/variant_descriptions.conf
546:debug:main No need to upgrade! libpng 1.5.13_0 >= libpng 1.5.13_0
547:debug:main epoch: in tree: 0 installed: 0
548:debug:main libsndfile 1.0.25_0 exists in the ports tree
549:debug:main libsndfile 1.0.25_0  is the latest installed
550:debug:main libsndfile 1.0.25_0  is active
551:debug:main Merging existing variants '' into variants
552:debug:main new fully merged portvariants:
553:debug:main Changing to port directory: /opt/local/var/macports/sources/rsync.macports.org/release/tarballs/ports/audio/libsndfile
554:debug:main OS darwin/12.2.0 (Mac OS X 10.8) arch i386
555:debug:main org.macports.load registered provides 'load', a pre-existing procedure. Target override will not be provided
556:debug:main org.macports.unload registered provides 'unload', a pre-existing procedure. Target override will not be provided
557:debug:main org.macports.distfiles registered provides 'distfiles', a pre-existing procedure. Target override will not be provided
558:debug:main adding the default universal variant
559:debug:main Reading variant descriptions from /opt/local/var/macports/sources/rsync.macports.org/release/tarballs/ports/_resources/port1.0/variant_descriptions.conf
560:debug:main No need to upgrade! libsndfile 1.0.25_0 >= libsndfile 1.0.25_0
561:debug:main epoch: in tree: 0 installed: 0
562:debug:main flac 1.2.1_1 exists in the ports tree
563:debug:main flac 1.2.1_1  is the latest installed
564:debug:main flac 1.2.1_1  is active
565:debug:main Merging existing variants '' into variants
566:debug:main new fully merged portvariants:
567:debug:main Changing to port directory: /opt/local/var/macports/sources/rsync.macports.org/release/tarballs/ports/audio/flac
568:debug:main OS darwin/12.2.0 (Mac OS X 10.8) arch i386
569:debug:main org.macports.load registered provides 'load', a pre-existing procedure. Target override will not be provided
570:debug:main org.macports.unload registered provides 'unload', a pre-existing procedure. Target override will not be provided
571:debug:main org.macports.distfiles registered provides 'distfiles', a pre-existing procedure. Target override will not be provided
572:debug:main adding the default universal variant
573:debug:main Reading variant descriptions from /opt/local/var/macports/sources/rsync.macports.org/release/tarballs/ports/_resources/port1.0/variant_descriptions.conf
574:debug:main No need to upgrade! flac 1.2.1_1 >= flac 1.2.1_1
575:debug:main epoch: in tree: 0 installed: 0
576:debug:main libogg 1.3.0_1 exists in the ports tree
577:debug:main libogg 1.3.0_1  is the latest installed
578:debug:main libogg 1.3.0_1  is active
579:debug:main Merging existing variants '' into variants
580:debug:main new fully merged portvariants:
581:debug:main Changing to port directory: /opt/local/var/macports/sources/rsync.macports.org/release/tarballs/ports/multimedia/libogg
582:debug:main OS darwin/12.2.0 (Mac OS X 10.8) arch i386
583:debug:main org.macports.load registered provides 'load', a pre-existing procedure. Target override will not be provided
584:debug:main org.macports.unload registered provides 'unload', a pre-existing procedure. Target override will not be provided
585:debug:main org.macports.distfiles registered provides 'distfiles', a pre-existing procedure. Target override will not be provided
586:debug:main adding the default universal variant
587:debug:main Reading variant descriptions from /opt/local/var/macports/sources/rsync.macports.org/release/tarballs/ports/_resources/port1.0/variant_descriptions.conf
588:debug:main No need to upgrade! libogg 1.3.0_1 >= libogg 1.3.0_1
589:debug:main epoch: in tree: 0 installed: 0
590:debug:main libvorbis 1.3.3_0 exists in the ports tree
591:debug:main libvorbis 1.3.3_0  is the latest installed
592:debug:main libvorbis 1.3.3_0  is active
593:debug:main Merging existing variants '' into variants
594:debug:main new fully merged portvariants:
595:debug:main Changing to port directory: /opt/local/var/macports/sources/rsync.macports.org/release/tarballs/ports/audio/libvorbis
596:debug:main OS darwin/12.2.0 (Mac OS X 10.8) arch i386
597:debug:main org.macports.load registered provides 'load', a pre-existing procedure. Target override will not be provided
598:debug:main org.macports.unload registered provides 'unload', a pre-existing procedure. Target override will not be provided
599:debug:main org.macports.distfiles registered provides 'distfiles', a pre-existing procedure. Target override will not be provided
600:debug:main Using group file /opt/local/var/macports/sources/rsync.macports.org/release/tarballs/ports/_resources/port1.0/group/muniversal-1.0.tcl
601:debug:main Reading variant descriptions from /opt/local/var/macports/sources/rsync.macports.org/release/tarballs/ports/_resources/port1.0/variant_descriptions.conf
602:debug:main universal variant already exists, so not adding the default one
603:debug:main No need to upgrade! libvorbis 1.3.3_0 >= libvorbis 1.3.3_0
604:debug:main epoch: in tree: 0 installed: 0
605:debug:main giflib 4.2.1_0 exists in the ports tree
606:debug:main giflib 4.2.1_0 +x11 is the latest installed
607:debug:main giflib 4.2.1_0 +x11 is active
608:debug:main Merging existing variants '+x11' into variants
609:debug:main new fully merged portvariants: x11 +
610:debug:main Changing to port directory: /opt/local/var/macports/sources/rsync.macports.org/release/tarballs/ports/graphics/giflib
611:debug:main OS darwin/12.2.0 (Mac OS X 10.8) arch i386
612:debug:main org.macports.load registered provides 'load', a pre-existing procedure. Target override will not be provided
613:debug:main org.macports.unload registered provides 'unload', a pre-existing procedure. Target override will not be provided
614:debug:main org.macports.distfiles registered provides 'distfiles', a pre-existing procedure. Target override will not be provided
615:debug:main Reading variant descriptions from /opt/local/var/macports/sources/rsync.macports.org/release/tarballs/ports/_resources/port1.0/variant_descriptions.conf
616:debug:main adding the default universal variant
617:debug:main Executing variant x11 provides x11
618:debug:main No need to upgrade! giflib 4.2.1_0 >= giflib 4.2.1_0
619:debug:main epoch: in tree: 0 installed: 0
620:debug:main tiff 3.9.5_0 exists in the ports tree
621:debug:main tiff 3.9.5_0  is the latest installed
622:debug:main tiff 3.9.5_0  is active
623:debug:main Merging existing variants '' into variants
624:debug:main new fully merged portvariants:
625:debug:main Changing to port directory: /opt/local/var/macports/sources/rsync.macports.org/release/tarballs/ports/graphics/tiff
626:debug:main OS darwin/12.2.0 (Mac OS X 10.8) arch i386
627:debug:main org.macports.load registered provides 'load', a pre-existing procedure. Target override will not be provided
628:debug:main org.macports.unload registered provides 'unload', a pre-existing procedure. Target override will not be provided
629:debug:main org.macports.distfiles registered provides 'distfiles', a pre-existing procedure. Target override will not be provided
630:debug:main Using group file /opt/local/var/macports/sources/rsync.macports.org/release/tarballs/ports/_resources/port1.0/group/xcodeversion-1.0.tcl
631:debug:main adding the default universal variant
632:debug:main Reading variant descriptions from /opt/local/var/macports/sources/rsync.macports.org/release/tarballs/ports/_resources/port1.0/variant_descriptions.conf
633:debug:main No need to upgrade! tiff 3.9.5_0 >= tiff 3.9.5_0
634:msg:main --->  Computing dependencies for Coin:info:main .:debug:main Coin has no conflicts
635:debug:main Searching for dependency: mesa
636:debug:main Found Dependency: receipt exists for mesa
637:debug:main Searching for dependency: simage
638:debug:main Found Dependency: receipt exists for simage
639:debug:main Searching for dependency: xorg-libsm
640:debug:main Found Dependency: receipt exists for xorg-libsm
641:debug:main Searching for dependency: xorg-libXext
642:debug:main Found Dependency: receipt exists for xorg-libXext
643:debug:main Searching for dependency: xorg-libXt
644:debug:main Found Dependency: receipt exists for xorg-libXt
645:msg:main
646:debug:main Executing org.macports.main (Coin)
647:debug:main changing euid/egid - current euid: 0 - current egid: 0
648:debug:main egid changed to: 501
649:debug:main euid changed to: 502
650:debug:archivefetch archivefetch phase started at Tue Oct 16 18:35:20 EDT 2012
651:msg:archivefetch --->  Fetching archive for Coin
652:debug:archivefetch Executing org.macports.archivefetch (Coin)
653:debug:archivefetch euid/egid changed to: 0/0
654:debug:archivefetch chowned /opt/local/var/macports/incoming to macports
655:debug:archivefetch euid/egid changed to: 502/501
656:info:archivefetch --->  Coin-3.1.3_2.darwin_12.x86_64.tbz2 doesn't seem to exist in /opt/local/var/macports/incoming/verified
657:msg:archivefetch --->  Attempting to fetch Coin-3.1.3_2.darwin_12.x86_64.tbz2 from http://mse.uk.packages.macports.org/sites/packages.macports.org/Coin
658:debug:archivefetch Fetching archive failed:: The requested URL returned error: 404
659:msg:archivefetch --->  Attempting to fetch Coin-3.1.3_2.darwin_12.x86_64.tbz2 from http://lil.fr.packages.macports.org/Coin
660:debug:archivefetch Fetching archive failed:: The requested URL returned error: 404
661:msg:archivefetch --->  Attempting to fetch Coin-3.1.3_2.darwin_12.x86_64.tbz2 from http://packages.macports.org/Coin
662:debug:archivefetch Fetching archive failed:: The requested URL returned error: 404
663:debug:archivefetch Privilege de-escalation not attempted as not running as root.
664:debug:fetch fetch phase started at Tue Oct 16 18:35:21 EDT 2012
665:notice:fetch --->  Fetching distfiles for Coin
666:debug:fetch Executing org.macports.fetch (Coin)
667:debug:fetch Privilege de-escalation not attempted as not running as root.
668:debug:checksum checksum phase started at Tue Oct 16 18:35:21 EDT 2012
669:notice:checksum --->  Verifying checksum(s) for Coin
670:debug:checksum Executing org.macports.checksum (Coin)
671:info:checksum --->  Checksumming Coin-3.1.3.tar.gz
672:debug:checksum Correct (md5) checksum for Coin-3.1.3.tar.gz
673:debug:checksum Correct (sha1) checksum for Coin-3.1.3.tar.gz
674:debug:checksum Correct (rmd160) checksum for Coin-3.1.3.tar.gz
675:debug:checksum Privilege de-escalation not attempted as not running as root.
676:debug:extract extract phase started at Tue Oct 16 18:35:21 EDT 2012
677:notice:extract --->  Extracting Coin
678:debug:extract Executing org.macports.extract (Coin)
679:info:extract --->  Extracting Coin-3.1.3.tar.gz
680:debug:extract setting option extract.args to '/opt/local/var/macports/distfiles/Coin/Coin-3.1.3.tar.gz'
681:debug:extract Environment: CPATH='/opt/local/include' CC_PRINT_OPTIONS_FILE='/opt/local/var/macports/build/_opt_local_var_macports_sources_rsync.macports.org_release_tarballs_ports_graphics_Coin/Coin/work/.CC_PRINT_OPTIONS' LIBRARY_PATH='/opt/local/lib' CC_PRINT_OPTIONS='YES' MACOSX_DEPLOYMENT_TARGET='10.8'
682:debug:extract Assembled command: 'cd "/opt/local/var/macports/build/_opt_local_var_macports_sources_rsync.macports.org_release_tarballs_ports_graphics_Coin/Coin/work" && /usr/bin/gzip -dc '/opt/local/var/macports/distfiles/Coin/Coin-3.1.3.tar.gz' | /usr/bin/gnutar --no-same-owner -xf -'
683:debug:extract Executing command line:  cd "/opt/local/var/macports/build/_opt_local_var_macports_sources_rsync.macports.org_release_tarballs_ports_graphics_Coin/Coin/work" && /usr/bin/gzip -dc '/opt/local/var/macports/distfiles/Coin/Coin-3.1.3.tar.gz' | /usr/bin/gnutar --no-same-owner -xf -
684:debug:extract euid/egid changed to: 0/0
685:debug:extract chowned /opt/local/var/macports/build/_opt_local_var_macports_sources_rsync.macports.org_release_tarballs_ports_graphics_Coin/Coin/work to macports
686:debug:extract euid/egid changed to: 502/501
687:debug:extract Privilege de-escalation not attempted as not running as root.
688:debug:patch patch phase started at Tue Oct 16 18:35:23 EDT 2012
689:debug:patch Executing org.macports.patch (Coin)
690:notice:patch --->  Applying patches to Coin
691:info:patch --->  Applying configure.patch
692:debug:patch Environment: CPATH='/opt/local/include' CC_PRINT_OPTIONS_FILE='/opt/local/var/macports/build/_opt_local_var_macports_sources_rsync.macports.org_release_tarballs_ports_graphics_Coin/Coin/work/.CC_PRINT_OPTIONS' LIBRARY_PATH='/opt/local/lib' CC_PRINT_OPTIONS='YES' MACOSX_DEPLOYMENT_TARGET='10.8'
693:debug:patch Assembled command: 'cd "/opt/local/var/macports/build/_opt_local_var_macports_sources_rsync.macports.org_release_tarballs_ports_graphics_Coin/Coin/work/Coin-3.1.3" && /usr/bin/patch -p0'
694:debug:patch Executing command line:  cd "/opt/local/var/macports/build/_opt_local_var_macports_sources_rsync.macports.org_release_tarballs_ports_graphics_Coin/Coin/work/Coin-3.1.3" && /usr/bin/patch -p0 < '/opt/local/var/macports/sources/rsync.macports.org/release/tarballs/ports/graphics/Coin/files/configure.patch'
695:info:patch patching file configure
696:info:patch --->  Applying for.patch
697:debug:patch Environment: CPATH='/opt/local/include' CC_PRINT_OPTIONS_FILE='/opt/local/var/macports/build/_opt_local_var_macports_sources_rsync.macports.org_release_tarballs_ports_graphics_Coin/Coin/work/.CC_PRINT_OPTIONS' LIBRARY_PATH='/opt/local/lib' CC_PRINT_OPTIONS='YES' MACOSX_DEPLOYMENT_TARGET='10.8'
698:debug:patch Assembled command: 'cd "/opt/local/var/macports/build/_opt_local_var_macports_sources_rsync.macports.org_release_tarballs_ports_graphics_Coin/Coin/work/Coin-3.1.3" && /usr/bin/patch -p0'
699:debug:patch Executing command line:  cd "/opt/local/var/macports/build/_opt_local_var_macports_sources_rsync.macports.org_release_tarballs_ports_graphics_Coin/Coin/work/Coin-3.1.3" && /usr/bin/patch -p0 < '/opt/local/var/macports/sources/rsync.macports.org/release/tarballs/ports/graphics/Coin/files/for.patch'
700:info:patch patching file src/shadows/SoShadowGroup.cpp
701:info:patch Hunk #1 succeeded at 1699 (offset -170 lines).
702:debug:patch Privilege de-escalation not attempted as not running as root.
703:debug:configure configure phase started at Tue Oct 16 18:35:23 EDT 2012
704:notice:configure --->  Configuring Coin
705:debug:configure Using compiler 'Mac OS X clang'
706:debug:configure Executing org.macports.configure (Coin)
707:debug:configure Environment: CPATH='/opt/local/include' CFLAGS='-pipe -O2 -arch x86_64' CPPFLAGS='-I/opt/local/include' CXXFLAGS='-pipe -O2 -arch x86_64' LIBRARY_PATH='/opt/local/lib' MACOSX_DEPLOYMENT_TARGET='10.8' CXX='/usr/bin/clang++' CC_PRINT_OPTIONS_FILE='/opt/local/var/macports/build/_opt_local_var_macports_sources_rsync.macports.org_release_tarballs_ports_graphics_Coin/Coin/work/.CC_PRINT_OPTIONS' F90FLAGS='-pipe -O2 -m64' LDFLAGS='-L/opt/local/lib -arch x86_64' OBJC='/usr/bin/clang' FCFLAGS='-pipe -O2 -m64' INSTALL='/usr/bin/install -c' OBJCFLAGS='-pipe -O2 -arch x86_64' FFLAGS='-pipe -O2 -m64' CC_PRINT_OPTIONS='YES' CC='/usr/bin/clang'
708:debug:configure Assembled command: 'cd "/opt/local/var/macports/build/_opt_local_var_macports_sources_rsync.macports.org_release_tarballs_ports_graphics_Coin/Coin/work/Coin-3.1.3" && ./configure --prefix=/opt/local --with-simage=/opt/local --mandir=/opt/local/share/man --disable-framework --enable-darwin-x11'
709:debug:configure Executing command line:  cd "/opt/local/var/macports/build/_opt_local_var_macports_sources_rsync.macports.org_release_tarballs_ports_graphics_Coin/Coin/work/Coin-3.1.3" && ./configure --prefix=/opt/local --with-simage=/opt/local --mandir=/opt/local/share/man --disable-framework --enable-darwin-x11
710:info:configure checking build system type... x86_64-apple-darwin12.2.0
711:info:configure checking host system type... x86_64-apple-darwin12.2.0
712:info:configure checking target system type... x86_64-apple-darwin12.2.0
713:info:configure checking for distcheck mode... no
714:info:configure checking for gcc... /usr/bin/clang
715:info:configure checking whether the C compiler works... yes
716:info:configure checking for C compiler default output file name... a.out
717:info:configure checking for suffix of executables...
718:info:configure checking whether we are cross compiling... no
719:info:configure checking for suffix of object files... o
720:info:configure checking whether we are using the GNU C compiler... yes
721:info:configure checking whether /usr/bin/clang accepts -g... yes
722:info:configure checking for /usr/bin/clang option to accept ISO C89... none needed
723:info:configure checking whether we should build Universal Binaries... no
724:info:configure checking for a BSD-compatible install... /usr/bin/install -c
725:info:configure checking whether build environment is sane... yes
726:info:configure checking for gawk... no
727:info:configure checking for mawk... no
728:info:configure checking for nawk... no
729:info:configure checking for awk... awk
730:info:configure checking whether make sets $(MAKE)... yes
731:info:configure checking for style of include used by make... GNU
732:info:configure checking dependency style of /usr/bin/clang... gcc3
733:info:configure checking whether to enable maintainer-specific portions of Makefiles... no
734:info:configure checking whether we are using the GNU C++ compiler... yes
735:info:configure checking whether /usr/bin/clang++ accepts -g... yes
736:info:configure checking dependency style of /usr/bin/clang++... gcc3
737:info:configure checking how to run the C++ preprocessor... /usr/bin/clang++ -E
738:info:configure checking OS X deployment target...
739:info:configure checking for a sed that does not truncate output... /usr/bin/sed
740:info:configure checking for grep that handles long lines and -e... /usr/bin/grep
741:info:configure checking for egrep... /usr/bin/grep -E
742:info:configure checking for ld used by /usr/bin/clang... /usr/bin/ld
743:info:configure checking if the linker (/usr/bin/ld) is GNU ld... no
744:info:configure checking for /usr/bin/ld option to reload object files... -r
745:info:configure checking for BSD-compatible nm... /opt/local/bin/nm
746:info:configure checking whether ln -s works... yes
747:info:configure checking how to recognize dependent libraries... pass_all
748:info:configure checking how to run the C preprocessor... /usr/bin/clang -E
749:info:configure checking for ANSI C header files... yes
750:info:configure checking for sys/types.h... yes
751:info:configure checking for sys/stat.h... yes
752:info:configure checking for stdlib.h... yes
753:info:configure checking for string.h... yes
754:info:configure checking for memory.h... yes
755:info:configure checking for strings.h... yes
756:info:configure checking for inttypes.h... yes
757:info:configure checking for stdint.h... yes
758:info:configure checking for unistd.h... yes
759:info:configure checking dlfcn.h usability... yes
760:info:configure checking dlfcn.h presence... yes
761:info:configure checking for dlfcn.h... yes
762:info:configure checking how to run the C++ preprocessor... /usr/bin/clang++ -E
763:info:configure checking for g77... no
764:info:configure checking for xlf... no
765:info:configure checking for f77... no
766:info:configure checking for frt... no
767:info:configure checking for pgf77... no
768:info:configure checking for cf77... no
769:info:configure checking for fort77... no
770:info:configure checking for fl32... no
771:info:configure checking for af77... no
772:info:configure checking for xlf90... no
773:info:configure checking for f90... no
774:info:configure checking for pgf90... no
775:info:configure checking for pghpf... no
776:info:configure checking for epcf90... no
777:info:configure checking for gfortran... no
778:info:configure checking for g95... no
779:info:configure checking for xlf95... no
780:info:configure checking for f95... no
781:info:configure checking for fort... no
782:info:configure checking for ifort... ifort
783:info:configure checking whether we are using the GNU Fortran 77 compiler... no
784:info:configure checking whether ifort accepts -g... yes
785:info:configure checking the maximum length of command line arguments... 196608
786:info:configure checking command to parse /opt/local/bin/nm output from /usr/bin/clang object... ok
787:info:configure checking for objdir... .libs
788:info:configure checking for ar... ar
789:info:configure checking for ranlib... ranlib
790:info:configure checking for strip... strip
791:info:configure checking for dsymutil... dsymutil
792:info:configure checking for nmedit... nmedit
793:info:configure checking for -single_module linker flag... yes
794:info:configure checking for -exported_symbols_list linker flag... yes
795:info:configure checking if /usr/bin/clang supports -fno-rtti -fno-exceptions... yes
796:info:configure checking for /usr/bin/clang option to produce PIC... -fno-common
797:info:configure checking if /usr/bin/clang PIC flag -fno-common works... yes
798:info:configure checking if /usr/bin/clang static flag -static works... no
799:info:configure checking if /usr/bin/clang supports -c -o file.o... yes
800:info:configure checking whether the /usr/bin/clang linker (/usr/bin/ld) supports shared libraries... yes
801:info:configure checking dynamic linker characteristics... darwin12.2.0 dyld
802:info:configure checking how to hardcode library paths into programs... immediate
803:info:configure checking whether stripping libraries is possible... yes
804:info:configure checking if libtool supports shared libraries... yes
805:info:configure checking whether to build shared libraries... yes
806:info:configure checking whether to build static libraries... no
807:info:configure configure: creating libtool
808:info:configure appending configuration tag "CXX" to libtool
809:info:configure checking for ld used by /usr/bin/clang++... /usr/bin/ld
810:info:configure checking if the linker (/usr/bin/ld) is GNU ld... no
811:info:configure checking whether the /usr/bin/clang++ linker (/usr/bin/ld) supports shared libraries... yes
812:info:configure checking for /usr/bin/clang++ option to produce PIC... -fno-common
813:info:configure checking if /usr/bin/clang++ PIC flag -fno-common works... yes
814:info:configure checking if /usr/bin/clang++ static flag -static works... no
815:info:configure checking if /usr/bin/clang++ supports -c -o file.o... yes
816:info:configure checking whether the /usr/bin/clang++ linker (/usr/bin/ld) supports shared libraries... yes
817:info:configure checking dynamic linker characteristics... darwin12.2.0 dyld
818:info:configure (cached) (cached) checking how to hardcode library paths into programs... immediate
819:info:configure appending configuration tag "F77" to libtool
820:info:configure checking if libtool supports shared libraries... yes
821:info:configure checking whether to build shared libraries... yes
822:info:configure checking whether to build static libraries... no
823:info:configure checking for ifort option to produce PIC... -fno-common
824:info:configure checking if ifort PIC flag -fno-common works... yes
825:info:configure checking if ifort static flag -static works... no
826:info:configure checking if ifort supports -c -o file.o... yes
827:info:configure checking whether the ifort linker (/usr/bin/ld) supports shared libraries... yes
828:info:configure checking dynamic linker characteristics... darwin12.2.0 dyld
829:info:configure (cached) (cached) checking how to hardcode library paths into programs... immediate
830:info:configure checking if the C++ compiler environment is ok... true
831:info:configure checking if the compiler handles for() loops in inlined constructors... yes
832:info:configure checking if the compiler handles switch statements in virtual destructors... yes
833:info:configure checking if this is a version of GCC with a known nasty optimization bug... false
834:info:configure checking for __builtin_expect()... found
835:info:configure checking if assert() uses __builtin_expect()... yes
836:info:configure checking for function name variable for CPP compiler... __func__
837:info:configure checking for function name variable for C compiler... __func__
838:info:configure checking whether /usr/bin/clang accepts -no-cpp-precomp... yes
839:info:configure checking for Win32 threads... false
840:info:configure checking for POSIX threads... -D_REENTRANT   -lpthread
841:info:configure checking the struct timespec resolution... nsecs
842:info:configure checking for unistd.h... (cached) yes
843:info:configure checking for sys/types.h... (cached) yes
844:info:configure checking for inttypes.h... (cached) yes
845:info:configure checking for stdint.h... (cached) yes
846:info:configure checking sys/param.h usability... yes
847:info:configure checking sys/param.h presence... yes
848:info:configure checking for sys/param.h... yes
849:info:configure checking sys/time.h usability... yes
850:info:configure checking sys/time.h presence... yes
851:info:configure checking for sys/time.h... yes
852:info:configure checking sys/timeb.h usability... yes
853:info:configure checking sys/timeb.h presence... yes
854:info:configure checking for sys/timeb.h... yes
855:info:configure checking time.h usability... yes
856:info:configure checking time.h presence... yes
857:info:configure checking for time.h... yes
858:info:configure checking io.h usability... no
859:info:configure checking io.h presence... no
860:info:configure checking for io.h... no
861:info:configure checking windows.h usability... no
862:info:configure checking windows.h presence... no
863:info:configure checking for windows.h... no
864:info:configure checking libgen.h usability... yes
865:info:configure checking libgen.h presence... yes
866:info:configure checking for libgen.h... yes
867:info:configure checking direct.h usability... no
868:info:configure checking direct.h presence... no
869:info:configure checking for direct.h... no
870:info:configure checking for strings.h... (cached) yes
871:info:configure checking ieeefp.h usability... no
872:info:configure checking ieeefp.h presence... no
873:info:configure checking for ieeefp.h... no
874:info:configure checking for flex file adjustments... none
875:info:configure checking for tlhelp32.h... no
876:info:configure checking for _splitpath()... not found
877:info:configure checking if the Win32 API is available... no
878:info:configure checking for sys/unistd.h... yes
879:info:configure checking for IN_PATH define conflict... no
880:info:configure checking for netinet/in.h... true
881:info:configure checking for inttypes.h... (cached) yes
882:info:configure checking for stdint.h... (cached) yes
883:info:configure checking for sys/types.h... (cached) yes
884:info:configure checking stddef.h usability... yes
885:info:configure checking stddef.h presence... yes
886:info:configure checking for stddef.h... yes
887:info:configure checking standard bytesize typedefs... available
888:info:configure checking for fstat() function... available
889:info:configure checking for BSD 4.3 isinf() function... available
890:info:configure checking for BSD 4.3 isnan() function... available
891:info:configure checking for BSD 4.3 finite() function... available
892:info:configure checking for fpclass() function... not available
893:info:configure checking for _fpclass() function... not available
894:info:configure checking type of timeval::tv_sec... __darwin_time_t
895:info:configure checking type of timeval::tv_usec... __darwin_suseconds_t
896:info:configure checking for perl... /opt/local/bin/perl
897:info:configure checking for dpkg-buildpackage... false
898:info:configure checking if user is simian... probably not
899:info:configure checking whether /usr/bin/clang accepts -W... yes
900:info:configure checking whether /usr/bin/clang accepts -Wall... yes
901:info:configure checking whether /usr/bin/clang accepts -Wno-unused... yes
902:info:configure checking whether /usr/bin/clang accepts -Wno-multichar... yes
903:info:configure checking whether /usr/bin/clang++ accepts -W... yes
904:info:configure checking whether /usr/bin/clang++ accepts -Wall... yes
905:info:configure checking whether /usr/bin/clang++ accepts -Wno-unused... yes
906:info:configure checking whether /usr/bin/clang++ accepts -Wno-multichar... yes
907:info:configure checking whether /usr/bin/clang++ accepts -Woverloaded-virtual... yes
908:info:configure checking for project release status... release version
909:info:configure checking whether /usr/bin/clang accepts -fno-builtin... yes
910:info:configure checking whether /usr/bin/clang++ accepts -fno-builtin... yes
911:info:configure checking whether /usr/bin/clang++ accepts -fno-for-scope... no
912:info:configure checking whether /usr/bin/clang accepts -finline-functions... yes
913:info:configure checking whether /usr/bin/clang++ accepts -finline-functions... yes
914:info:configure checking whether /usr/bin/clang accepts -Wreturn-type... yes
915:info:configure checking whether /usr/bin/clang++ accepts -Wreturn-type... yes
916:info:configure checking whether /usr/bin/clang accepts -Wchar-subscripts... yes
917:info:configure checking whether /usr/bin/clang++ accepts -Wchar-subscripts... yes
918:info:configure checking whether /usr/bin/clang accepts -Wparentheses... yes
919:info:configure checking whether /usr/bin/clang++ accepts -Wparentheses... yes
920:info:configure checking whether snprintf() is available... yes
921:info:configure checking whether vsnprintf() is available... yes
922:info:configure checking for va_copy() stdarg macro... yes
923:info:configure checking whether quoting in macros can be done with hash symbol... yes
924:info:configure checking for GetEnvironmentVariable() function... no
925:info:configure checking for timeGetTime() function... no
926:info:configure checking for MessageBox() function... no
927:info:configure checking for QueryPerformanceCounter() function... no
928:info:configure checking for _ftime() function... no
929:info:configure checking for ftime() function... yes
930:info:configure checking for _getcwd() function... no
931:info:configure checking for getcwd() function... yes
932:info:configure checking for gettimeofday() function... yes
933:info:configure checking for strncasecmp() function... yes
934:info:configure checking for memmove() function... available
935:info:configure checking for bcopy() function... available
936:info:configure checking for _logb() function... no
937:info:configure checking mach-o/dyld.h usability... yes
938:info:configure checking mach-o/dyld.h presence... yes
939:info:configure checking for mach-o/dyld.h... yes
940:info:configure checking whether we can use Mach-O dyld... yes
941:info:configure checking for dlfcn.h... (cached) yes
942:info:configure checking for the dl library... yes
943:info:configure checking for math functions library... no explicit linkage necessary
944:info:configure checking for ilogb() function... yes
945:info:configure checking for X... libraries , headers
946:info:configure checking for gethostbyname... yes
947:info:configure checking for connect... yes
948:info:configure checking for remove... yes
949:info:configure checking for shmat... yes
950:info:configure checking for IceConnectionNumber in -lICE... yes
951:info:configure checking whether we can link against X11... yes
952:info:configure checking whether the X11 shared memory extension is available... yes
953:info:configure checking if X11 linkage is ready... true
954:info:configure checking how to include gl.h... -I/usr/X11R6/include, #include <GL/gl.h>
955:info:configure checking for OpenGL library dev-kit... -I/usr/X11R6/include -L/usr/X11R6/lib -lGL
956:info:configure checking how to include glext.h... #include <GL/glext.h>
957:info:configure checking whether GLX is on the system... true
958:info:configure checking how to include glu.h... #include <GL/glu.h>
959:info:configure checking if GLU is available as part of GL library... false
960:info:configure checking for shared library suffix... .dylib
961:info:configure checking for cmp... Yes
962:info:configure checking for __declspec() support... available
963:info:configure configure: creating ./config.status
964:info:configure config.status: creating Makefile
965:info:configure config.status: creating bin/Makefile
966:info:configure config.status: creating include/Makefile
967:info:configure config.status: creating include/Inventor/Makefile
968:info:configure config.status: creating include/Inventor/C/Makefile
969:info:configure config.status: creating include/Inventor/C/XML/Makefile
970:info:configure config.status: creating include/Inventor/C/base/Makefile
971:info:configure config.status: creating include/Inventor/C/errors/Makefile
972:info:configure config.status: creating include/Inventor/C/glue/Makefile
973:info:configure config.status: creating include/Inventor/C/threads/Makefile
974:info:configure config.status: creating include/Inventor/VRMLnodes/Makefile
975:info:configure config.status: creating include/Inventor/XML/Makefile
976:info:configure config.status: creating include/Inventor/actions/Makefile
977:info:configure config.status: creating include/Inventor/bundles/Makefile
978:info:configure config.status: creating include/Inventor/caches/Makefile
979:info:configure config.status: creating include/Inventor/collision/Makefile
980:info:configure config.status: creating include/Inventor/details/Makefile
981:info:configure config.status: creating include/Inventor/draggers/Makefile
982:info:configure config.status: creating include/Inventor/elements/Makefile
983:info:configure config.status: creating include/Inventor/engines/Makefile
984:info:configure config.status: creating include/Inventor/errors/Makefile
985:info:configure config.status: creating include/Inventor/events/Makefile
986:info:configure config.status: creating include/Inventor/fields/Makefile
987:info:configure config.status: creating include/Inventor/lists/Makefile
988:info:configure config.status: creating include/Inventor/lock/Makefile
989:info:configure config.status: creating include/Inventor/manips/Makefile
990:info:configure config.status: creating include/Inventor/misc/Makefile
991:info:configure config.status: creating include/Inventor/nodekits/Makefile
992:info:configure config.status: creating include/Inventor/nodes/Makefile
993:info:configure config.status: creating include/Inventor/projectors/Makefile
994:info:configure config.status: creating include/Inventor/sensors/Makefile
995:info:configure config.status: creating include/Inventor/system/Makefile
996:info:configure config.status: creating include/Inventor/threads/Makefile
997:info:configure config.status: creating include/Inventor/tools/Makefile
998:info:configure config.status: creating include/Inventor/scxml/Makefile
999:info:configure config.status: creating include/Inventor/annex/Makefile
1000:info:configure config.status: creating include/Inventor/annex/HardCopy/Makefile
1001:info:configure config.status: creating include/Inventor/annex/ForeignFiles/Makefile
1002:info:configure config.status: creating include/Inventor/annex/FXViz/Makefile
1003:info:configure config.status: creating include/Inventor/annex/FXViz/elements/Makefile
1004:info:configure config.status: creating include/Inventor/annex/FXViz/nodes/Makefile
1005:info:configure config.status: creating include/Inventor/annex/Profiler/Makefile
1006:info:configure config.status: creating include/Inventor/annex/Profiler/elements/Makefile
1007:info:configure config.status: creating include/Inventor/annex/Profiler/engines/Makefile
1008:info:configure config.status: creating include/Inventor/annex/Profiler/nodes/Makefile
1009:info:configure config.status: creating include/Inventor/annex/Profiler/nodekits/Makefile
1010:info:configure config.status: creating include/Inventor/annex/Profiler/utils/Makefile
1011:info:configure config.status: creating data/Makefile
1012:info:configure config.status: creating data/draggerDefaults/Makefile
1013:info:configure config.status: creating data/shaders/Makefile
1014:info:configure config.status: creating data/shaders/lights/Makefile
1015:info:configure config.status: creating data/shaders/vsm/Makefile
1016:info:configure config.status: creating data/scxml/Makefile
1017:info:configure config.status: creating data/scxml/navigation/Makefile
1018:info:configure config.status: creating man/Makefile
1019:info:configure config.status: creating man/man1/Makefile
1020:info:configure config.status: creating man/man3/Makefile
1021:info:configure config.status: creating html/Makefile
1022:info:configure config.status: creating src/Makefile
1023:info:configure config.status: creating src/base/Makefile
1024:info:configure config.status: creating src/actions/Makefile
1025:info:configure config.status: creating src/bundles/Makefile
1026:info:configure config.status: creating src/caches/Makefile
1027:info:configure config.status: creating src/collision/Makefile
1028:info:configure config.status: creating src/details/Makefile
1029:info:configure config.status: creating src/draggers/Makefile
1030:info:configure config.status: creating src/elements/Makefile
1031:info:configure config.status: creating src/elements/GL/Makefile
1032:info:configure config.status: creating src/engines/Makefile
1033:info:configure config.status: creating src/errors/Makefile
1034:info:configure config.status: creating src/events/Makefile
1035:info:configure config.status: creating src/fields/Makefile
1036:info:configure config.status: creating src/fonts/Makefile
1037:info:configure config.status: creating src/glue/Makefile
1038:info:configure config.status: creating src/io/Makefile
1039:info:configure config.status: creating src/manips/Makefile
1040:info:configure config.status: creating src/misc/Makefile
1041:info:configure config.status: creating src/lists/Makefile
1042:info:configure config.status: creating src/navigation/Makefile
1043:info:configure config.status: creating src/nodekits/Makefile
1044:info:configure config.status: creating src/nodes/Makefile
1045:info:configure config.status: creating src/projectors/Makefile
1046:info:configure config.status: creating src/3ds/Makefile
1047:info:configure config.status: creating src/sensors/Makefile
1048:info:configure config.status: creating src/upgraders/Makefile
1049:info:configure config.status: creating src/shapenodes/Makefile
1050:info:configure config.status: creating src/threads/Makefile
1051:info:configure config.status: creating src/extensions/Makefile
1052:info:configure config.status: creating src/vrml97/Makefile
1053:info:configure config.status: creating src/hardcopy/Makefile
1054:info:configure config.status: creating src/shaders/Makefile
1055:info:configure config.status: creating src/shadows/Makefile
1056:info:configure config.status: creating src/geo/Makefile
1057:info:configure config.status: creating src/foreignfiles/Makefile
1058:info:configure config.status: creating src/xml/Makefile
1059:info:configure config.status: creating src/xml/expat/Makefile
1060:info:configure config.status: creating src/profiler/Makefile
1061:info:configure config.status: creating src/scxml/Makefile
1062:info:configure config.status: creating src/doc/Makefile
1063:info:configure config.status: creating testsuite/Makefile
1064:info:configure config.status: creating cfg/gendsp.pl
1065:info:configure config.status: creating src/discard.h
1066:info:configure config.status: creating src/config.h
1067:info:configure config.status: creating src/setup.h
1068:info:configure config.status: executing depfiles commands
1069:info:configure
1070:info:configure ************************* WARNING ****************************
1071:info:configure *
1072:info:configure * We have not tested Coin on the darwin12.2.0 x86_64
1073:info:configure * platform with the /usr/bin/clang++ C++ compiler. Please report
1074:info:configure * back to us at <coin-support@coin3d.org> how it works out.
1075:info:configure *
1076:info:configure **************************************************************
1077:info:configure
1078:info:configure
1079:info:configure Coin configuration settings:
1080:info:configure                              3.1.3   Library version:
1081:info:configure                              No (default)   Build Universal Binaries:
1082:info:configure                              No (default)   Generate Java wrapper:
1083:info:configure                              No (enable with --enable-3ds-import)   3ds import capabilities:
1084:info:configure                              No (default)   Use system expat:
1085:info:configure                              Yes   javascript capabilities:
1086:info:configure                              Yes   nodekit support:
1087:info:configure                              Yes   dragger support:
1088:info:configure                              Yes   manipulator support:
1089:info:configure                              Yes   VRML97 support:
1090:info:configure                              POSIX   System threads API:
1091:info:configure                              No (enable with --enable-threadsafe)   Thread safe traversals:
1092:info:configure                              run-time binding   simage linkage:
1093:info:configure                              Yes, run-time binding   OpenAL support:
1094:info:configure                              Yes   Sound support:
1095:info:configure                              Yes, run-time binding   Fontconfig support:
1096:info:configure                              Yes, run-time binding   SpiderMonkey support:
1097:info:configure                              Yes, run-time binding   FreeType library:
1098:info:configure                              Yes, run-time binding   zlib support:
1099:info:configure                              Yes, run-time binding   bzip2 support:
1100:info:configure                              run-time binding   GLU linkage:
1101:info:configure                              /opt/local   Installation prefix:
1102:info:configure
1103:info:configure Coin configuration warnings:
1104:info:configure   * Your $PATH variable does not appear to include "/opt/local/bin"
1105:info:configure
1106:debug:configure Privilege de-escalation not attempted as not running as root.
1107:debug:build build phase started at Tue Oct 16 18:35:49 EDT 2012
1108:notice:build --->  Building Coin
1109:debug:build Executing org.macports.build (Coin)
1110:debug:build Environment: CPATH='/opt/local/include' CC_PRINT_OPTIONS_FILE='/opt/local/var/macports/build/_opt_local_var_macports_sources_rsync.macports.org_release_tarballs_ports_graphics_Coin/Coin/work/.CC_PRINT_OPTIONS' LIBRARY_PATH='/opt/local/lib' CC_PRINT_OPTIONS='YES' MACOSX_DEPLOYMENT_TARGET='10.8'
1111:debug:build Assembled command: 'cd "/opt/local/var/macports/build/_opt_local_var_macports_sources_rsync.macports.org_release_tarballs_ports_graphics_Coin/Coin/work/Coin-3.1.3" && /usr/bin/make -j18 -w all'
1112:debug:build Executing command line:  cd "/opt/local/var/macports/build/_opt_local_var_macports_sources_rsync.macports.org_release_tarballs_ports_graphics_Coin/Coin/work/Coin-3.1.3" && /usr/bin/make -j18 -w all
1113:info:build make: Entering directory `/opt/local/var/macports/build/_opt_local_var_macports_sources_rsync.macports.org_release_tarballs_ports_graphics_Coin/Coin/work/Coin-3.1.3'
1114:info:build config.status: creating include/Inventor/C/basic.h
1115:info:build config.status: creating include/Inventor/system/inttypes.h
1116:info:build config.status: creating coin-default.cfg
1117:info:build config.status: creating Info.plist
1118:info:build config.status: creating version.plist
1119:info:build config.status: creating include/Inventor/system/gl-headers.h.new
1120:info:build /usr/bin/make  all-recursive
1121:info:build make[1]: Entering directory `/opt/local/var/macports/build/_opt_local_var_macports_sources_rsync.macports.org_release_tarballs_ports_graphics_Coin/Coin/work/Coin-3.1.3'
1122:info:build Making all in .
1123:info:build make[2]: Entering directory `/opt/local/var/macports/build/_opt_local_var_macports_sources_rsync.macports.org_release_tarballs_ports_graphics_Coin/Coin/work/Coin-3.1.3'
1124:info:build config.status: creating Coin.pc
1125:info:build make[2]: Leaving directory `/opt/local/var/macports/build/_opt_local_var_macports_sources_rsync.macports.org_release_tarballs_ports_graphics_Coin/Coin/work/Coin-3.1.3'
1126:info:build Making all in bin
1127:info:build make[2]: Entering directory `/opt/local/var/macports/build/_opt_local_var_macports_sources_rsync.macports.org_release_tarballs_ports_graphics_Coin/Coin/work/Coin-3.1.3/bin'
1128:info:build make[2]: Nothing to be done for `all'.
1129:info:build make[2]: Leaving directory `/opt/local/var/macports/build/_opt_local_var_macports_sources_rsync.macports.org_release_tarballs_ports_graphics_Coin/Coin/work/Coin-3.1.3/bin'
1130:info:build Making all in include
1131:info:build make[2]: Entering directory `/opt/local/var/macports/build/_opt_local_var_macports_sources_rsync.macports.org_release_tarballs_ports_graphics_Coin/Coin/work/Coin-3.1.3/include'
1132:info:build Making all in Inventor
1133:info:build make[3]: Entering directory `/opt/local/var/macports/build/_opt_local_var_macports_sources_rsync.macports.org_release_tarballs_ports_graphics_Coin/Coin/work/Coin-3.1.3/include/Inventor'
1134:info:build Making all in C
1135:info:build make[4]: Entering directory `/opt/local/var/macports/build/_opt_local_var_macports_sources_rsync.macports.org_release_tarballs_ports_graphics_Coin/Coin/work/Coin-3.1.3/include/Inventor/C'
1136:info:build /usr/bin/make  all-recursive
1137:info:build make[5]: Entering directory `/opt/local/var/macports/build/_opt_local_var_macports_sources_rsync.macports.org_release_tarballs_ports_graphics_Coin/Coin/work/Coin-3.1.3/include/Inventor/C'
1138:info:build Making all in XML
1139:info:build make[6]: Entering directory `/opt/local/var/macports/build/_opt_local_var_macports_sources_rsync.macports.org_release_tarballs_ports_graphics_Coin/Coin/work/Coin-3.1.3/include/Inventor/C/XML'
1140:info:build make[6]: Nothing to be done for `all'.
1141:info:build make[6]: Leaving directory `/opt/local/var/macports/build/_opt_local_var_macports_sources_rsync.macports.org_release_tarballs_ports_graphics_Coin/Coin/work/Coin-3.1.3/include/Inventor/C/XML'
1142:info:build Making all in base
1143:info:build make[6]: Entering directory `/opt/local/var/macports/build/_opt_local_var_macports_sources_rsync.macports.org_release_tarballs_ports_graphics_Coin/Coin/work/Coin-3.1.3/include/Inventor/C/base'
1144:info:build make[6]: Nothing to be done for `all'.
1145:info:build make[6]: Leaving directory `/opt/local/var/macports/build/_opt_local_var_macports_sources_rsync.macports.org_release_tarballs_ports_graphics_Coin/Coin/work/Coin-3.1.3/include/Inventor/C/base'
1146:info:build Making all in errors
1147:info:build make[6]: Entering directory `/opt/local/var/macports/build/_opt_local_var_macports_sources_rsync.macports.org_release_tarballs_ports_graphics_Coin/Coin/work/Coin-3.1.3/include/Inventor/C/errors'
1148:info:build make[6]: Nothing to be done for `all'.
1149:info:build make[6]: Leaving directory `/opt/local/var/macports/build/_opt_local_var_macports_sources_rsync.macports.org_release_tarballs_ports_graphics_Coin/Coin/work/Coin-3.1.3/include/Inventor/C/errors'
1150:info:build Making all in glue
1151:info:build make[6]: Entering directory `/opt/local/var/macports/build/_opt_local_var_macports_sources_rsync.macports.org_release_tarballs_ports_graphics_Coin/Coin/work/Coin-3.1.3/include/Inventor/C/glue'
1152:info:build make[6]: Nothing to be done for `all'.
1153:info:build make[6]: Leaving directory `/opt/local/var/macports/build/_opt_local_var_macports_sources_rsync.macports.org_release_tarballs_ports_graphics_Coin/Coin/work/Coin-3.1.3/include/Inventor/C/glue'
1154:info:build Making all in threads
1155:info:build make[6]: Entering directory `/opt/local/var/macports/build/_opt_local_var_macports_sources_rsync.macports.org_release_tarballs_ports_graphics_Coin/Coin/work/Coin-3.1.3/include/Inventor/C/threads'
1156:info:build make[6]: Nothing to be done for `all'.
1157:info:build make[6]: Leaving directory `/opt/local/var/macports/build/_opt_local_var_macports_sources_rsync.macports.org_release_tarballs_ports_graphics_Coin/Coin/work/Coin-3.1.3/include/Inventor/C/threads'
1158:info:build make[6]: Entering directory `/opt/local/var/macports/build/_opt_local_var_macports_sources_rsync.macports.org_release_tarballs_ports_graphics_Coin/Coin/work/Coin-3.1.3/include/Inventor/C'
1159:info:build make[6]: Nothing to be done for `all-am'.
1160:info:build make[6]: Leaving directory `/opt/local/var/macports/build/_opt_local_var_macports_sources_rsync.macports.org_release_tarballs_ports_graphics_Coin/Coin/work/Coin-3.1.3/include/Inventor/C'
1161:info:build make[5]: Leaving directory `/opt/local/var/macports/build/_opt_local_var_macports_sources_rsync.macports.org_release_tarballs_ports_graphics_Coin/Coin/work/Coin-3.1.3/include/Inventor/C'
1162:info:build make[4]: Leaving directory `/opt/local/var/macports/build/_opt_local_var_macports_sources_rsync.macports.org_release_tarballs_ports_graphics_Coin/Coin/work/Coin-3.1.3/include/Inventor/C'
1163:info:build Making all in VRMLnodes
1164:info:build make[4]: Entering directory `/opt/local/var/macports/build/_opt_local_var_macports_sources_rsync.macports.org_release_tarballs_ports_graphics_Coin/Coin/work/Coin-3.1.3/include/Inventor/VRMLnodes'
1165:info:build make[4]: Nothing to be done for `all'.
1166:info:build make[4]: Leaving directory `/opt/local/var/macports/build/_opt_local_var_macports_sources_rsync.macports.org_release_tarballs_ports_graphics_Coin/Coin/work/Coin-3.1.3/include/Inventor/VRMLnodes'
1167:info:build Making all in XML
1168:info:build make[4]: Entering directory `/opt/local/var/macports/build/_opt_local_var_macports_sources_rsync.macports.org_release_tarballs_ports_graphics_Coin/Coin/work/Coin-3.1.3/include/Inventor/XML'
1169:info:build make[4]: Nothing to be done for `all'.
1170:info:build make[4]: Leaving directory `/opt/local/var/macports/build/_opt_local_var_macports_sources_rsync.macports.org_release_tarballs_ports_graphics_Coin/Coin/work/Coin-3.1.3/include/Inventor/XML'
1171:info:build Making all in actions
1172:info:build make[4]: Entering directory `/opt/local/var/macports/build/_opt_local_var_macports_sources_rsync.macports.org_release_tarballs_ports_graphics_Coin/Coin/work/Coin-3.1.3/include/Inventor/actions'
1173:info:build make[4]: Nothing to be done for `all'.
1174:info:build make[4]: Leaving directory `/opt/local/var/macports/build/_opt_local_var_macports_sources_rsync.macports.org_release_tarballs_ports_graphics_Coin/Coin/work/Coin-3.1.3/include/Inventor/actions'
1175:info:build Making all in annex
1176:info:build make[4]: Entering directory `/opt/local/var/macports/build/_opt_local_var_macports_sources_rsync.macports.org_release_tarballs_ports_graphics_Coin/Coin/work/Coin-3.1.3/include/Inventor/annex'
1177:info:build Making all in HardCopy
1178:info:build make[5]: Entering directory `/opt/local/var/macports/build/_opt_local_var_macports_sources_rsync.macports.org_release_tarballs_ports_graphics_Coin/Coin/work/Coin-3.1.3/include/Inventor/annex/HardCopy'
1179:info:build make[5]: Nothing to be done for `all'.
1180:info:build make[5]: Leaving directory `/opt/local/var/macports/build/_opt_local_var_macports_sources_rsync.macports.org_release_tarballs_ports_graphics_Coin/Coin/work/Coin-3.1.3/include/Inventor/annex/HardCopy'
1181:info:build Making all in ForeignFiles
1182:info:build make[5]: Entering directory `/opt/local/var/macports/build/_opt_local_var_macports_sources_rsync.macports.org_release_tarballs_ports_graphics_Coin/Coin/work/Coin-3.1.3/include/Inventor/annex/ForeignFiles'
1183:info:build make[5]: Nothing to be done for `all'.
1184:info:build make[5]: Leaving directory `/opt/local/var/macports/build/_opt_local_var_macports_sources_rsync.macports.org_release_tarballs_ports_graphics_Coin/Coin/work/Coin-3.1.3/include/Inventor/annex/ForeignFiles'
1185:info:build Making all in FXViz
1186:info:build make[5]: Entering directory `/opt/local/var/macports/build/_opt_local_var_macports_sources_rsync.macports.org_release_tarballs_ports_graphics_Coin/Coin/work/Coin-3.1.3/include/Inventor/annex/FXViz'
1187:info:build Making all in nodes
1188:info:build make[6]: Entering directory `/opt/local/var/macports/build/_opt_local_var_macports_sources_rsync.macports.org_release_tarballs_ports_graphics_Coin/Coin/work/Coin-3.1.3/include/Inventor/annex/FXViz/nodes'
1189:info:build make[6]: Nothing to be done for `all'.
1190:info:build make[6]: Leaving directory `/opt/local/var/macports/build/_opt_local_var_macports_sources_rsync.macports.org_release_tarballs_ports_graphics_Coin/Coin/work/Coin-3.1.3/include/Inventor/annex/FXViz/nodes'
1191:info:build Making all in elements
1192:info:build make[6]: Entering directory `/opt/local/var/macports/build/_opt_local_var_macports_sources_rsync.macports.org_release_tarballs_ports_graphics_Coin/Coin/work/Coin-3.1.3/include/Inventor/annex/FXViz/elements'
1193:info:build make[6]: Nothing to be done for `all'.
1194:info:build make[6]: Leaving directory `/opt/local/var/macports/build/_opt_local_var_macports_sources_rsync.macports.org_release_tarballs_ports_graphics_Coin/Coin/work/Coin-3.1.3/include/Inventor/annex/FXViz/elements'
1195:info:build make[6]: Entering directory `/opt/local/var/macports/build/_opt_local_var_macports_sources_rsync.macports.org_release_tarballs_ports_graphics_Coin/Coin/work/Coin-3.1.3/include/Inventor/annex/FXViz'
1196:info:build make[6]: Nothing to be done for `all-am'.
1197:info:build make[6]: Leaving directory `/opt/local/var/macports/build/_opt_local_var_macports_sources_rsync.macports.org_release_tarballs_ports_graphics_Coin/Coin/work/Coin-3.1.3/include/Inventor/annex/FXViz'
1198:info:build make[5]: Leaving directory `/opt/local/var/macports/build/_opt_local_var_macports_sources_rsync.macports.org_release_tarballs_ports_graphics_Coin/Coin/work/Coin-3.1.3/include/Inventor/annex/FXViz'
1199:info:build Making all in Profiler
1200:info:build make[5]: Entering directory `/opt/local/var/macports/build/_opt_local_var_macports_sources_rsync.macports.org_release_tarballs_ports_graphics_Coin/Coin/work/Coin-3.1.3/include/Inventor/annex/Profiler'
1201:info:build Making all in nodes
1202:info:build make[6]: Entering directory `/opt/local/var/macports/build/_opt_local_var_macports_sources_rsync.macports.org_release_tarballs_ports_graphics_Coin/Coin/work/Coin-3.1.3/include/Inventor/annex/Profiler/nodes'
1203:info:build make[6]: Nothing to be done for `all'.
1204:info:build make[6]: Leaving directory `/opt/local/var/macports/build/_opt_local_var_macports_sources_rsync.macports.org_release_tarballs_ports_graphics_Coin/Coin/work/Coin-3.1.3/include/Inventor/annex/Profiler/nodes'
1205:info:build Making all in elements
1206:info:build make[6]: Entering directory `/opt/local/var/macports/build/_opt_local_var_macports_sources_rsync.macports.org_release_tarballs_ports_graphics_Coin/Coin/work/Coin-3.1.3/include/Inventor/annex/Profiler/elements'
1207:info:build make[6]: Nothing to be done for `all'.
1208:info:build make[6]: Leaving directory `/opt/local/var/macports/build/_opt_local_var_macports_sources_rsync.macports.org_release_tarballs_ports_graphics_Coin/Coin/work/Coin-3.1.3/include/Inventor/annex/Profiler/elements'
1209:info:build Making all in nodekits
1210:info:build make[6]: Entering directory `/opt/local/var/macports/build/_opt_local_var_macports_sources_rsync.macports.org_release_tarballs_ports_graphics_Coin/Coin/work/Coin-3.1.3/include/Inventor/annex/Profiler/nodekits'
1211:info:build make[6]: Nothing to be done for `all'.
1212:info:build make[6]: Leaving directory `/opt/local/var/macports/build/_opt_local_var_macports_sources_rsync.macports.org_release_tarballs_ports_graphics_Coin/Coin/work/Coin-3.1.3/include/Inventor/annex/Profiler/nodekits'
1213:info:build Making all in engines
1214:info:build make[6]: Entering directory `/opt/local/var/macports/build/_opt_local_var_macports_sources_rsync.macports.org_release_tarballs_ports_graphics_Coin/Coin/work/Coin-3.1.3/include/Inventor/annex/Profiler/engines'
1215:info:build make[6]: Nothing to be done for `all'.
1216:info:build make[6]: Leaving directory `/opt/local/var/macports/build/_opt_local_var_macports_sources_rsync.macports.org_release_tarballs_ports_graphics_Coin/Coin/work/Coin-3.1.3/include/Inventor/annex/Profiler/engines'
1217:info:build Making all in utils
1218:info:build make[6]: Entering directory `/opt/local/var/macports/build/_opt_local_var_macports_sources_rsync.macports.org_release_tarballs_ports_graphics_Coin/Coin/work/Coin-3.1.3/include/Inventor/annex/Profiler/utils'
1219:info:build make[6]: Nothing to be done for `all'.
1220:info:build make[6]: Leaving directory `/opt/local/var/macports/build/_opt_local_var_macports_sources_rsync.macports.org_release_tarballs_ports_graphics_Coin/Coin/work/Coin-3.1.3/include/Inventor/annex/Profiler/utils'
1221:info:build make[6]: Entering directory `/opt/local/var/macports/build/_opt_local_var_macports_sources_rsync.macports.org_release_tarballs_ports_graphics_Coin/Coin/work/Coin-3.1.3/include/Inventor/annex/Profiler'
1222:info:build make[6]: Nothing to be done for `all-am'.
1223:info:build make[6]: Leaving directory `/opt/local/var/macports/build/_opt_local_var_macports_sources_rsync.macports.org_release_tarballs_ports_graphics_Coin/Coin/work/Coin-3.1.3/include/Inventor/annex/Profiler'
1224:info:build make[5]: Leaving directory `/opt/local/var/macports/build/_opt_local_var_macports_sources_rsync.macports.org_release_tarballs_ports_graphics_Coin/Coin/work/Coin-3.1.3/include/Inventor/annex/Profiler'
1225:info:build make[5]: Entering directory `/opt/local/var/macports/build/_opt_local_var_macports_sources_rsync.macports.org_release_tarballs_ports_graphics_Coin/Coin/work/Coin-3.1.3/include/Inventor/annex'
1226:info:build make[5]: Nothing to be done for `all-am'.
1227:info:build make[5]: Leaving directory `/opt/local/var/macports/build/_opt_local_var_macports_sources_rsync.macports.org_release_tarballs_ports_graphics_Coin/Coin/work/Coin-3.1.3/include/Inventor/annex'
1228:info:build make[4]: Leaving directory `/opt/local/var/macports/build/_opt_local_var_macports_sources_rsync.macports.org_release_tarballs_ports_graphics_Coin/Coin/work/Coin-3.1.3/include/Inventor/annex'
1229:info:build Making all in bundles
1230:info:build make[4]: Entering directory `/opt/local/var/macports/build/_opt_local_var_macports_sources_rsync.macports.org_release_tarballs_ports_graphics_Coin/Coin/work/Coin-3.1.3/include/Inventor/bundles'
1231:info:build make[4]: Nothing to be done for `all'.
1232:info:build make[4]: Leaving directory `/opt/local/var/macports/build/_opt_local_var_macports_sources_rsync.macports.org_release_tarballs_ports_graphics_Coin/Coin/work/Coin-3.1.3/include/Inventor/bundles'
1233:info:build Making all in caches
1234:info:build make[4]: Entering directory `/opt/local/var/macports/build/_opt_local_var_macports_sources_rsync.macports.org_release_tarballs_ports_graphics_Coin/Coin/work/Coin-3.1.3/include/Inventor/caches'
1235:info:build make[4]: Nothing to be done for `all'.
1236:info:build make[4]: Leaving directory `/opt/local/var/macports/build/_opt_local_var_macports_sources_rsync.macports.org_release_tarballs_ports_graphics_Coin/Coin/work/Coin-3.1.3/include/Inventor/caches'
1237:info:build Making all in collision
1238:info:build make[4]: Entering directory `/opt/local/var/macports/build/_opt_local_var_macports_sources_rsync.macports.org_release_tarballs_ports_graphics_Coin/Coin/work/Coin-3.1.3/include/Inventor/collision'
1239:info:build make[4]: Nothing to be done for `all'.
1240:info:build make[4]: Leaving directory `/opt/local/var/macports/build/_opt_local_var_macports_sources_rsync.macports.org_release_tarballs_ports_graphics_Coin/Coin/work/Coin-3.1.3/include/Inventor/collision'
1241:info:build Making all in details
1242:info:build make[4]: Entering directory `/opt/local/var/macports/build/_opt_local_var_macports_sources_rsync.macports.org_release_tarballs_ports_graphics_Coin/Coin/work/Coin-3.1.3/include/Inventor/details'
1243:info:build make[4]: Nothing to be done for `all'.
1244:info:build make[4]: Leaving directory `/opt/local/var/macports/build/_opt_local_var_macports_sources_rsync.macports.org_release_tarballs_ports_graphics_Coin/Coin/work/Coin-3.1.3/include/Inventor/details'
1245:info:build Making all in draggers
1246:info:build make[4]: Entering directory `/opt/local/var/macports/build/_opt_local_var_macports_sources_rsync.macports.org_release_tarballs_ports_graphics_Coin/Coin/work/Coin-3.1.3/include/Inventor/draggers'
1247:info:build make[4]: Nothing to be done for `all'.
1248:info:build make[4]: Leaving directory `/opt/local/var/macports/build/_opt_local_var_macports_sources_rsync.macports.org_release_tarballs_ports_graphics_Coin/Coin/work/Coin-3.1.3/include/Inventor/draggers'
1249:info:build Making all in elements
1250:info:build make[4]: Entering directory `/opt/local/var/macports/build/_opt_local_var_macports_sources_rsync.macports.org_release_tarballs_ports_graphics_Coin/Coin/work/Coin-3.1.3/include/Inventor/elements'
1251:info:build make[4]: Nothing to be done for `all'.
1252:info:build make[4]: Leaving directory `/opt/local/var/macports/build/_opt_local_var_macports_sources_rsync.macports.org_release_tarballs_ports_graphics_Coin/Coin/work/Coin-3.1.3/include/Inventor/elements'
1253:info:build Making all in engines
1254:info:build make[4]: Entering directory `/opt/local/var/macports/build/_opt_local_var_macports_sources_rsync.macports.org_release_tarballs_ports_graphics_Coin/Coin/work/Coin-3.1.3/include/Inventor/engines'
1255:info:build make[4]: Nothing to be done for `all'.
1256:info:build make[4]: Leaving directory `/opt/local/var/macports/build/_opt_local_var_macports_sources_rsync.macports.org_release_tarballs_ports_graphics_Coin/Coin/work/Coin-3.1.3/include/Inventor/engines'
1257:info:build Making all in errors
1258:info:build make[4]: Entering directory `/opt/local/var/macports/build/_opt_local_var_macports_sources_rsync.macports.org_release_tarballs_ports_graphics_Coin/Coin/work/Coin-3.1.3/include/Inventor/errors'
1259:info:build make[4]: Nothing to be done for `all'.
1260:info:build make[4]: Leaving directory `/opt/local/var/macports/build/_opt_local_var_macports_sources_rsync.macports.org_release_tarballs_ports_graphics_Coin/Coin/work/Coin-3.1.3/include/Inventor/errors'
1261:info:build Making all in events
1262:info:build make[4]: Entering directory `/opt/local/var/macports/build/_opt_local_var_macports_sources_rsync.macports.org_release_tarballs_ports_graphics_Coin/Coin/work/Coin-3.1.3/include/Inventor/events'
1263:info:build make[4]: Nothing to be done for `all'.
1264:info:build make[4]: Leaving directory `/opt/local/var/macports/build/_opt_local_var_macports_sources_rsync.macports.org_release_tarballs_ports_graphics_Coin/Coin/work/Coin-3.1.3/include/Inventor/events'
1265:info:build Making all in fields
1266:info:build make[4]: Entering directory `/opt/local/var/macports/build/_opt_local_var_macports_sources_rsync.macports.org_release_tarballs_ports_graphics_Coin/Coin/work/Coin-3.1.3/include/Inventor/fields'
1267:info:build make[4]: Nothing to be done for `all'.
1268:info:build make[4]: Leaving directory `/opt/local/var/macports/build/_opt_local_var_macports_sources_rsync.macports.org_release_tarballs_ports_graphics_Coin/Coin/work/Coin-3.1.3/include/Inventor/fields'
1269:info:build Making all in lists
1270:info:build make[4]: Entering directory `/opt/local/var/macports/build/_opt_local_var_macports_sources_rsync.macports.org_release_tarballs_ports_graphics_Coin/Coin/work/Coin-3.1.3/include/Inventor/lists'
1271:info:build make[4]: Nothing to be done for `all'.
1272:info:build make[4]: Leaving directory `/opt/local/var/macports/build/_opt_local_var_macports_sources_rsync.macports.org_release_tarballs_ports_graphics_Coin/Coin/work/Coin-3.1.3/include/Inventor/lists'
1273:info:build Making all in lock
1274:info:build make[4]: Entering directory `/opt/local/var/macports/build/_opt_local_var_macports_sources_rsync.macports.org_release_tarballs_ports_graphics_Coin/Coin/work/Coin-3.1.3/include/Inventor/lock'
1275:info:build make[4]: Nothing to be done for `all'.
1276:info:build make[4]: Leaving directory `/opt/local/var/macports/build/_opt_local_var_macports_sources_rsync.macports.org_release_tarballs_ports_graphics_Coin/Coin/work/Coin-3.1.3/include/Inventor/lock'
1277:info:build Making all in manips
1278:info:build make[4]: Entering directory `/opt/local/var/macports/build/_opt_local_var_macports_sources_rsync.macports.org_release_tarballs_ports_graphics_Coin/Coin/work/Coin-3.1.3/include/Inventor/manips'
1279:info:build make[4]: Nothing to be done for `all'.
1280:info:build make[4]: Leaving directory `/opt/local/var/macports/build/_opt_local_var_macports_sources_rsync.macports.org_release_tarballs_ports_graphics_Coin/Coin/work/Coin-3.1.3/include/Inventor/manips'
1281:info:build Making all in misc
1282:info:build make[4]: Entering directory `/opt/local/var/macports/build/_opt_local_var_macports_sources_rsync.macports.org_release_tarballs_ports_graphics_Coin/Coin/work/Coin-3.1.3/include/Inventor/misc'
1283:info:build make[4]: Nothing to be done for `all'.
1284:info:build make[4]: Leaving directory `/opt/local/var/macports/build/_opt_local_var_macports_sources_rsync.macports.org_release_tarballs_ports_graphics_Coin/Coin/work/Coin-3.1.3/include/Inventor/misc'
1285:info:build Making all in nodekits
1286:info:build make[4]: Entering directory `/opt/local/var/macports/build/_opt_local_var_macports_sources_rsync.macports.org_release_tarballs_ports_graphics_Coin/Coin/work/Coin-3.1.3/include/Inventor/nodekits'
1287:info:build make[4]: Nothing to be done for `all'.
1288:info:build make[4]: Leaving directory `/opt/local/var/macports/build/_opt_local_var_macports_sources_rsync.macports.org_release_tarballs_ports_graphics_Coin/Coin/work/Coin-3.1.3/include/Inventor/nodekits'
1289:info:build Making all in nodes
1290:info:build make[4]: Entering directory `/opt/local/var/macports/build/_opt_local_var_macports_sources_rsync.macports.org_release_tarballs_ports_graphics_Coin/Coin/work/Coin-3.1.3/include/Inventor/nodes'
1291:info:build make[4]: Nothing to be done for `all'.
1292:info:build make[4]: Leaving directory `/opt/local/var/macports/build/_opt_local_var_macports_sources_rsync.macports.org_release_tarballs_ports_graphics_Coin/Coin/work/Coin-3.1.3/include/Inventor/nodes'
1293:info:build Making all in projectors
1294:info:build make[4]: Entering directory `/opt/local/var/macports/build/_opt_local_var_macports_sources_rsync.macports.org_release_tarballs_ports_graphics_Coin/Coin/work/Coin-3.1.3/include/Inventor/projectors'
1295:info:build make[4]: Nothing to be done for `all'.
1296:info:build make[4]: Leaving directory `/opt/local/var/macports/build/_opt_local_var_macports_sources_rsync.macports.org_release_tarballs_ports_graphics_Coin/Coin/work/Coin-3.1.3/include/Inventor/projectors'
1297:info:build Making all in sensors
1298:info:build make[4]: Entering directory `/opt/local/var/macports/build/_opt_local_var_macports_sources_rsync.macports.org_release_tarballs_ports_graphics_Coin/Coin/work/Coin-3.1.3/include/Inventor/sensors'
1299:info:build make[4]: Nothing to be done for `all'.
1300:info:build make[4]: Leaving directory `/opt/local/var/macports/build/_opt_local_var_macports_sources_rsync.macports.org_release_tarballs_ports_graphics_Coin/Coin/work/Coin-3.1.3/include/Inventor/sensors'
1301:info:build Making all in system
1302:info:build make[4]: Entering directory `/opt/local/var/macports/build/_opt_local_var_macports_sources_rsync.macports.org_release_tarballs_ports_graphics_Coin/Coin/work/Coin-3.1.3/include/Inventor/system'
1303:info:build /usr/bin/make  all-am
1304:info:build make[5]: Entering directory `/opt/local/var/macports/build/_opt_local_var_macports_sources_rsync.macports.org_release_tarballs_ports_graphics_Coin/Coin/work/Coin-3.1.3/include/Inventor/system'
1305:info:build make[5]: Nothing to be done for `all-am'.
1306:info:build make[5]: Leaving directory `/opt/local/var/macports/build/_opt_local_var_macports_sources_rsync.macports.org_release_tarballs_ports_graphics_Coin/Coin/work/Coin-3.1.3/include/Inventor/system'
1307:info:build make[4]: Leaving directory `/opt/local/var/macports/build/_opt_local_var_macports_sources_rsync.macports.org_release_tarballs_ports_graphics_Coin/Coin/work/Coin-3.1.3/include/Inventor/system'
1308:info:build Making all in threads
1309:info:build make[4]: Entering directory `/opt/local/var/macports/build/_opt_local_var_macports_sources_rsync.macports.org_release_tarballs_ports_graphics_Coin/Coin/work/Coin-3.1.3/include/Inventor/threads'
1310:info:build make[4]: Nothing to be done for `all'.
1311:info:build make[4]: Leaving directory `/opt/local/var/macports/build/_opt_local_var_macports_sources_rsync.macports.org_release_tarballs_ports_graphics_Coin/Coin/work/Coin-3.1.3/include/Inventor/threads'
1312:info:build Making all in tools
1313:info:build make[4]: Entering directory `/opt/local/var/macports/build/_opt_local_var_macports_sources_rsync.macports.org_release_tarballs_ports_graphics_Coin/Coin/work/Coin-3.1.3/include/Inventor/tools'
1314:info:build make[4]: Nothing to be done for `all'.
1315:info:build make[4]: Leaving directory `/opt/local/var/macports/build/_opt_local_var_macports_sources_rsync.macports.org_release_tarballs_ports_graphics_Coin/Coin/work/Coin-3.1.3/include/Inventor/tools'
1316:info:build Making all in scxml
1317:info:build make[4]: Entering directory `/opt/local/var/macports/build/_opt_local_var_macports_sources_rsync.macports.org_release_tarballs_ports_graphics_Coin/Coin/work/Coin-3.1.3/include/Inventor/scxml'
1318:info:build make[4]: Nothing to be done for `all'.
1319:info:build make[4]: Leaving directory `/opt/local/var/macports/build/_opt_local_var_macports_sources_rsync.macports.org_release_tarballs_ports_graphics_Coin/Coin/work/Coin-3.1.3/include/Inventor/scxml'
1320:info:build make[4]: Entering directory `/opt/local/var/macports/build/_opt_local_var_macports_sources_rsync.macports.org_release_tarballs_ports_graphics_Coin/Coin/work/Coin-3.1.3/include/Inventor'
1321:info:build make[4]: Nothing to be done for `all-am'.
1322:info:build make[4]: Leaving directory `/opt/local/var/macports/build/_opt_local_var_macports_sources_rsync.macports.org_release_tarballs_ports_graphics_Coin/Coin/work/Coin-3.1.3/include/Inventor'
1323:info:build make[3]: Leaving directory `/opt/local/var/macports/build/_opt_local_var_macports_sources_rsync.macports.org_release_tarballs_ports_graphics_Coin/Coin/work/Coin-3.1.3/include/Inventor'
1324:info:build make[3]: Entering directory `/opt/local/var/macports/build/_opt_local_var_macports_sources_rsync.macports.org_release_tarballs_ports_graphics_Coin/Coin/work/Coin-3.1.3/include'
1325:info:build make[3]: Nothing to be done for `all-am'.
1326:info:build make[3]: Leaving directory `/opt/local/var/macports/build/_opt_local_var_macports_sources_rsync.macports.org_release_tarballs_ports_graphics_Coin/Coin/work/Coin-3.1.3/include'
1327:info:build make[2]: Leaving directory `/opt/local/var/macports/build/_opt_local_var_macports_sources_rsync.macports.org_release_tarballs_ports_graphics_Coin/Coin/work/Coin-3.1.3/include'
1328:info:build Making all in data
1329:info:build make[2]: Entering directory `/opt/local/var/macports/build/_opt_local_var_macports_sources_rsync.macports.org_release_tarballs_ports_graphics_Coin/Coin/work/Coin-3.1.3/data'
1330:info:build Making all in draggerDefaults
1331:info:build make[3]: Entering directory `/opt/local/var/macports/build/_opt_local_var_macports_sources_rsync.macports.org_release_tarballs_ports_graphics_Coin/Coin/work/Coin-3.1.3/data/draggerDefaults'
1332:info:build config.status: creating data/draggerDefaults/iv2h.sh
1333:info:build if ./iv2h.sh ./translate1Dragger.iv > translate1Dragger.h; then :; else rm -f translate1Dragger.h; exit 1; fi
1334:info:build if ./iv2h.sh ./translate2Dragger.iv > translate2Dragger.h; then :; else rm -f translate2Dragger.h; exit 1; fi
1335:info:build if ./iv2h.sh ./centerballDragger.iv > centerballDragger.h; then :; else rm -f centerballDragger.h; exit 1; fi
1336:info:build if ./iv2h.sh ./tabPlaneDragger.iv > tabPlaneDragger.h; then :; else rm -f tabPlaneDragger.h; exit 1; fi
1337:info:build if ./iv2h.sh ./tabBoxDragger.iv > tabBoxDragger.h; then :; else rm -f tabBoxDragger.h; exit 1; fi
1338:info:build if ./iv2h.sh ./dragPointDragger.iv > dragPointDragger.h; then :; else rm -f dragPointDragger.h; exit 1; fi
1339:info:build if ./iv2h.sh ./pointLightDragger.iv > pointLightDragger.h; then :; else rm -f pointLightDragger.h; exit 1; fi
1340:info:build if ./iv2h.sh ./directionalLightDragger.iv > directionalLightDragger.h; then :; else rm -f directionalLightDragger.h; exit 1; fi
1341:info:build if ./iv2h.sh ./spotLightDragger.iv > spotLightDragger.h; then :; else rm -f spotLightDragger.h; exit 1; fi
1342:info:build if ./iv2h.sh ./handleBoxDragger.iv > handleBoxDragger.h; then :; else rm -f handleBoxDragger.h; exit 1; fi
1343:info:build if ./iv2h.sh ./jackDragger.iv > jackDragger.h; then :; else rm -f jackDragger.h; exit 1; fi
1344:info:build if ./iv2h.sh ./trackballDragger.iv > trackballDragger.h; then :; else rm -f trackballDragger.h; exit 1; fi
1345:info:build if ./iv2h.sh ./scaleUniformDragger.iv > scaleUniformDragger.h; then :; else rm -f scaleUniformDragger.h; exit 1; fi
1346:info:build if ./iv2h.sh ./scale2UniformDragger.iv > scale2UniformDragger.h; then :; else rm -f scale2UniformDragger.h; exit 1; fi
1347:info:build if ./iv2h.sh ./scale1Dragger.iv > scale1Dragger.h; then :; else rm -f scale1Dragger.h; exit 1; fi
1348:info:build if ./iv2h.sh ./scale2Dragger.iv > scale2Dragger.h; then :; else rm -f scale2Dragger.h; exit 1; fi
1349:info:build if ./iv2h.sh ./rotateCylindricalDragger.iv > rotateCylindricalDragger.h; then :; else rm -f rotateCylindricalDragger.h; exit 1; fi
1350:info:build if ./iv2h.sh ./rotateSphericalDragger.iv > rotateSphericalDragger.h; then :; else rm -f rotateSphericalDragger.h; exit 1; fi
1351:info:build if ./iv2h.sh ./rotateDiscDragger.iv > rotateDiscDragger.h; then :; else rm -f rotateDiscDragger.h; exit 1; fi
1352:info:build if ./iv2h.sh ./transformerDragger.iv > transformerDragger.h; then :; else rm -f transformerDragger.h; exit 1; fi
1353:info:build if ./iv2h.sh ./transformBoxDragger.iv > transformBoxDragger.h; then :; else rm -f transformBoxDragger.h; exit 1; fi
1354:info:build /usr/bin/make  all-am
1355:info:build make[4]: Entering directory `/opt/local/var/macports/build/_opt_local_var_macports_sources_rsync.macports.org_release_tarballs_ports_graphics_Coin/Coin/work/Coin-3.1.3/data/draggerDefaults'
1356:info:build make[4]: Nothing to be done for `all-am'.
1357:info:build make[4]: Leaving directory `/opt/local/var/macports/build/_opt_local_var_macports_sources_rsync.macports.org_release_tarballs_ports_graphics_Coin/Coin/work/Coin-3.1.3/data/draggerDefaults'
1358:info:build make[3]: Leaving directory `/opt/local/var/macports/build/_opt_local_var_macports_sources_rsync.macports.org_release_tarballs_ports_graphics_Coin/Coin/work/Coin-3.1.3/data/draggerDefaults'
1359:info:build Making all in shaders
1360:info:build make[3]: Entering directory `/opt/local/var/macports/build/_opt_local_var_macports_sources_rsync.macports.org_release_tarballs_ports_graphics_Coin/Coin/work/Coin-3.1.3/data/shaders'
1361:info:build Making all in lights
1362:info:build make[4]: Entering directory `/opt/local/var/macports/build/_opt_local_var_macports_sources_rsync.macports.org_release_tarballs_ports_graphics_Coin/Coin/work/Coin-3.1.3/data/shaders/lights'
1363:info:build config.status: creating data/shaders/lights/glsl2h.sh
1364:info:build if ./glsl2h.sh ./PointLight.glsl > PointLight.h; then :; else rm -f PointLight.h; exit 1; fi
1365:info:build if ./glsl2h.sh ./SpotLight.glsl > SpotLight.h; then :; else rm -f SpotLight.h; exit 1; fi
1366:info:build if ./glsl2h.sh ./DirectionalLight.glsl > DirectionalLight.h; then :; else rm -f DirectionalLight.h; exit 1; fi
1367:info:build if ./glsl2h.sh ./DirSpotLight.glsl > DirSpotLight.h; then :; else rm -f DirSpotLight.h; exit 1; fi
1368:info:build /usr/bin/make  all-am
1369:info:build make[5]: Entering directory `/opt/local/var/macports/build/_opt_local_var_macports_sources_rsync.macports.org_release_tarballs_ports_graphics_Coin/Coin/work/Coin-3.1.3/data/shaders/lights'
1370:info:build make[5]: Nothing to be done for `all-am'.
1371:info:build make[5]: Leaving directory `/opt/local/var/macports/build/_opt_local_var_macports_sources_rsync.macports.org_release_tarballs_ports_graphics_Coin/Coin/work/Coin-3.1.3/data/shaders/lights'
1372:info:build make[4]: Leaving directory `/opt/local/var/macports/build/_opt_local_var_macports_sources_rsync.macports.org_release_tarballs_ports_graphics_Coin/Coin/work/Coin-3.1.3/data/shaders/lights'
1373:info:build Making all in vsm
1374:info:build make[4]: Entering directory `/opt/local/var/macports/build/_opt_local_var_macports_sources_rsync.macports.org_release_tarballs_ports_graphics_Coin/Coin/work/Coin-3.1.3/data/shaders/vsm'
1375:info:build config.status: creating data/shaders/vsm/glsl2h.sh
1376:info:build if ./glsl2h.sh ./VsmLookup.glsl > VsmLookup.h; then :; else rm -f VsmLookup.h; exit 1; fi
1377:info:build /usr/bin/make  all-am
1378:info:build make[5]: Entering directory `/opt/local/var/macports/build/_opt_local_var_macports_sources_rsync.macports.org_release_tarballs_ports_graphics_Coin/Coin/work/Coin-3.1.3/data/shaders/vsm'
1379:info:build make[5]: Nothing to be done for `all-am'.
1380:info:build make[5]: Leaving directory `/opt/local/var/macports/build/_opt_local_var_macports_sources_rsync.macports.org_release_tarballs_ports_graphics_Coin/Coin/work/Coin-3.1.3/data/shaders/vsm'
1381:info:build make[4]: Leaving directory `/opt/local/var/macports/build/_opt_local_var_macports_sources_rsync.macports.org_release_tarballs_ports_graphics_Coin/Coin/work/Coin-3.1.3/data/shaders/vsm'
1382:info:build make[4]: Entering directory `/opt/local/var/macports/build/_opt_local_var_macports_sources_rsync.macports.org_release_tarballs_ports_graphics_Coin/Coin/work/Coin-3.1.3/data/shaders'
1383:info:build make[4]: Nothing to be done for `all-am'.
1384:info:build make[4]: Leaving directory `/opt/local/var/macports/build/_opt_local_var_macports_sources_rsync.macports.org_release_tarballs_ports_graphics_Coin/Coin/work/Coin-3.1.3/data/shaders'
1385:info:build make[3]: Leaving directory `/opt/local/var/macports/build/_opt_local_var_macports_sources_rsync.macports.org_release_tarballs_ports_graphics_Coin/Coin/work/Coin-3.1.3/data/shaders'
1386:info:build Making all in scxml
1387:info:build make[3]: Entering directory `/opt/local/var/macports/build/_opt_local_var_macports_sources_rsync.macports.org_release_tarballs_ports_graphics_Coin/Coin/work/Coin-3.1.3/data/scxml'
1388:info:build Making all in navigation
1389:info:build make[4]: Entering directory `/opt/local/var/macports/build/_opt_local_var_macports_sources_rsync.macports.org_release_tarballs_ports_graphics_Coin/Coin/work/Coin-3.1.3/data/scxml/navigation'
1390:info:build make[4]: Nothing to be done for `all'.
1391:info:build make[4]: Leaving directory `/opt/local/var/macports/build/_opt_local_var_macports_sources_rsync.macports.org_release_tarballs_ports_graphics_Coin/Coin/work/Coin-3.1.3/data/scxml/navigation'
1392:info:build make[4]: Entering directory `/opt/local/var/macports/build/_opt_local_var_macports_sources_rsync.macports.org_release_tarballs_ports_graphics_Coin/Coin/work/Coin-3.1.3/data/scxml'
1393:info:build make[4]: Nothing to be done for `all-am'.
1394:info:build make[4]: Leaving directory `/opt/local/var/macports/build/_opt_local_var_macports_sources_rsync.macports.org_release_tarballs_ports_graphics_Coin/Coin/work/Coin-3.1.3/data/scxml'
1395:info:build make[3]: Leaving directory `/opt/local/var/macports/build/_opt_local_var_macports_sources_rsync.macports.org_release_tarballs_ports_graphics_Coin/Coin/work/Coin-3.1.3/data/scxml'
1396:info:build make[3]: Entering directory `/opt/local/var/macports/build/_opt_local_var_macports_sources_rsync.macports.org_release_tarballs_ports_graphics_Coin/Coin/work/Coin-3.1.3/data'
1397:info:build make[3]: Nothing to be done for `all-am'.
1398:info:build make[3]: Leaving directory `/opt/local/var/macports/build/_opt_local_var_macports_sources_rsync.macports.org_release_tarballs_ports_graphics_Coin/Coin/work/Coin-3.1.3/data'
1399:info:build make[2]: Leaving directory `/opt/local/var/macports/build/_opt_local_var_macports_sources_rsync.macports.org_release_tarballs_ports_graphics_Coin/Coin/work/Coin-3.1.3/data'
1400:info:build Making all in src
1401:info:build make[2]: Entering directory `/opt/local/var/macports/build/_opt_local_var_macports_sources_rsync.macports.org_release_tarballs_ports_graphics_Coin/Coin/work/Coin-3.1.3/src'
1402:info:build /usr/bin/make  all-recursive
1403:info:build make[3]: Entering directory `/opt/local/var/macports/build/_opt_local_var_macports_sources_rsync.macports.org_release_tarballs_ports_graphics_Coin/Coin/work/Coin-3.1.3/src'
1404:info:build Making all in extensions
1405:info:build make[4]: Entering directory `/opt/local/var/macports/build/_opt_local_var_macports_sources_rsync.macports.org_release_tarballs_ports_graphics_Coin/Coin/work/Coin-3.1.3/src/extensions'
1406:info:build make[5]: Entering directory `/opt/local/var/macports/build/_opt_local_var_macports_sources_rsync.macports.org_release_tarballs_ports_graphics_Coin/Coin/work/Coin-3.1.3/src/extensions'
1407:info:build make[5]: Nothing to be done for `all-am'.
1408:info:build make[5]: Leaving directory `/opt/local/var/macports/build/_opt_local_var_macports_sources_rsync.macports.org_release_tarballs_ports_graphics_Coin/Coin/work/Coin-3.1.3/src/extensions'
1409:info:build make[4]: Leaving directory `/opt/local/var/macports/build/_opt_local_var_macports_sources_rsync.macports.org_release_tarballs_ports_graphics_Coin/Coin/work/Coin-3.1.3/src/extensions'
1410:info:build Making all in xml
1411:info:build make[4]: Entering directory `/opt/local/var/macports/build/_opt_local_var_macports_sources_rsync.macports.org_release_tarballs_ports_graphics_Coin/Coin/work/Coin-3.1.3/src/xml'
1412:info:build Making all in expat
1413:info:build make[5]: Entering directory `/opt/local/var/macports/build/_opt_local_var_macports_sources_rsync.macports.org_release_tarballs_ports_graphics_Coin/Coin/work/Coin-3.1.3/src/xml/expat'
1414:info:build if /bin/sh ../../../libtool --mode=compile /usr/bin/clang -DHAVE_CONFIG_H -I../../../include -I../../../include  -I../../../src -I../../../src   -I/opt/local/include -no-cpp-precomp -D_REENTRANT -DCOIN_DEBUG=1 -DCOIN_INTERNAL -I/usr/X11R6/include  -pipe -O2 -arch x86_64 -W -Wall -Wno-unused -Wno-multichar  -fno-builtin -finline-functions -Wreturn-type -Wchar-subscripts -Wparentheses -MT all-expat-c.lo -MD -MP -MF ".deps/all-expat-c.Tpo" -c -o all-expat-c.lo all-expat-c.c; \
1415:info:build     then mv -f ".deps/all-expat-c.Tpo" ".deps/all-expat-c.Plo"; else rm -f ".deps/all-expat-c.Tpo"; exit 1; fi
1416:info:build mkdir .libs
1417:info:build  /usr/bin/clang -DHAVE_CONFIG_H -I../../../include -I../../../include -I../../../src -I../../../src -I/opt/local/include -no-cpp-precomp -D_REENTRANT -DCOIN_DEBUG=1 -DCOIN_INTERNAL -I/usr/X11R6/include -pipe -O2 -arch x86_64 -W -Wall -Wno-unused -Wno-multichar -fno-builtin -finline-functions -Wreturn-type -Wchar-subscripts -Wparentheses -MT all-expat-c.lo -MD -MP -MF .deps/all-expat-c.Tpo -c all-expat-c.c  -fno-common -DPIC -o .libs/all-expat-c.o
1418:info:build In file included from all-expat-c.c:4:
1419:info:build ./xmltok.c:125:25: warning: unused parameter 'enc' [-Wunused-parameter]
1420:info:build isNever(const ENCODING *enc, const char *p)
1421:info:build                         ^
1422:info:build ./xmltok.c:125:42: warning: unused parameter 'p' [-Wunused-parameter]
1423:info:build isNever(const ENCODING *enc, const char *p)
1424:info:build                                          ^
1425:info:build ./xmltok.c:131:30: warning: unused parameter 'enc' [-Wunused-parameter]
1426:info:build utf8_isName2(const ENCODING *enc, const char *p)
1427:info:build                              ^
1428:info:build ./xmltok.c:137:30: warning: unused parameter 'enc' [-Wunused-parameter]
1429:info:build utf8_isName3(const ENCODING *enc, const char *p)
1430:info:build                              ^
1431:info:build ./xmltok.c:145:32: warning: unused parameter 'enc' [-Wunused-parameter]
1432:info:build utf8_isNmstrt2(const ENCODING *enc, const char *p)
1433:info:build                                ^
1434:info:build ./xmltok.c:151:32: warning: unused parameter 'enc' [-Wunused-parameter]
1435:info:build utf8_isNmstrt3(const ENCODING *enc, const char *p)
1436:info:build                                ^
1437:info:build ./xmltok.c:159:33: warning: unused parameter 'enc' [-Wunused-parameter]
1438:info:build utf8_isInvalid2(const ENCODING *enc, const char *p)
1439:info:build                                 ^
1440:info:build ./xmltok.c:165:33: warning: unused parameter 'enc' [-Wunused-parameter]
1441:info:build utf8_isInvalid3(const ENCODING *enc, const char *p)
1442:info:build                                 ^
1443:info:build ./xmltok.c:171:33: warning: unused parameter 'enc' [-Wunused-parameter]
1444:info:build utf8_isInvalid4(const ENCODING *enc, const char *p)
1445:info:build                                 ^
1446:info:build In file included from all-expat-c.c:4:
1447:info:build In file included from ./xmltok.c:301:
1448:info:build ./xmltok_impl.c:178:39: warning: unused parameter 'enc' [-Wunused-parameter]
1449:info:build PREFIX(checkPiTarget)(const ENCODING *enc, const char *ptr,
1450:info:build                                       ^
1451:info:build ./xmltok_impl.c:285:42: warning: unused parameter 'enc' [-Wunused-parameter]
1452:info:build PREFIX(scanCdataSection)(const ENCODING *enc, const char *ptr,
1453:info:build                                          ^
1454:info:build ./xmltok_impl.c:1524:39: warning: unused parameter 'enc' [-Wunused-parameter]
1455:info:build PREFIX(charRefNumber)(const ENCODING *enc, const char *ptr)
1456:info:build                                       ^
1457:info:build ./xmltok_impl.c:1568:46: warning: unused parameter 'enc' [-Wunused-parameter]
1458:info:build PREFIX(predefinedEntityName)(const ENCODING *enc, const char *ptr,
1459:info:build                                              ^
1460:info:build ./xmltok_impl.c:1686:42: warning: unused parameter 'enc' [-Wunused-parameter]
1461:info:build PREFIX(nameMatchesAscii)(const ENCODING *enc, const char *ptr1,
1462:info:build                                          ^
1463:info:build In file included from all-expat-c.c:4:
1464:info:build ./xmltok.c:322:29: warning: unused parameter 'enc' [-Wunused-parameter]
1465:info:build utf8_toUtf8(const ENCODING *enc,
1466:info:build                             ^
1467:info:build ./xmltok.c:429:31: warning: unused parameter 'enc' [-Wunused-parameter]
1468:info:build latin1_toUtf8(const ENCODING *enc,
1469:info:build                               ^
1470:info:build ./xmltok.c:454:32: warning: unused parameter 'enc' [-Wunused-parameter]
1471:info:build latin1_toUtf16(const ENCODING *enc,
1472:info:build                                ^
1473:info:build ./xmltok.c:484:1: warning: missing field 'isName2' initializer [-Wmissing-field-initializers]
1474:info:build };
1475:info:build ^
1476:info:build ./xmltok.c:487:30: warning: unused parameter 'enc' [-Wunused-parameter]
1477:info:build ascii_toUtf8(const ENCODING *enc,
1478:info:build                              ^
1479:info:build ./xmltok.c:517:1: warning: missing field 'isName2' initializer [-Wmissing-field-initializers]
1480:info:build };
1481:info:build ^
1482:info:build ./xmltok.c:620:1: warning: unused parameter 'enc' [-Wunused-parameter]
1483:info:build DEFINE_UTF16_TO_UTF8(little2_)
1484:info:build ^
1485:info:build ./xmltok.c:540:29: note: expanded from macro 'DEFINE_UTF16_TO_UTF8'
1486:info:build E ## toUtf8(const ENCODING *enc, \
1487:info:build                             ^
1488:info:build ./xmltok.c:621:1: warning: unused parameter 'enc' [-Wunused-parameter]
1489:info:build DEFINE_UTF16_TO_UTF16(little2_)
1490:info:build ^
1491:info:build ./xmltok.c:603:30: note: expanded from macro 'DEFINE_UTF16_TO_UTF16'
1492:info:build E ## toUtf16(const ENCODING *enc, \
1493:info:build                              ^
1494:info:build ./xmltok.c:632:1: warning: unused parameter 'enc' [-Wunused-parameter]
1495:info:build DEFINE_UTF16_TO_UTF8(big2_)
1496:info:build ^
1497:info:build ./xmltok.c:540:29: note: expanded from macro 'DEFINE_UTF16_TO_UTF8'
1498:info:build E ## toUtf8(const ENCODING *enc, \
1499:info:build                             ^
1500:info:build ./xmltok.c:633:1: warning: unused parameter 'enc' [-Wunused-parameter]
1501:info:build DEFINE_UTF16_TO_UTF16(big2_)
1502:info:build ^
1503:info:build ./xmltok.c:603:30: note: expanded from macro 'DEFINE_UTF16_TO_UTF16'
1504:info:build E ## toUtf16(const ENCODING *enc, \
1505:info:build                              ^
1506:info:build In file included from all-expat-c.c:4:
1507:info:build In file included from ./xmltok.c:700:
1508:info:build ./xmltok_impl.c:178:39: warning: unused parameter 'enc' [-Wunused-parameter]
1509:info:build PREFIX(checkPiTarget)(const ENCODING *enc, const char *ptr,
1510:info:build                                       ^
1511:info:build ./xmltok_impl.c:285:42: warning: unused parameter 'enc' [-Wunused-parameter]
1512:info:build PREFIX(scanCdataSection)(const ENCODING *enc, const char *ptr,
1513:info:build                                          ^
1514:info:build ./xmltok_impl.c:1524:39: warning: unused parameter 'enc' [-Wunused-parameter]
1515:info:build PREFIX(charRefNumber)(const ENCODING *enc, const char *ptr)
1516:info:build                                       ^
1517:info:build ./xmltok_impl.c:1568:46: warning: unused parameter 'enc' [-Wunused-parameter]
1518:info:build PREFIX(predefinedEntityName)(const ENCODING *enc, const char *ptr,
1519:info:build                                              ^
1520:info:build ./xmltok_impl.c:1686:42: warning: unused parameter 'enc' [-Wunused-parameter]
1521:info:build PREFIX(nameMatchesAscii)(const ENCODING *enc, const char *ptr1,
1522:info:build                                          ^
1523:info:build In file included from all-expat-c.c:4:
1524:info:build ./xmltok.c:749:1: warning: missing field 'isName2' initializer [-Wmissing-field-initializers]
1525:info:build };
1526:info:build ^
1527:info:build ./xmltok.c:775:1: warning: missing field 'isName2' initializer [-Wmissing-field-initializers]
1528:info:build };
1529:info:build ^
1530:info:build In file included from all-expat-c.c:4:
1531:info:build In file included from ./xmltok.c:841:
1532:info:build ./xmltok_impl.c:178:39: warning: unused parameter 'enc' [-Wunused-parameter]
1533:info:build PREFIX(checkPiTarget)(const ENCODING *enc, const char *ptr,
1534:info:build                                       ^
1535:info:build ./xmltok_impl.c:285:42: warning: unused parameter 'enc' [-Wunused-parameter]
1536:info:build PREFIX(scanCdataSection)(const ENCODING *enc, const char *ptr,
1537:info:build                                          ^
1538:info:build ./xmltok_impl.c:1524:39: warning: unused parameter 'enc' [-Wunused-parameter]
1539:info:build PREFIX(charRefNumber)(const ENCODING *enc, const char *ptr)
1540:info:build                                       ^
1541:info:build ./xmltok_impl.c:1568:46: warning: unused parameter 'enc' [-Wunused-parameter]
1542:info:build PREFIX(predefinedEntityName)(const ENCODING *enc, const char *ptr,
1543:info:build                                              ^
1544:info:build ./xmltok_impl.c:1686:42: warning: unused parameter 'enc' [-Wunused-parameter]
1545:info:build PREFIX(nameMatchesAscii)(const ENCODING *enc, const char *ptr1,
1546:info:build                                          ^
1547:info:build In file included from all-expat-c.c:4:
1548:info:build ./xmltok.c:890:1: warning: missing field 'isName2' initializer [-Wmissing-field-initializers]
1549:info:build };
1550:info:build ^
1551:info:build ./xmltok.c:916:1: warning: missing field 'isName2' initializer [-Wmissing-field-initializers]
1552:info:build };
1553:info:build ^
1554:info:build ./xmltok.c:941:36: warning: unused parameter 'enc' [-Wunused-parameter]
1555:info:build initUpdatePosition(const ENCODING *enc, const char *ptr,
1556:info:build                                    ^
1557:info:build In file included from all-expat-c.c:5:
1558:info:build ./xmlparse.c:1152:30: warning: unused parameter 'parser' [-Wunused-parameter]
1559:info:build XML_UseForeignDTD(XML_Parser parser, XML_Bool useDTD)
1560:info:build                              ^
1561:info:build ./xmlparse.c:1152:47: warning: unused parameter 'useDTD' [-Wunused-parameter]
1562:info:build XML_UseForeignDTD(XML_Parser parser, XML_Bool useDTD)
1563:info:build                                               ^
1564:info:build ./xmlparse.c:1493:15: warning: enumeration value 'XML_FINISHED' not handled in switch [-Wswitch]
1565:info:build       switch (ps_parsing) {
1566:info:build               ^
1567:info:build ./xmlparse.c:651:20: note: expanded from macro 'ps_parsing'
1568:info:build #define ps_parsing (parser->m_parsingStatus.parsing)
1569:info:build                    ^
1570:info:build ./xmlparse.c:1780:32: warning: unused parameter 'parser' [-Wunused-parameter]
1571:info:build XML_GetInputContext(XML_Parser parser, int *offset, int *size)
1572:info:build                                ^
1573:info:build ./xmlparse.c:1780:45: warning: unused parameter 'offset' [-Wunused-parameter]
1574:info:build XML_GetInputContext(XML_Parser parser, int *offset, int *size)
1575:info:build                                             ^
1576:info:build ./xmlparse.c:1780:58: warning: unused parameter 'size' [-Wunused-parameter]
1577:info:build XML_GetInputContext(XML_Parser parser, int *offset, int *size)
1578:info:build                                                          ^
1579:info:build ./xmlparse.c:4805:28: warning: unused parameter 's' [-Wunused-parameter]
1580:info:build                const char *s,
1581:info:build                            ^
1582:info:build ./xmlparse.c:4806:28: warning: unused parameter 'end' [-Wunused-parameter]
1583:info:build                const char *end,
1584:info:build                            ^
1585:info:build ./xmlparse.c:4807:29: warning: unused parameter 'nextPtr' [-Wunused-parameter]
1586:info:build                const char **nextPtr)
1587:info:build                             ^
1588:info:build In file included from all-expat-c.c:6:
1589:info:build ./xmlrole.c:198:21: warning: unused parameter 'ptr' [-Wunused-parameter]
1590:info:build         const char *ptr,
1591:info:build                     ^
1592:info:build ./xmlrole.c:199:21: warning: unused parameter 'end' [-Wunused-parameter]
1593:info:build         const char *end,
1594:info:build                     ^
1595:info:build ./xmlrole.c:200:25: warning: unused parameter 'enc' [-Wunused-parameter]
1596:info:build         const ENCODING *enc)
1597:info:build                         ^
1598:info:build ./xmlrole.c:219:22: warning: unused parameter 'ptr' [-Wunused-parameter]
1599:info:build          const char *ptr,
1600:info:build                      ^
1601:info:build ./xmlrole.c:220:22: warning: unused parameter 'end' [-Wunused-parameter]
1602:info:build          const char *end,
1603:info:build                      ^
1604:info:build ./xmlrole.c:221:26: warning: unused parameter 'enc' [-Wunused-parameter]
1605:info:build          const ENCODING *enc)
1606:info:build                          ^
1607:info:build ./xmlrole.c:267:22: warning: unused parameter 'ptr' [-Wunused-parameter]
1608:info:build          const char *ptr,
1609:info:build                      ^
1610:info:build ./xmlrole.c:268:22: warning: unused parameter 'end' [-Wunused-parameter]
1611:info:build          const char *end,
1612:info:build                      ^
1613:info:build ./xmlrole.c:269:26: warning: unused parameter 'enc' [-Wunused-parameter]
1614:info:build          const ENCODING *enc)
1615:info:build                          ^
1616:info:build ./xmlrole.c:284:22: warning: unused parameter 'ptr' [-Wunused-parameter]
1617:info:build          const char *ptr,
1618:info:build                      ^
1619:info:build ./xmlrole.c:285:22: warning: unused parameter 'end' [-Wunused-parameter]
1620:info:build          const char *end,
1621:info:build                      ^
1622:info:build ./xmlrole.c:286:26: warning: unused parameter 'enc' [-Wunused-parameter]
1623:info:build          const ENCODING *enc)
1624:info:build                          ^
1625:info:build ./xmlrole.c:301:22: warning: unused parameter 'ptr' [-Wunused-parameter]
1626:info:build          const char *ptr,
1627:info:build                      ^
1628:info:build ./xmlrole.c:302:22: warning: unused parameter 'end' [-Wunused-parameter]
1629:info:build          const char *end,
1630:info:build                      ^
1631:info:build ./xmlrole.c:303:26: warning: unused parameter 'enc' [-Wunused-parameter]
1632:info:build          const ENCODING *enc)
1633:info:build                          ^
1634:info:build ./xmlrole.c:321:22: warning: unused parameter 'ptr' [-Wunused-parameter]
1635:info:build          const char *ptr,
1636:info:build                      ^
1637:info:build ./xmlrole.c:322:22: warning: unused parameter 'end' [-Wunused-parameter]
1638:info:build          const char *end,
1639:info:build                      ^
1640:info:build ./xmlrole.c:323:26: warning: unused parameter 'enc' [-Wunused-parameter]
1641:info:build          const ENCODING *enc)
1642:info:build                          ^
1643:info:build ./xmlrole.c:440:21: warning: unused parameter 'ptr' [-Wunused-parameter]
1644:info:build         const char *ptr,
1645:info:build                     ^
1646:info:build ./xmlrole.c:441:21: warning: unused parameter 'end' [-Wunused-parameter]
1647:info:build         const char *end,
1648:info:build                     ^
1649:info:build ./xmlrole.c:442:25: warning: unused parameter 'enc' [-Wunused-parameter]
1650:info:build         const ENCODING *enc)
1651:info:build                         ^
1652:info:build ./xmlrole.c:460:21: warning: unused parameter 'ptr' [-Wunused-parameter]
1653:info:build         const char *ptr,
1654:info:build                     ^
1655:info:build ./xmlrole.c:461:21: warning: unused parameter 'end' [-Wunused-parameter]
1656:info:build         const char *end,
1657:info:build                     ^
1658:info:build ./xmlrole.c:462:25: warning: unused parameter 'enc' [-Wunused-parameter]
1659:info:build         const ENCODING *enc)
1660:info:build                         ^
1661:info:build ./xmlrole.c:505:21: warning: unused parameter 'ptr' [-Wunused-parameter]
1662:info:build         const char *ptr,
1663:info:build                     ^
1664:info:build ./xmlrole.c:506:21: warning: unused parameter 'end' [-Wunused-parameter]
1665:info:build         const char *end,
1666:info:build                     ^
1667:info:build ./xmlrole.c:507:25: warning: unused parameter 'enc' [-Wunused-parameter]
1668:info:build         const ENCODING *enc)
1669:info:build                         ^
1670:info:build ./xmlrole.c:522:21: warning: unused parameter 'ptr' [-Wunused-parameter]
1671:info:build         const char *ptr,
1672:info:build                     ^
1673:info:build ./xmlrole.c:523:21: warning: unused parameter 'end' [-Wunused-parameter]
1674:info:build         const char *end,
1675:info:build                     ^
1676:info:build ./xmlrole.c:524:25: warning: unused parameter 'enc' [-Wunused-parameter]
1677:info:build         const ENCODING *enc)
1678:info:build                         ^
1679:info:build ./xmlrole.c:562:21: warning: unused parameter 'ptr' [-Wunused-parameter]
1680:info:build         const char *ptr,
1681:info:build                     ^
1682:info:build ./xmlrole.c:563:21: warning: unused parameter 'end' [-Wunused-parameter]
1683:info:build         const char *end,
1684:info:build                     ^
1685:info:build ./xmlrole.c:564:25: warning: unused parameter 'enc' [-Wunused-parameter]
1686:info:build         const ENCODING *enc)
1687:info:build                         ^
1688:info:build ./xmlrole.c:608:21: warning: unused parameter 'ptr' [-Wunused-parameter]
1689:info:build         const char *ptr,
1690:info:build                     ^
1691:info:build ./xmlrole.c:609:21: warning: unused parameter 'end' [-Wunused-parameter]
1692:info:build         const char *end,
1693:info:build                     ^
1694:info:build ./xmlrole.c:610:25: warning: unused parameter 'enc' [-Wunused-parameter]
1695:info:build         const ENCODING *enc)
1696:info:build                         ^
1697:info:build ./xmlrole.c:625:21: warning: unused parameter 'ptr' [-Wunused-parameter]
1698:info:build         const char *ptr,
1699:info:build                     ^
1700:info:build ./xmlrole.c:626:21: warning: unused parameter 'end' [-Wunused-parameter]
1701:info:build         const char *end,
1702:info:build                     ^
1703:info:build ./xmlrole.c:627:25: warning: unused parameter 'enc' [-Wunused-parameter]
1704:info:build         const ENCODING *enc)
1705:info:build                         ^
1706:info:build ./xmlrole.c:642:22: warning: unused parameter 'ptr' [-Wunused-parameter]
1707:info:build          const char *ptr,
1708:info:build                      ^
1709:info:build ./xmlrole.c:643:22: warning: unused parameter 'end' [-Wunused-parameter]
1710:info:build          const char *end,
1711:info:build                      ^
1712:info:build ./xmlrole.c:644:26: warning: unused parameter 'enc' [-Wunused-parameter]
1713:info:build          const ENCODING *enc)
1714:info:build                          ^
1715:info:build ./xmlrole.c:659:23: warning: unused parameter 'ptr' [-Wunused-parameter]
1716:info:build           const char *ptr,
1717:info:build                       ^
1718:info:build ./xmlrole.c:660:23: warning: unused parameter 'end' [-Wunused-parameter]
1719:info:build           const char *end,
1720:info:build                       ^
1721:info:build ./xmlrole.c:661:27: warning: unused parameter 'enc' [-Wunused-parameter]
1722:info:build           const ENCODING *enc)
1723:info:build                           ^
1724:info:build ./xmlrole.c:700:23: warning: unused parameter 'ptr' [-Wunused-parameter]
1725:info:build           const char *ptr,
1726:info:build                       ^
1727:info:build ./xmlrole.c:701:23: warning: unused parameter 'end' [-Wunused-parameter]
1728:info:build           const char *end,
1729:info:build                       ^
1730:info:build ./xmlrole.c:702:27: warning: unused parameter 'enc' [-Wunused-parameter]
1731:info:build           const ENCODING *enc)
1732:info:build                           ^
1733:info:build ./xmlrole.c:717:23: warning: unused parameter 'ptr' [-Wunused-parameter]
1734:info:build           const char *ptr,
1735:info:build                       ^
1736:info:build ./xmlrole.c:718:23: warning: unused parameter 'end' [-Wunused-parameter]
1737:info:build           const char *end,
1738:info:build                       ^
1739:info:build ./xmlrole.c:719:27: warning: unused parameter 'enc' [-Wunused-parameter]
1740:info:build           const ENCODING *enc)
1741:info:build                           ^
1742:info:build ./xmlrole.c:735:23: warning: unused parameter 'ptr' [-Wunused-parameter]
1743:info:build           const char *ptr,
1744:info:build                       ^
1745:info:build ./xmlrole.c:736:23: warning: unused parameter 'end' [-Wunused-parameter]
1746:info:build           const char *end,
1747:info:build                       ^
1748:info:build ./xmlrole.c:737:27: warning: unused parameter 'enc' [-Wunused-parameter]
1749:info:build           const ENCODING *enc)
1750:info:build                           ^
1751:info:build ./xmlrole.c:756:22: warning: unused parameter 'ptr' [-Wunused-parameter]
1752:info:build          const char *ptr,
1753:info:build                      ^
1754:info:build ./xmlrole.c:757:22: warning: unused parameter 'end' [-Wunused-parameter]
1755:info:build          const char *end,
1756:info:build                      ^
1757:info:build ./xmlrole.c:758:26: warning: unused parameter 'enc' [-Wunused-parameter]
1758:info:build          const ENCODING *enc)
1759:info:build                          ^
1760:info:build ./xmlrole.c:774:22: warning: unused parameter 'ptr' [-Wunused-parameter]
1761:info:build          const char *ptr,
1762:info:build                      ^
1763:info:build ./xmlrole.c:775:22: warning: unused parameter 'end' [-Wunused-parameter]
1764:info:build          const char *end,
1765:info:build                      ^
1766:info:build ./xmlrole.c:776:26: warning: unused parameter 'enc' [-Wunused-parameter]
1767:info:build          const ENCODING *enc)
1768:info:build                          ^
1769:info:build ./xmlrole.c:836:22: warning: unused parameter 'ptr' [-Wunused-parameter]
1770:info:build          const char *ptr,
1771:info:build                      ^
1772:info:build ./xmlrole.c:837:22: warning: unused parameter 'end' [-Wunused-parameter]
1773:info:build          const char *end,
1774:info:build                      ^
1775:info:build ./xmlrole.c:838:26: warning: unused parameter 'enc' [-Wunused-parameter]
1776:info:build          const ENCODING *enc)
1777:info:build                          ^
1778:info:build ./xmlrole.c:855:22: warning: unused parameter 'ptr' [-Wunused-parameter]
1779:info:build          const char *ptr,
1780:info:build                      ^
1781:info:build ./xmlrole.c:856:22: warning: unused parameter 'end' [-Wunused-parameter]
1782:info:build          const char *end,
1783:info:build                      ^
1784:info:build ./xmlrole.c:857:26: warning: unused parameter 'enc' [-Wunused-parameter]
1785:info:build          const ENCODING *enc)
1786:info:build                          ^
1787:info:build ./xmlrole.c:875:22: warning: unused parameter 'ptr' [-Wunused-parameter]
1788:info:build          const char *ptr,
1789:info:build                      ^
1790:info:build ./xmlrole.c:876:22: warning: unused parameter 'end' [-Wunused-parameter]
1791:info:build          const char *end,
1792:info:build                      ^
1793:info:build ./xmlrole.c:877:26: warning: unused parameter 'enc' [-Wunused-parameter]
1794:info:build          const ENCODING *enc)
1795:info:build                          ^
1796:info:build ./xmlrole.c:892:22: warning: unused parameter 'ptr' [-Wunused-parameter]
1797:info:build          const char *ptr,
1798:info:build                      ^
1799:info:build ./xmlrole.c:893:22: warning: unused parameter 'end' [-Wunused-parameter]
1800:info:build          const char *end,
1801:info:build                      ^
1802:info:build ./xmlrole.c:894:26: warning: unused parameter 'enc' [-Wunused-parameter]
1803:info:build          const ENCODING *enc)
1804:info:build                          ^
1805:info:build ./xmlrole.c:909:22: warning: unused parameter 'ptr' [-Wunused-parameter]
1806:info:build          const char *ptr,
1807:info:build                      ^
1808:info:build ./xmlrole.c:910:22: warning: unused parameter 'end' [-Wunused-parameter]
1809:info:build          const char *end,
1810:info:build                      ^
1811:info:build ./xmlrole.c:911:26: warning: unused parameter 'enc' [-Wunused-parameter]
1812:info:build          const ENCODING *enc)
1813:info:build                          ^
1814:info:build ./xmlrole.c:970:22: warning: unused parameter 'ptr' [-Wunused-parameter]
1815:info:build          const char *ptr,
1816:info:build                      ^
1817:info:build ./xmlrole.c:971:22: warning: unused parameter 'end' [-Wunused-parameter]
1818:info:build          const char *end,
1819:info:build                      ^
1820:info:build ./xmlrole.c:972:26: warning: unused parameter 'enc' [-Wunused-parameter]
1821:info:build          const ENCODING *enc)
1822:info:build                          ^
1823:info:build ./xmlrole.c:987:22: warning: unused parameter 'ptr' [-Wunused-parameter]
1824:info:build          const char *ptr,
1825:info:build                      ^
1826:info:build ./xmlrole.c:988:22: warning: unused parameter 'end' [-Wunused-parameter]
1827:info:build          const char *end,
1828:info:build                      ^
1829:info:build ./xmlrole.c:989:26: warning: unused parameter 'enc' [-Wunused-parameter]
1830:info:build          const ENCODING *enc)
1831:info:build                          ^
1832:info:build ./xmlrole.c:1075:22: warning: unused parameter 'ptr' [-Wunused-parameter]
1833:info:build          const char *ptr,
1834:info:build                      ^
1835:info:build ./xmlrole.c:1076:22: warning: unused parameter 'end' [-Wunused-parameter]
1836:info:build          const char *end,
1837:info:build                      ^
1838:info:build ./xmlrole.c:1077:26: warning: unused parameter 'enc' [-Wunused-parameter]
1839:info:build          const ENCODING *enc)
1840:info:build                          ^
1841:info:build ./xmlrole.c:1100:22: warning: unused parameter 'ptr' [-Wunused-parameter]
1842:info:build          const char *ptr,
1843:info:build                      ^
1844:info:build ./xmlrole.c:1101:22: warning: unused parameter 'end' [-Wunused-parameter]
1845:info:build          const char *end,
1846:info:build                      ^
1847:info:build ./xmlrole.c:1102:26: warning: unused parameter 'enc' [-Wunused-parameter]
1848:info:build          const ENCODING *enc)
1849:info:build                          ^
1850:info:build ./xmlrole.c:1118:22: warning: unused parameter 'ptr' [-Wunused-parameter]
1851:info:build          const char *ptr,
1852:info:build                      ^
1853:info:build ./xmlrole.c:1119:22: warning: unused parameter 'end' [-Wunused-parameter]
1854:info:build          const char *end,
1855:info:build                      ^
1856:info:build ./xmlrole.c:1120:26: warning: unused parameter 'enc' [-Wunused-parameter]
1857:info:build          const ENCODING *enc)
1858:info:build                          ^
1859:info:build ./xmlrole.c:1139:22: warning: unused parameter 'ptr' [-Wunused-parameter]
1860:info:build          const char *ptr,
1861:info:build                      ^
1862:info:build ./xmlrole.c:1140:22: warning: unused parameter 'end' [-Wunused-parameter]
1863:info:build          const char *end,
1864:info:build                      ^
1865:info:build ./xmlrole.c:1141:26: warning: unused parameter 'enc' [-Wunused-parameter]
1866:info:build          const ENCODING *enc)
1867:info:build                          ^
1868:info:build ./xmlrole.c:1169:22: warning: unused parameter 'ptr' [-Wunused-parameter]
1869:info:build          const char *ptr,
1870:info:build                      ^
1871:info:build ./xmlrole.c:1170:22: warning: unused parameter 'end' [-Wunused-parameter]
1872:info:build          const char *end,
1873:info:build                      ^
1874:info:build ./xmlrole.c:1171:26: warning: unused parameter 'enc' [-Wunused-parameter]
1875:info:build          const ENCODING *enc)
1876:info:build                          ^
1877:info:build ./xmlrole.c:1280:23: warning: unused parameter 'ptr' [-Wunused-parameter]
1878:info:build           const char *ptr,
1879:info:build                       ^
1880:info:build ./xmlrole.c:1281:23: warning: unused parameter 'end' [-Wunused-parameter]
1881:info:build           const char *end,
1882:info:build                       ^
1883:info:build ./xmlrole.c:1282:27: warning: unused parameter 'enc' [-Wunused-parameter]
1884:info:build           const ENCODING *enc)
1885:info:build                           ^
1886:info:build ./xmlrole.c:1295:21: warning: unused parameter 'state' [-Wunused-parameter]
1887:info:build error(PROLOG_STATE *state,
1888:info:build                     ^
1889:info:build ./xmlrole.c:1296:11: warning: unused parameter 'tok' [-Wunused-parameter]
1890:info:build       int tok,
1891:info:build           ^
1892:info:build ./xmlrole.c:1297:19: warning: unused parameter 'ptr' [-Wunused-parameter]
1893:info:build       const char *ptr,
1894:info:build                   ^
1895:info:build ./xmlrole.c:1298:19: warning: unused parameter 'end' [-Wunused-parameter]
1896:info:build       const char *end,
1897:info:build                   ^
1898:info:build ./xmlrole.c:1299:23: warning: unused parameter 'enc' [-Wunused-parameter]
1899:info:build       const ENCODING *enc)
1900:info:build                       ^
1901:info:build ./xmlrole.c:1305:33: warning: unused parameter 'tok' [-Wunused-parameter]
1902:info:build common(PROLOG_STATE *state, int tok)
1903:info:build                                 ^
1904:info:build 153 warnings generated.
1905:info:build /bin/sh ../../../libtool --mode=link /usr/bin/clang  -pipe -O2 -arch x86_64 -W -Wall -Wno-unused -Wno-multichar  -fno-builtin -finline-functions -Wreturn-type -Wchar-subscripts -Wparentheses  -L/opt/local/lib -arch x86_64 -L/usr/X11R6/lib -Wl,-framework,CoreFoundation -o libexpat.la   all-expat-c.lo 
1906:info:build ar cru .libs/libexpat.a .libs/all-expat-c.o
1907:info:build ranlib .libs/libexpat.a
1908:info:build creating libexpat.la
1909:info:build (cd .libs && rm -f libexpat.la && ln -s ../libexpat.la libexpat.la)
1910:info:build make[5]: Leaving directory `/opt/local/var/macports/build/_opt_local_var_macports_sources_rsync.macports.org_release_tarballs_ports_graphics_Coin/Coin/work/Coin-3.1.3/src/xml/expat'
1911:info:build make[5]: Entering directory `/opt/local/var/macports/build/_opt_local_var_macports_sources_rsync.macports.org_release_tarballs_ports_graphics_Coin/Coin/work/Coin-3.1.3/src/xml'
1912:info:build if /bin/sh ../../libtool --mode=compile /usr/bin/clang++ -DHAVE_CONFIG_H -I../../include -I../../include  -I../../src -I../../src   -I/opt/local/include -no-cpp-precomp -D_REENTRANT -DCOIN_DEBUG=1 -DCOIN_INTERNAL -I/usr/X11R6/include  -pipe -O2 -arch x86_64 -W -Wall -Wno-unused -Wno-multichar -Woverloaded-virtual  -fno-builtin -finline-functions -Wreturn-type -Wchar-subscripts -Wparentheses -MT document.lo -MD -MP -MF ".deps/document.Tpo" -c -o document.lo document.cpp; \
1913:info:build     then mv -f ".deps/document.Tpo" ".deps/document.Plo"; else rm -f ".deps/document.Tpo"; exit 1; fi
1914:info:build if /bin/sh ../../libtool --mode=compile /usr/bin/clang++ -DHAVE_CONFIG_H -I../../include -I../../include  -I../../src -I../../src   -I/opt/local/include -no-cpp-precomp -D_REENTRANT -DCOIN_DEBUG=1 -DCOIN_INTERNAL -I/usr/X11R6/include  -pipe -O2 -arch x86_64 -W -Wall -Wno-unused -Wno-multichar -Woverloaded-virtual  -fno-builtin -finline-functions -Wreturn-type -Wchar-subscripts -Wparentheses -MT element.lo -MD -MP -MF ".deps/element.Tpo" -c -o element.lo element.cpp; \
1915:info:build     then mv -f ".deps/element.Tpo" ".deps/element.Plo"; else rm -f ".deps/element.Tpo"; exit 1; fi
1916:info:build if /bin/sh ../../libtool --mode=compile /usr/bin/clang++ -DHAVE_CONFIG_H -I../../include -I../../include  -I../../src -I../../src   -I/opt/local/include -no-cpp-precomp -D_REENTRANT -DCOIN_DEBUG=1 -DCOIN_INTERNAL -I/usr/X11R6/include  -pipe -O2 -arch x86_64 -W -Wall -Wno-unused -Wno-multichar -Woverloaded-virtual  -fno-builtin -finline-functions -Wreturn-type -Wchar-subscripts -Wparentheses -MT attribute.lo -MD -MP -MF ".deps/attribute.Tpo" -c -o attribute.lo attribute.cpp; \
1917:info:build     then mv -f ".deps/attribute.Tpo" ".deps/attribute.Plo"; else rm -f ".deps/attribute.Tpo"; exit 1; fi
1918:info:build if /bin/sh ../../libtool --mode=compile /usr/bin/clang++ -DHAVE_CONFIG_H -I../../include -I../../include  -I../../src -I../../src   -I/opt/local/include -no-cpp-precomp -D_REENTRANT -DCOIN_DEBUG=1 -DCOIN_INTERNAL -I/usr/X11R6/include  -pipe -O2 -arch x86_64 -W -Wall -Wno-unused -Wno-multichar -Woverloaded-virtual  -fno-builtin -finline-functions -Wreturn-type -Wchar-subscripts -Wparentheses -MT entity.lo -MD -MP -MF ".deps/entity.Tpo" -c -o entity.lo entity.cpp; \
1919:info:build     then mv -f ".deps/entity.Tpo" ".deps/entity.Plo"; else rm -f ".deps/entity.Tpo"; exit 1; fi
1920:info:build if /bin/sh ../../libtool --mode=compile /usr/bin/clang++ -DHAVE_CONFIG_H -I../../include -I../../include  -I../../src -I../../src   -I/opt/local/include -no-cpp-precomp -D_REENTRANT -DCOIN_DEBUG=1 -DCOIN_INTERNAL -I/usr/X11R6/include  -pipe -O2 -arch x86_64 -W -Wall -Wno-unused -Wno-multichar -Woverloaded-virtual  -fno-builtin -finline-functions -Wreturn-type -Wchar-subscripts -Wparentheses -MT utils.lo -MD -MP -MF ".deps/utils.Tpo" -c -o utils.lo utils.cpp; \
1921:info:build     then mv -f ".deps/utils.Tpo" ".deps/utils.Plo"; else rm -f ".deps/utils.Tpo"; exit 1; fi
1922:info:build if /bin/sh ../../libtool --mode=compile /usr/bin/clang++ -DHAVE_CONFIG_H -I../../include -I../../include  -I../../src -I../../src   -I/opt/local/include -no-cpp-precomp -D_REENTRANT -DCOIN_DEBUG=1 -DCOIN_INTERNAL -I/usr/X11R6/include  -pipe -O2 -arch x86_64 -W -Wall -Wno-unused -Wno-multichar -Woverloaded-virtual  -fno-builtin -finline-functions -Wreturn-type -Wchar-subscripts -Wparentheses -MT path.lo -MD -MP -MF ".deps/path.Tpo" -c -o path.lo path.cpp; \
1923:info:build     then mv -f ".deps/path.Tpo" ".deps/path.Plo"; else rm -f ".deps/path.Tpo"; exit 1; fi
1924:info:build mkdir .libs
1925:info:build mkdir .libs
1926:info:build mkdir .libs
1927:info:build mkdir: .libs: File exists
1928:info:build mkdir .libs
1929:info:build mkdir: .libs: File exists
1930:info:build mkdir: .libs: File exists
1931:info:build  /usr/bin/clang++ -DHAVE_CONFIG_H -I../../include -I../../include -I../../src -I../../src -I/opt/local/include -no-cpp-precomp -D_REENTRANT -DCOIN_DEBUG=1 -DCOIN_INTERNAL -I/usr/X11R6/include -pipe -O2 -arch x86_64 -W -Wall -Wno-unused -Wno-multichar -Woverloaded-virtual -fno-builtin -finline-functions -Wreturn-type -Wchar-subscripts -Wparentheses -MT entity.lo -MD -MP -MF .deps/entity.Tpo -c entity.cpp  -fno-common -DPIC -o .libs/entity.o
1932:info:build  /usr/bin/clang++ -DHAVE_CONFIG_H -I../../include -I../../include -I../../src -I../../src -I/opt/local/include -no-cpp-precomp -D_REENTRANT -DCOIN_DEBUG=1 -DCOIN_INTERNAL -I/usr/X11R6/include -pipe -O2 -arch x86_64 -W -Wall -Wno-unused -Wno-multichar -Woverloaded-virtual -fno-builtin -finline-functions -Wreturn-type -Wchar-subscripts -Wparentheses -MT document.lo -MD -MP -MF .deps/document.Tpo -c document.cpp  -fno-common -DPIC -o .libs/document.o
1933:info:build  /usr/bin/clang++ -DHAVE_CONFIG_H -I../../include -I../../include -I../../src -I../../src -I/opt/local/include -no-cpp-precomp -D_REENTRANT -DCOIN_DEBUG=1 -DCOIN_INTERNAL -I/usr/X11R6/include -pipe -O2 -arch x86_64 -W -Wall -Wno-unused -Wno-multichar -Woverloaded-virtual -fno-builtin -finline-functions -Wreturn-type -Wchar-subscripts -Wparentheses -MT attribute.lo -MD -MP -MF .deps/attribute.Tpo -c attribute.cpp  -fno-common -DPIC -o .libs/attribute.o
1934:info:build  /usr/bin/clang++ -DHAVE_CONFIG_H -I../../include -I../../include -I../../src -I../../src -I/opt/local/include -no-cpp-precomp -D_REENTRANT -DCOIN_DEBUG=1 -DCOIN_INTERNAL -I/usr/X11R6/include -pipe -O2 -arch x86_64 -W -Wall -Wno-unused -Wno-multichar -Woverloaded-virtual -fno-builtin -finline-functions -Wreturn-type -Wchar-subscripts -Wparentheses -MT path.lo -MD -MP -MF .deps/path.Tpo -c path.cpp  -fno-common -DPIC -o .libs/path.o
1935:info:build  /usr/bin/clang++ -DHAVE_CONFIG_H -I../../include -I../../include -I../../src -I../../src -I/opt/local/include -no-cpp-precomp -D_REENTRANT -DCOIN_DEBUG=1 -DCOIN_INTERNAL -I/usr/X11R6/include -pipe -O2 -arch x86_64 -W -Wall -Wno-unused -Wno-multichar -Woverloaded-virtual -fno-builtin -finline-functions -Wreturn-type -Wchar-subscripts -Wparentheses -MT utils.lo -MD -MP -MF .deps/utils.Tpo -c utils.cpp  -fno-common -DPIC -o .libs/utils.o
1936:info:build  /usr/bin/clang++ -DHAVE_CONFIG_H -I../../include -I../../include -I../../src -I../../src -I/opt/local/include -no-cpp-precomp -D_REENTRANT -DCOIN_DEBUG=1 -DCOIN_INTERNAL -I/usr/X11R6/include -pipe -O2 -arch x86_64 -W -Wall -Wno-unused -Wno-multichar -Woverloaded-virtual -fno-builtin -finline-functions -Wreturn-type -Wchar-subscripts -Wparentheses -MT element.lo -MD -MP -MF .deps/element.Tpo -c element.cpp  -fno-common -DPIC -o .libs/element.o
1937:info:build document.cpp:289:59: warning: unused parameter 'userdata' [-Wunused-parameter]
1938:info:build cc_xml_doc_expat_processing_instruction_handler_cb(void * userdata, const XML_Char * target, const XML_Char * pidata)
1939:info:build                                                           ^
1940:info:build document.cpp:289:86: warning: unused parameter 'target' [-Wunused-parameter]
1941:info:build cc_xml_doc_expat_processing_instruction_handler_cb(void * userdata, const XML_Char * target, const XML_Char * pidata)
1942:info:build                                                                                      ^
1943:info:build document.cpp:289:111: warning: unused parameter 'pidata' [-Wunused-parameter]
1944:info:build cc_xml_doc_expat_processing_instruction_handler_cb(void * userdata, const XML_Char * target, const XML_Char * pidata)
1945:info:build                                                                                                               ^
1946:info:build element.cpp:616:24: warning: format specifies type 'long *' but the argument has type 'uint32_t *' (aka 'unsigned int *') [-Wformat]
1947:info:build   if ( sscanf(data, "%ld", value) == 1 ) return TRUE; // FIXME: unsigned
1948:info:build                      ~~^   ~~~~~
1949:info:build                      %d
1950:info:build element.cpp:635:24: warning: format specifies type 'long *' but the argument has type 'int32_t *' (aka 'int *') [-Wformat]
1951:info:build   if ( sscanf(data, "%ld", value) == 1 ) return TRUE;
1952:info:build                      ~~^   ~~~~~
1953:info:build                      %d
1954:info:build document.cpp:782:36: warning: unused parameter 'doc' [-Wunused-parameter]
1955:info:build cc_xml_doc_diff(const cc_xml_doc * doc, const cc_xml_doc * other)
1956:info:build                                    ^
1957:info:build document.cpp:782:60: warning: unused parameter 'other' [-Wunused-parameter]
1958:info:build cc_xml_doc_diff(const cc_xml_doc * doc, const cc_xml_doc * other)
1959:info:build                                                            ^
1960:info:build 5 warnings generated.
1961:info:build 2 warnings generated.
1962:info:build /bin/sh ../../libtool --mode=link /usr/bin/clang++  -pipe -O2 -arch x86_64 -W -Wall -Wno-unused -Wno-multichar -Woverloaded-virtual  -fno-builtin -finline-functions -Wreturn-type -Wchar-subscripts -Wparentheses  -L/opt/local/lib -arch x86_64 -L/usr/X11R6/lib -Wl,-framework,CoreFoundation -o libxml.la   document.lo element.lo attribute.lo entity.lo utils.lo path.lo 
1963:info:build ar cru .libs/libxml.a .libs/document.o .libs/element.o .libs/attribute.o .libs/entity.o .libs/utils.o .libs/path.o
1964:info:build ranlib .libs/libxml.a
1965:info:build creating libxml.la
1966:info:build (cd .libs && rm -f libxml.la && ln -s ../libxml.la libxml.la)
1967:info:build make[5]: Leaving directory `/opt/local/var/macports/build/_opt_local_var_macports_sources_rsync.macports.org_release_tarballs_ports_graphics_Coin/Coin/work/Coin-3.1.3/src/xml'
1968:info:build make[4]: Leaving directory `/opt/local/var/macports/build/_opt_local_var_macports_sources_rsync.macports.org_release_tarballs_ports_graphics_Coin/Coin/work/Coin-3.1.3/src/xml'
1969:info:build Making all in actions
1970:info:build make[4]: Entering directory `/opt/local/var/macports/build/_opt_local_var_macports_sources_rsync.macports.org_release_tarballs_ports_graphics_Coin/Coin/work/Coin-3.1.3/src/actions'
1971:info:build if /bin/sh ../../libtool --mode=compile /usr/bin/clang++ -DHAVE_CONFIG_H -I../../include -I../../include  -I../../src -I../../src   -I/opt/local/include -no-cpp-precomp -D_REENTRANT -DCOIN_DEBUG=1 -DCOIN_INTERNAL -I/usr/X11R6/include  -pipe -O2 -arch x86_64 -W -Wall -Wno-unused -Wno-multichar -Woverloaded-virtual  -fno-builtin -finline-functions -Wreturn-type -Wchar-subscripts -Wparentheses -MT SoAction.lo -MD -MP -MF ".deps/SoAction.Tpo" -c -o SoAction.lo SoAction.cpp; \
1972:info:build     then mv -f ".deps/SoAction.Tpo" ".deps/SoAction.Plo"; else rm -f ".deps/SoAction.Tpo"; exit 1; fi
1973:info:build if /bin/sh ../../libtool --mode=compile /usr/bin/clang++ -DHAVE_CONFIG_H -I../../include -I../../include  -I../../src -I../../src   -I/opt/local/include -no-cpp-precomp -D_REENTRANT -DCOIN_DEBUG=1 -DCOIN_INTERNAL -I/usr/X11R6/include  -pipe -O2 -arch x86_64 -W -Wall -Wno-unused -Wno-multichar -Woverloaded-virtual  -fno-builtin -finline-functions -Wreturn-type -Wchar-subscripts -Wparentheses -MT SoBoxHighlightRenderAction.lo -MD -MP -MF ".deps/SoBoxHighlightRenderAction.Tpo" -c -o SoBoxHighlightRenderAction.lo SoBoxHighlightRenderAction.cpp; \
1974:info:build     then mv -f ".deps/SoBoxHighlightRenderAction.Tpo" ".deps/SoBoxHighlightRenderAction.Plo"; else rm -f ".deps/SoBoxHighlightRenderAction.Tpo"; exit 1; fi
1975:info:build if /bin/sh ../../libtool --mode=compile /usr/bin/clang++ -DHAVE_CONFIG_H -I../../include -I../../include  -I../../src -I../../src   -I/opt/local/include -no-cpp-precomp -D_REENTRANT -DCOIN_DEBUG=1 -DCOIN_INTERNAL -I/usr/X11R6/include  -pipe -O2 -arch x86_64 -W -Wall -Wno-unused -Wno-multichar -Woverloaded-virtual  -fno-builtin -finline-functions -Wreturn-type -Wchar-subscripts -Wparentheses -MT SoCallbackAction.lo -MD -MP -MF ".deps/SoCallbackAction.Tpo" -c -o SoCallbackAction.lo SoCallbackAction.cpp; \
1976:info:build     then mv -f ".deps/SoCallbackAction.Tpo" ".deps/SoCallbackAction.Plo"; else rm -f ".deps/SoCallbackAction.Tpo"; exit 1; fi
1977:info:build if /bin/sh ../../libtool --mode=compile /usr/bin/clang++ -DHAVE_CONFIG_H -I../../include -I../../include  -I../../src -I../../src   -I/opt/local/include -no-cpp-precomp -D_REENTRANT -DCOIN_DEBUG=1 -DCOIN_INTERNAL -I/usr/X11R6/include  -pipe -O2 -arch x86_64 -W -Wall -Wno-unused -Wno-multichar -Woverloaded-virtual  -fno-builtin -finline-functions -Wreturn-type -Wchar-subscripts -Wparentheses -MT SoGLRenderAction.lo -MD -MP -MF ".deps/SoGLRenderAction.Tpo" -c -o SoGLRenderAction.lo SoGLRenderAction.cpp; \
1978:info:build     then mv -f ".deps/SoGLRenderAction.Tpo" ".deps/SoGLRenderAction.Plo"; else rm -f ".deps/SoGLRenderAction.Tpo"; exit 1; fi
1979:info:build if /bin/sh ../../libtool --mode=compile /usr/bin/clang++ -DHAVE_CONFIG_H -I../../include -I../../include  -I../../src -I../../src   -I/opt/local/include -no-cpp-precomp -D_REENTRANT -DCOIN_DEBUG=1 -DCOIN_INTERNAL -I/usr/X11R6/include  -pipe -O2 -arch x86_64 -W -Wall -Wno-unused -Wno-multichar -Woverloaded-virtual  -fno-builtin -finline-functions -Wreturn-type -Wchar-subscripts -Wparentheses -MT SoGetBoundingBoxAction.lo -MD -MP -MF ".deps/SoGetBoundingBoxAction.Tpo" -c -o SoGetBoundingBoxAction.lo SoGetBoundingBoxAction.cpp; \
1980:info:build     then mv -f ".deps/SoGetBoundingBoxAction.Tpo" ".deps/SoGetBoundingBoxAction.Plo"; else rm -f ".deps/SoGetBoundingBoxAction.Tpo"; exit 1; fi
1981:info:build if /bin/sh ../../libtool --mode=compile /usr/bin/clang++ -DHAVE_CONFIG_H -I../../include -I../../include  -I../../src -I../../src   -I/opt/local/include -no-cpp-precomp -D_REENTRANT -DCOIN_DEBUG=1 -DCOIN_INTERNAL -I/usr/X11R6/include  -pipe -O2 -arch x86_64 -W -Wall -Wno-unused -Wno-multichar -Woverloaded-virtual  -fno-builtin -finline-functions -Wreturn-type -Wchar-subscripts -Wparentheses -MT SoGetMatrixAction.lo -MD -MP -MF ".deps/SoGetMatrixAction.Tpo" -c -o SoGetMatrixAction.lo SoGetMatrixAction.cpp; \
1982:info:build     then mv -f ".deps/SoGetMatrixAction.Tpo" ".deps/SoGetMatrixAction.Plo"; else rm -f ".deps/SoGetMatrixAction.Tpo"; exit 1; fi
1983:info:build if /bin/sh ../../libtool --mode=compile /usr/bin/clang++ -DHAVE_CONFIG_H -I../../include -I../../include  -I../../src -I../../src   -I/opt/local/include -no-cpp-precomp -D_REENTRANT -DCOIN_DEBUG=1 -DCOIN_INTERNAL -I/usr/X11R6/include  -pipe -O2 -arch x86_64 -W -Wall -Wno-unused -Wno-multichar -Woverloaded-virtual  -fno-builtin -finline-functions -Wreturn-type -Wchar-subscripts -Wparentheses -MT SoGetPrimitiveCountAction.lo -MD -MP -MF ".deps/SoGetPrimitiveCountAction.Tpo" -c -o SoGetPrimitiveCountAction.lo SoGetPrimitiveCountAction.cpp; \
1984:info:build     then mv -f ".deps/SoGetPrimitiveCountAction.Tpo" ".deps/SoGetPrimitiveCountAction.Plo"; else rm -f ".deps/SoGetPrimitiveCountAction.Tpo"; exit 1; fi
1985:info:build if /bin/sh ../../libtool --mode=compile /usr/bin/clang++ -DHAVE_CONFIG_H -I../../include -I../../include  -I../../src -I../../src   -I/opt/local/include -no-cpp-precomp -D_REENTRANT -DCOIN_DEBUG=1 -DCOIN_INTERNAL -I/usr/X11R6/include  -pipe -O2 -arch x86_64 -W -Wall -Wno-unused -Wno-multichar -Woverloaded-virtual  -fno-builtin -finline-functions -Wreturn-type -Wchar-subscripts -Wparentheses -MT SoHandleEventAction.lo -MD -MP -MF ".deps/SoHandleEventAction.Tpo" -c -o SoHandleEventAction.lo SoHandleEventAction.cpp; \
1986:info:build     then mv -f ".deps/SoHandleEventAction.Tpo" ".deps/SoHandleEventAction.Plo"; else rm -f ".deps/SoHandleEventAction.Tpo"; exit 1; fi
1987:info:build if /bin/sh ../../libtool --mode=compile /usr/bin/clang++ -DHAVE_CONFIG_H -I../../include -I../../include  -I../../src -I../../src   -I/opt/local/include -no-cpp-precomp -D_REENTRANT -DCOIN_DEBUG=1 -DCOIN_INTERNAL -I/usr/X11R6/include  -pipe -O2 -arch x86_64 -W -Wall -Wno-unused -Wno-multichar -Woverloaded-virtual  -fno-builtin -finline-functions -Wreturn-type -Wchar-subscripts -Wparentheses -MT SoLineHighlightRenderAction.lo -MD -MP -MF ".deps/SoLineHighlightRenderAction.Tpo" -c -o SoLineHighlightRenderAction.lo SoLineHighlightRenderAction.cpp; \
1988:info:build     then mv -f ".deps/SoLineHighlightRenderAction.Tpo" ".deps/SoLineHighlightRenderAction.Plo"; else rm -f ".deps/SoLineHighlightRenderAction.Tpo"; exit 1; fi
1989:info:build if /bin/sh ../../libtool --mode=compile /usr/bin/clang++ -DHAVE_CONFIG_H -I../../include -I../../include  -I../../src -I../../src   -I/opt/local/include -no-cpp-precomp -D_REENTRANT -DCOIN_DEBUG=1 -DCOIN_INTERNAL -I/usr/X11R6/include  -pipe -O2 -arch x86_64 -W -Wall -Wno-unused -Wno-multichar -Woverloaded-virtual  -fno-builtin -finline-functions -Wreturn-type -Wchar-subscripts -Wparentheses -MT SoPickAction.lo -MD -MP -MF ".deps/SoPickAction.Tpo" -c -o SoPickAction.lo SoPickAction.cpp; \
1990:info:build     then mv -f ".deps/SoPickAction.Tpo" ".deps/SoPickAction.Plo"; else rm -f ".deps/SoPickAction.Tpo"; exit 1; fi
1991:info:build if /bin/sh ../../libtool --mode=compile /usr/bin/clang++ -DHAVE_CONFIG_H -I../../include -I../../include  -I../../src -I../../src   -I/opt/local/include -no-cpp-precomp -D_REENTRANT -DCOIN_DEBUG=1 -DCOIN_INTERNAL -I/usr/X11R6/include  -pipe -O2 -arch x86_64 -W -Wall -Wno-unused -Wno-multichar -Woverloaded-virtual  -fno-builtin -finline-functions -Wreturn-type -Wchar-subscripts -Wparentheses -MT SoRayPickAction.lo -MD -MP -MF ".deps/SoRayPickAction.Tpo" -c -o SoRayPickAction.lo SoRayPickAction.cpp; \
1992:info:build     then mv -f ".deps/SoRayPickAction.Tpo" ".deps/SoRayPickAction.Plo"; else rm -f ".deps/SoRayPickAction.Tpo"; exit 1; fi
1993:info:build if /bin/sh ../../libtool --mode=compile /usr/bin/clang++ -DHAVE_CONFIG_H -I../../include -I../../include  -I../../src -I../../src   -I/opt/local/include -no-cpp-precomp -D_REENTRANT -DCOIN_DEBUG=1 -DCOIN_INTERNAL -I/usr/X11R6/include  -pipe -O2 -arch x86_64 -W -Wall -Wno-unused -Wno-multichar -Woverloaded-virtual  -fno-builtin -finline-functions -Wreturn-type -Wchar-subscripts -Wparentheses -MT SoReorganizeAction.lo -MD -MP -MF ".deps/SoReorganizeAction.Tpo" -c -o SoReorganizeAction.lo SoReorganizeAction.cpp; \
1994:info:build     then mv -f ".deps/SoReorganizeAction.Tpo" ".deps/SoReorganizeAction.Plo"; else rm -f ".deps/SoReorganizeAction.Tpo"; exit 1; fi
1995:info:build if /bin/sh ../../libtool --mode=compile /usr/bin/clang++ -DHAVE_CONFIG_H -I../../include -I../../include  -I../../src -I../../src   -I/opt/local/include -no-cpp-precomp -D_REENTRANT -DCOIN_DEBUG=1 -DCOIN_INTERNAL -I/usr/X11R6/include  -pipe -O2 -arch x86_64 -W -Wall -Wno-unused -Wno-multichar -Woverloaded-virtual  -fno-builtin -finline-functions -Wreturn-type -Wchar-subscripts -Wparentheses -MT SoSearchAction.lo -MD -MP -MF ".deps/SoSearchAction.Tpo" -c -o SoSearchAction.lo SoSearchAction.cpp; \
1996:info:build     then mv -f ".deps/SoSearchAction.Tpo" ".deps/SoSearchAction.Plo"; else rm -f ".deps/SoSearchAction.Tpo"; exit 1; fi
1997:info:build if /bin/sh ../../libtool --mode=compile /usr/bin/clang++ -DHAVE_CONFIG_H -I../../include -I../../include  -I../../src -I../../src   -I/opt/local/include -no-cpp-precomp -D_REENTRANT -DCOIN_DEBUG=1 -DCOIN_INTERNAL -I/usr/X11R6/include  -pipe -O2 -arch x86_64 -W -Wall -Wno-unused -Wno-multichar -Woverloaded-virtual  -fno-builtin -finline-functions -Wreturn-type -Wchar-subscripts -Wparentheses -MT SoSimplifyAction.lo -MD -MP -MF ".deps/SoSimplifyAction.Tpo" -c -o SoSimplifyAction.lo SoSimplifyAction.cpp; \
1998:info:build     then mv -f ".deps/SoSimplifyAction.Tpo" ".deps/SoSimplifyAction.Plo"; else rm -f ".deps/SoSimplifyAction.Tpo"; exit 1; fi
1999:info:build if /bin/sh ../../libtool --mode=compile /usr/bin/clang++ -DHAVE_CONFIG_H -I../../include -I../../include  -I../../src -I../../src   -I/opt/local/include -no-cpp-precomp -D_REENTRANT -DCOIN_DEBUG=1 -DCOIN_INTERNAL -I/usr/X11R6/include  -pipe -O2 -arch x86_64 -W -Wall -Wno-unused -Wno-multichar -Woverloaded-virtual  -fno-builtin -finline-functions -Wreturn-type -Wchar-subscripts -Wparentheses -MT SoToVRMLAction.lo -MD -MP -MF ".deps/SoToVRMLAction.Tpo" -c -o SoToVRMLAction.lo SoToVRMLAction.cpp; \
2000:info:build     then mv -f ".deps/SoToVRMLAction.Tpo" ".deps/SoToVRMLAction.Plo"; else rm -f ".deps/SoToVRMLAction.Tpo"; exit 1; fi
2001:info:build if /bin/sh ../../libtool --mode=compile /usr/bin/clang++ -DHAVE_CONFIG_H -I../../include -I../../include  -I../../src -I../../src   -I/opt/local/include -no-cpp-precomp -D_REENTRANT -DCOIN_DEBUG=1 -DCOIN_INTERNAL -I/usr/X11R6/include  -pipe -O2 -arch x86_64 -W -Wall -Wno-unused -Wno-multichar -Woverloaded-virtual  -fno-builtin -finline-functions -Wreturn-type -Wchar-subscripts -Wparentheses -MT SoToVRML2Action.lo -MD -MP -MF ".deps/SoToVRML2Action.Tpo" -c -o SoToVRML2Action.lo SoToVRML2Action.cpp; \
2002:info:build     then mv -f ".deps/SoToVRML2Action.Tpo" ".deps/SoToVRML2Action.Plo"; else rm -f ".deps/SoToVRML2Action.Tpo"; exit 1; fi
2003:info:build if /bin/sh ../../libtool --mode=compile /usr/bin/clang++ -DHAVE_CONFIG_H -I../../include -I../../include  -I../../src -I../../src   -I/opt/local/include -no-cpp-precomp -D_REENTRANT -DCOIN_DEBUG=1 -DCOIN_INTERNAL -I/usr/X11R6/include  -pipe -O2 -arch x86_64 -W -Wall -Wno-unused -Wno-multichar -Woverloaded-virtual  -fno-builtin -finline-functions -Wreturn-type -Wchar-subscripts -Wparentheses -MT SoWriteAction.lo -MD -MP -MF ".deps/SoWriteAction.Tpo" -c -o SoWriteAction.lo SoWriteAction.cpp; \
2004:info:build     then mv -f ".deps/SoWriteAction.Tpo" ".deps/SoWriteAction.Plo"; else rm -f ".deps/SoWriteAction.Tpo"; exit 1; fi
2005:info:build if /bin/sh ../../libtool --mode=compile /usr/bin/clang++ -DHAVE_CONFIG_H -I../../include -I../../include  -I../../src -I../../src   -I/opt/local/include -no-cpp-precomp -D_REENTRANT -DCOIN_DEBUG=1 -DCOIN_INTERNAL -I/usr/X11R6/include  -pipe -O2 -arch x86_64 -W -Wall -Wno-unused -Wno-multichar -Woverloaded-virtual  -fno-builtin -finline-functions -Wreturn-type -Wchar-subscripts -Wparentheses -MT SoAudioRenderAction.lo -MD -MP -MF ".deps/SoAudioRenderAction.Tpo" -c -o SoAudioRenderAction.lo SoAudioRenderAction.cpp; \
2006:info:build     then mv -f ".deps/SoAudioRenderAction.Tpo" ".deps/SoAudioRenderAction.Plo"; else rm -f ".deps/SoAudioRenderAction.Tpo"; exit 1; fi
2007:info:build mkdir .libs
2008:info:build  /usr/bin/clang++ -DHAVE_CONFIG_H -I../../include -I../../include -I../../src -I../../src -I/opt/local/include -no-cpp-precomp -D_REENTRANT -DCOIN_DEBUG=1 -DCOIN_INTERNAL -I/usr/X11R6/include -pipe -O2 -arch x86_64 -W -Wall -Wno-unused -Wno-multichar -Woverloaded-virtual -fno-builtin -finline-functions -Wreturn-type -Wchar-subscripts -Wparentheses -MT SoPickAction.lo -MD -MP -MF .deps/SoPickAction.Tpo -c SoPickAction.cpp  -fno-common -DPIC -o .libs/SoPickAction.o
2009:info:build  /usr/bin/clang++ -DHAVE_CONFIG_H -I../../include -I../../include -I../../src -I../../src -I/opt/local/include -no-cpp-precomp -D_REENTRANT -DCOIN_DEBUG=1 -DCOIN_INTERNAL -I/usr/X11R6/include -pipe -O2 -arch x86_64 -W -Wall -Wno-unused -Wno-multichar -Woverloaded-virtual -fno-builtin -finline-functions -Wreturn-type -Wchar-subscripts -Wparentheses -MT SoGetBoundingBoxAction.lo -MD -MP -MF .deps/SoGetBoundingBoxAction.Tpo -c SoGetBoundingBoxAction.cpp  -fno-common -DPIC -o .libs/SoGetBoundingBoxAction.o
2010:info:build  /usr/bin/clang++ -DHAVE_CONFIG_H -I../../include -I../../include -I../../src -I../../src -I/opt/local/include -no-cpp-precomp -D_REENTRANT -DCOIN_DEBUG=1 -DCOIN_INTERNAL -I/usr/X11R6/include -pipe -O2 -arch x86_64 -W -Wall -Wno-unused -Wno-multichar -Woverloaded-virtual -fno-builtin -finline-functions -Wreturn-type -Wchar-subscripts -Wparentheses -MT SoRayPickAction.lo -MD -MP -MF .deps/SoRayPickAction.Tpo -c SoRayPickAction.cpp  -fno-common -DPIC -o .libs/SoRayPickAction.o
2011:info:build  /usr/bin/clang++ -DHAVE_CONFIG_H -I../../include -I../../include -I../../src -I../../src -I/opt/local/include -no-cpp-precomp -D_REENTRANT -DCOIN_DEBUG=1 -DCOIN_INTERNAL -I/usr/X11R6/include -pipe -O2 -arch x86_64 -W -Wall -Wno-unused -Wno-multichar -Woverloaded-virtual -fno-builtin -finline-functions -Wreturn-type -Wchar-subscripts -Wparentheses -MT SoGLRenderAction.lo -MD -MP -MF .deps/SoGLRenderAction.Tpo -c SoGLRenderAction.cpp  -fno-common -DPIC -o .libs/SoGLRenderAction.o
2012:info:build  /usr/bin/clang++ -DHAVE_CONFIG_H -I../../include -I../../include -I../../src -I../../src -I/opt/local/include -no-cpp-precomp -D_REENTRANT -DCOIN_DEBUG=1 -DCOIN_INTERNAL -I/usr/X11R6/include -pipe -O2 -arch x86_64 -W -Wall -Wno-unused -Wno-multichar -Woverloaded-virtual -fno-builtin -finline-functions -Wreturn-type -Wchar-subscripts -Wparentheses -MT SoBoxHighlightRenderAction.lo -MD -MP -MF .deps/SoBoxHighlightRenderAction.Tpo -c SoBoxHighlightRenderAction.cpp  -fno-common -DPIC -o .libs/SoBoxHighlightRenderAction.o
2013:info:build  /usr/bin/clang++ -DHAVE_CONFIG_H -I../../include -I../../include -I../../src -I../../src -I/opt/local/include -no-cpp-precomp -D_REENTRANT -DCOIN_DEBUG=1 -DCOIN_INTERNAL -I/usr/X11R6/include -pipe -O2 -arch x86_64 -W -Wall -Wno-unused -Wno-multichar -Woverloaded-virtual -fno-builtin -finline-functions -Wreturn-type -Wchar-subscripts -Wparentheses -MT SoGetMatrixAction.lo -MD -MP -MF .deps/SoGetMatrixAction.Tpo -c SoGetMatrixAction.cpp  -fno-common -DPIC -o .libs/SoGetMatrixAction.o
2014:info:build  /usr/bin/clang++ -DHAVE_CONFIG_H -I../../include -I../../include -I../../src -I../../src -I/opt/local/include -no-cpp-precomp -D_REENTRANT -DCOIN_DEBUG=1 -DCOIN_INTERNAL -I/usr/X11R6/include -pipe -O2 -arch x86_64 -W -Wall -Wno-unused -Wno-multichar -Woverloaded-virtual -fno-builtin -finline-functions -Wreturn-type -Wchar-subscripts -Wparentheses -MT SoAction.lo -MD -MP -MF .deps/SoAction.Tpo -c SoAction.cpp  -fno-common -DPIC -o .libs/SoAction.o
2015:info:build  /usr/bin/clang++ -DHAVE_CONFIG_H -I../../include -I../../include -I../../src -I../../src -I/opt/local/include -no-cpp-precomp -D_REENTRANT -DCOIN_DEBUG=1 -DCOIN_INTERNAL -I/usr/X11R6/include -pipe -O2 -arch x86_64 -W -Wall -Wno-unused -Wno-multichar -Woverloaded-virtual -fno-builtin -finline-functions -Wreturn-type -Wchar-subscripts -Wparentheses -MT SoSearchAction.lo -MD -MP -MF .deps/SoSearchAction.Tpo -c SoSearchAction.cpp  -fno-common -DPIC -o .libs/SoSearchAction.o
2016:info:build  /usr/bin/clang++ -DHAVE_CONFIG_H -I../../include -I../../include -I../../src -I../../src -I/opt/local/include -no-cpp-precomp -D_REENTRANT -DCOIN_DEBUG=1 -DCOIN_INTERNAL -I/usr/X11R6/include -pipe -O2 -arch x86_64 -W -Wall -Wno-unused -Wno-multichar -Woverloaded-virtual -fno-builtin -finline-functions -Wreturn-type -Wchar-subscripts -Wparentheses -MT SoAudioRenderAction.lo -MD -MP -MF .deps/SoAudioRenderAction.Tpo -c SoAudioRenderAction.cpp  -fno-common -DPIC -o .libs/SoAudioRenderAction.o
2017:info:build  /usr/bin/clang++ -DHAVE_CONFIG_H -I../../include -I../../include -I../../src -I../../src -I/opt/local/include -no-cpp-precomp -D_REENTRANT -DCOIN_DEBUG=1 -DCOIN_INTERNAL -I/usr/X11R6/include -pipe -O2 -arch x86_64 -W -Wall -Wno-unused -Wno-multichar -Woverloaded-virtual -fno-builtin -finline-functions -Wreturn-type -Wchar-subscripts -Wparentheses -MT SoGetPrimitiveCountAction.lo -MD -MP -MF .deps/SoGetPrimitiveCountAction.Tpo -c SoGetPrimitiveCountAction.cpp  -fno-common -DPIC -o .libs/SoGetPrimitiveCountAction.o
2018:info:build  /usr/bin/clang++ -DHAVE_CONFIG_H -I../../include -I../../include -I../../src -I../../src -I/opt/local/include -no-cpp-precomp -D_REENTRANT -DCOIN_DEBUG=1 -DCOIN_INTERNAL -I/usr/X11R6/include -pipe -O2 -arch x86_64 -W -Wall -Wno-unused -Wno-multichar -Woverloaded-virtual -fno-builtin -finline-functions -Wreturn-type -Wchar-subscripts -Wparentheses -MT SoLineHighlightRenderAction.lo -MD -MP -MF .deps/SoLineHighlightRenderAction.Tpo -c SoLineHighlightRenderAction.cpp  -fno-common -DPIC -o .libs/SoLineHighlightRenderAction.o
2019:info:build  /usr/bin/clang++ -DHAVE_CONFIG_H -I../../include -I../../include -I../../src -I../../src -I/opt/local/include -no-cpp-precomp -D_REENTRANT -DCOIN_DEBUG=1 -DCOIN_INTERNAL -I/usr/X11R6/include -pipe -O2 -arch x86_64 -W -Wall -Wno-unused -Wno-multichar -Woverloaded-virtual -fno-builtin -finline-functions -Wreturn-type -Wchar-subscripts -Wparentheses -MT SoCallbackAction.lo -MD -MP -MF .deps/SoCallbackAction.Tpo -c SoCallbackAction.cpp  -fno-common -DPIC -o .libs/SoCallbackAction.o
2020:info:build  /usr/bin/clang++ -DHAVE_CONFIG_H -I../../include -I../../include -I../../src -I../../src -I/opt/local/include -no-cpp-precomp -D_REENTRANT -DCOIN_DEBUG=1 -DCOIN_INTERNAL -I/usr/X11R6/include -pipe -O2 -arch x86_64 -W -Wall -Wno-unused -Wno-multichar -Woverloaded-virtual -fno-builtin -finline-functions -Wreturn-type -Wchar-subscripts -Wparentheses -MT SoToVRML2Action.lo -MD -MP -MF .deps/SoToVRML2Action.Tpo -c SoToVRML2Action.cpp  -fno-common -DPIC -o .libs/SoToVRML2Action.o
2021:info:build  /usr/bin/clang++ -DHAVE_CONFIG_H -I../../include -I../../include -I../../src -I../../src -I/opt/local/include -no-cpp-precomp -D_REENTRANT -DCOIN_DEBUG=1 -DCOIN_INTERNAL -I/usr/X11R6/include -pipe -O2 -arch x86_64 -W -Wall -Wno-unused -Wno-multichar -Woverloaded-virtual -fno-builtin -finline-functions -Wreturn-type -Wchar-subscripts -Wparentheses -MT SoHandleEventAction.lo -MD -MP -MF .deps/SoHandleEventAction.Tpo -c SoHandleEventAction.cpp  -fno-common -DPIC -o .libs/SoHandleEventAction.o
2022:info:build  /usr/bin/clang++ -DHAVE_CONFIG_H -I../../include -I../../include -I../../src -I../../src -I/opt/local/include -no-cpp-precomp -D_REENTRANT -DCOIN_DEBUG=1 -DCOIN_INTERNAL -I/usr/X11R6/include -pipe -O2 -arch x86_64 -W -Wall -Wno-unused -Wno-multichar -Woverloaded-virtual -fno-builtin -finline-functions -Wreturn-type -Wchar-subscripts -Wparentheses -MT SoWriteAction.lo -MD -MP -MF .deps/SoWriteAction.Tpo -c SoWriteAction.cpp  -fno-common -DPIC -o .libs/SoWriteAction.o
2023:info:build  /usr/bin/clang++ -DHAVE_CONFIG_H -I../../include -I../../include -I../../src -I../../src -I/opt/local/include -no-cpp-precomp -D_REENTRANT -DCOIN_DEBUG=1 -DCOIN_INTERNAL -I/usr/X11R6/include -pipe -O2 -arch x86_64 -W -Wall -Wno-unused -Wno-multichar -Woverloaded-virtual -fno-builtin -finline-functions -Wreturn-type -Wchar-subscripts -Wparentheses -MT SoReorganizeAction.lo -MD -MP -MF .deps/SoReorganizeAction.Tpo -c SoReorganizeAction.cpp  -fno-common -DPIC -o .libs/SoReorganizeAction.o
2024:info:build  /usr/bin/clang++ -DHAVE_CONFIG_H -I../../include -I../../include -I../../src -I../../src -I/opt/local/include -no-cpp-precomp -D_REENTRANT -DCOIN_DEBUG=1 -DCOIN_INTERNAL -I/usr/X11R6/include -pipe -O2 -arch x86_64 -W -Wall -Wno-unused -Wno-multichar -Woverloaded-virtual -fno-builtin -finline-functions -Wreturn-type -Wchar-subscripts -Wparentheses -MT SoSimplifyAction.lo -MD -MP -MF .deps/SoSimplifyAction.Tpo -c SoSimplifyAction.cpp  -fno-common -DPIC -o .libs/SoSimplifyAction.o
2025:info:build  /usr/bin/clang++ -DHAVE_CONFIG_H -I../../include -I../../include -I../../src -I../../src -I/opt/local/include -no-cpp-precomp -D_REENTRANT -DCOIN_DEBUG=1 -DCOIN_INTERNAL -I/usr/X11R6/include -pipe -O2 -arch x86_64 -W -Wall -Wno-unused -Wno-multichar -Woverloaded-virtual -fno-builtin -finline-functions -Wreturn-type -Wchar-subscripts -Wparentheses -MT SoToVRMLAction.lo -MD -MP -MF .deps/SoToVRMLAction.Tpo -c SoToVRMLAction.cpp  -fno-common -DPIC -o .libs/SoToVRMLAction.o
2026:info:build In file included from SoPickAction.cpp:47:
2027:info:build In file included from ../../include/Inventor/actions/SoPickAction.h:27:
2028:info:build In file included from ../../include/Inventor/actions/SoAction.h:27:
2029:info:build ../../include/Inventor/SbBasic.h:99:5: error: call to function 'cc_debugerror_post' that is neither visible in the template definition nor found by argument-dependent lookup
2030:info:build     cc_debugerror_post(funcname, "divide by zero error.", divider);
2031:info:build     ^
2032:info:build ../../include/Inventor/SbVec2s.h:71:35: note: in instantiation of function template specialization 'SbDividerChk<int>' requested here
2033:info:build   SbVec2s & operator /= (int d) { SbDividerChk("SbVec2s::operator/=(int)", d); vec[0] /= d; vec[1] /= d; return *this; }
2034:info:build                                   ^
2035:info:build ../../include/Inventor/C/errors/debugerror.h:59:19: note: 'cc_debugerror_post' should be declared prior to the call site
2036:info:build COIN_DLL_API void cc_debugerror_post(const char * source, const char * format, ...);
2037:info:build                   ^
2038:info:build In file included from SoPickAction.cpp:47:
2039:info:build In file included from ../../include/Inventor/actions/SoPickAction.h:27:
2040:info:build In file included from ../../include/Inventor/actions/SoAction.h:27:
2041:info:build ../../include/Inventor/SbBasic.h:99:5: error: call to function 'cc_debugerror_post' that is neither visible in the template definition nor found by argument-dependent lookup
2042:info:build     cc_debugerror_post(funcname, "divide by zero error.", divider);
2043:info:build     ^
2044:info:build ../../include/Inventor/SbVec2s.h:72:38: note: in instantiation of function template specialization 'SbDividerChk<double>' requested here
2045:info:build   SbVec2s & operator /= (double d) { SbDividerChk("SbVec2s::operator/=(double)", d); return operator *= (1.0 / d); }
2046:info:build                                      ^
2047:info:build ../../include/Inventor/C/errors/debugerror.h:59:19: note: 'cc_debugerror_post' should be declared prior to the call site
2048:info:build COIN_DLL_API void cc_debugerror_post(const char * source, const char * format, ...);
2049:info:build                   ^
2050:info:build In file included from SoPickAction.cpp:47:
2051:info:build In file included from ../../include/Inventor/actions/SoPickAction.h:27:
2052:info:build In file included from ../../include/Inventor/actions/SoAction.h:27:
2053:info:build ../../include/Inventor/SbBasic.h:99:5: error: call to function 'cc_debugerror_post' that is neither visible in the template definition nor found by argument-dependent lookup
2054:info:build     cc_debugerror_post(funcname, "divide by zero error.", divider);
2055:info:build     ^
2056:info:build ../../include/Inventor/SbVec2f.h:70:37: note: in instantiation of function template specialization 'SbDividerChk<float>' requested here
2057:info:build   SbVec2f & operator /= (float d) { SbDividerChk("SbVec2f::operator/=(float)", d); return operator *= (1.0f / d); }
2058:info:build                                     ^
2059:info:build ../../include/Inventor/C/errors/debugerror.h:59:19: note: 'cc_debugerror_post' should be declared prior to the call site
2060:info:build COIN_DLL_API void cc_debugerror_post(const char * source, const char * format, ...);
2061:info:build                   ^
2062:info:build 3 errors generated.
2063:info:build make[4]: *** [SoPickAction.lo] Error 1
2064:info:build make[4]: *** Waiting for unfinished jobs....
2065:info:build In file included from SoGetBoundingBoxAction.cpp:72:
2066:info:build In file included from ../../include/Inventor/actions/SoGetBoundingBoxAction.h:27:
2067:info:build In file included from ../../include/Inventor/actions/SoAction.h:27:
2068:info:build ../../include/Inventor/SbBasic.h:99:5: error: call to function 'cc_debugerror_post' that is neither visible in the template definition nor found by argument-dependent lookup
2069:info:build     cc_debugerror_post(funcname, "divide by zero error.", divider);
2070:info:build     ^
2071:info:build ../../include/Inventor/SbVec2s.h:71:35: note: in instantiation of function template specialization 'SbDividerChk<int>' requested here
2072:info:build   SbVec2s & operator /= (int d) { SbDividerChk("SbVec2s::operator/=(int)", d); vec[0] /= d; vec[1] /= d; return *this; }
2073:info:build                                   ^
2074:info:build ../../include/Inventor/C/errors/debugerror.h:59:19: note: 'cc_debugerror_post' should be declared prior to the call site
2075:info:build COIN_DLL_API void cc_debugerror_post(const char * source, const char * format, ...);
2076:info:build                   ^
2077:info:build In file included from SoGetBoundingBoxAction.cpp:72:
2078:info:build In file included from ../../include/Inventor/actions/SoGetBoundingBoxAction.h:27:
2079:info:build In file included from ../../include/Inventor/actions/SoAction.h:27:
2080:info:build ../../include/Inventor/SbBasic.h:99:5: error: call to function 'cc_debugerror_post' that is neither visible in the template definition nor found by argument-dependent lookup
2081:info:build     cc_debugerror_post(funcname, "divide by zero error.", divider);
2082:info:build     ^
2083:info:build ../../include/Inventor/SbVec2s.h:72:38: note: in instantiation of function template specialization 'SbDividerChk<double>' requested here
2084:info:build   SbVec2s & operator /= (double d) { SbDividerChk("SbVec2s::operator/=(double)", d); return operator *= (1.0 / d); }
2085:info:build                                      ^
2086:info:build ../../include/Inventor/C/errors/debugerror.h:59:19: note: 'cc_debugerror_post' should be declared prior to the call site
2087:info:build COIN_DLL_API void cc_debugerror_post(const char * source, const char * format, ...);
2088:info:build                   ^
2089:info:build In file included from SoGetBoundingBoxAction.cpp:72:
2090:info:build In file included from ../../include/Inventor/actions/SoGetBoundingBoxAction.h:27:
2091:info:build In file included from ../../include/Inventor/actions/SoAction.h:27:
2092:info:build ../../include/Inventor/SbBasic.h:99:5: error: call to function 'cc_debugerror_post' that is neither visible in the template definition nor found by argument-dependent lookup
2093:info:build     cc_debugerror_post(funcname, "divide by zero error.", divider);
2094:info:build     ^
2095:info:build ../../include/Inventor/SbVec2f.h:70:37: note: in instantiation of function template specialization 'SbDividerChk<float>' requested here
2096:info:build   SbVec2f & operator /= (float d) { SbDividerChk("SbVec2f::operator/=(float)", d); return operator *= (1.0f / d); }
2097:info:build                                     ^
2098:info:build ../../include/Inventor/C/errors/debugerror.h:59:19: note: 'cc_debugerror_post' should be declared prior to the call site
2099:info:build COIN_DLL_API void cc_debugerror_post(const char * source, const char * format, ...);
2100:info:build                   ^
2101:info:build 3 errors generated.
2102:info:build In file included from SoGetMatrixAction.cpp:82:
2103:info:build In file included from ../../include/Inventor/actions/SoGetMatrixAction.h:27:
2104:info:build In file included from ../../include/Inventor/actions/SoAction.h:27:
2105:info:build ../../include/Inventor/SbBasic.h:99:5: error: call to function 'cc_debugerror_post' that is neither visible in the template definition nor found by argument-dependent lookup
2106:info:build     cc_debugerror_post(funcname, "divide by zero error.", divider);
2107:info:build     ^
2108:info:build ../../include/Inventor/SbVec2s.h:71:35: note: in instantiation of function template specialization 'SbDividerChk<int>' requested here
2109:info:build   SbVec2s & operator /= (int d) { SbDividerChk("SbVec2s::operator/=(int)", d); vec[0] /= d; vec[1] /= d; return *this; }
2110:info:build                                   ^
2111:info:build ../../include/Inventor/C/errors/debugerror.h:59:19: note: 'cc_debugerror_post' should be declared prior to the call site
2112:info:build COIN_DLL_API void cc_debugerror_post(const char * source, const char * format, ...);
2113:info:build                   ^
2114:info:build In file included from SoGetMatrixAction.cpp:82:
2115:info:build In file included from ../../include/Inventor/actions/SoGetMatrixAction.h:27:
2116:info:build In file included from ../../include/Inventor/actions/SoAction.h:27:
2117:info:build ../../include/Inventor/SbBasic.h:99:5: error: call to function 'cc_debugerror_post' that is neither visible in the template definition nor found by argument-dependent lookup
2118:info:build     cc_debugerror_post(funcname, "divide by zero error.", divider);
2119:info:build     ^
2120:info:build ../../include/Inventor/SbVec2s.h:72:38: note: in instantiation of function template specialization 'SbDividerChk<double>' requested here
2121:info:build   SbVec2s & operator /= (double d) { SbDividerChk("SbVec2s::operator/=(double)", d); return operator *= (1.0 / d); }
2122:info:build                                      ^
2123:info:build ../../include/Inventor/C/errors/debugerror.h:59:19: note: 'cc_debugerror_post' should be declared prior to the call site
2124:info:build COIN_DLL_API void cc_debugerror_post(const char * source, const char * format, ...);
2125:info:build                   ^
2126:info:build In file included from SoGetMatrixAction.cpp:82:
2127:info:build In file included from ../../include/Inventor/actions/SoGetMatrixAction.h:27:
2128:info:build In file included from ../../include/Inventor/actions/SoAction.h:27:
2129:info:build ../../include/Inventor/SbBasic.h:99:5: error: call to function 'cc_debugerror_post' that is neither visible in the template definition nor found by argument-dependent lookup
2130:info:build     cc_debugerror_post(funcname, "divide by zero error.", divider);
2131:info:build     ^
2132:info:build ../../include/Inventor/SbVec2f.h:70:37: note: in instantiation of function template specialization 'SbDividerChk<float>' requested here
2133:info:build   SbVec2f & operator /= (float d) { SbDividerChk("SbVec2f::operator/=(float)", d); return operator *= (1.0f / d); }
2134:info:build                                     ^
2135:info:build ../../include/Inventor/C/errors/debugerror.h:59:19: note: 'cc_debugerror_post' should be declared prior to the call site
2136:info:build COIN_DLL_API void cc_debugerror_post(const char * source, const char * format, ...);
2137:info:build                   ^
2138:info:build 3 errors generated.
2139:info:build make[4]: *** [SoGetBoundingBoxAction.lo] Error 1
2140:info:build make[4]: *** [SoGetMatrixAction.lo] Error 1
2141:info:build In file included from SoAudioRenderAction.cpp:35:
2142:info:build In file included from ../../include/Inventor/actions/SoAudioRenderAction.h:27:
2143:info:build In file included from ../../include/Inventor/actions/SoAction.h:27:
2144:info:build ../../include/Inventor/SbBasic.h:99:5: error: call to function 'cc_debugerror_post' that is neither visible in the template definition nor found by argument-dependent lookup
2145:info:build     cc_debugerror_post(funcname, "divide by zero error.", divider);
2146:info:build     ^
2147:info:build ../../include/Inventor/SbVec3f.h:78:37: note: in instantiation of function template specialization 'SbDividerChk<float>' requested here
2148:info:build   SbVec3f & operator /= (float d) { SbDividerChk("SbVec3f::operator/=(float)", d); return operator *= (1.0f / d); }
2149:info:build                                     ^
2150:info:build ../../include/Inventor/C/errors/debugerror.h:59:19: note: 'cc_debugerror_post' should be declared prior to the call site
2151:info:build COIN_DLL_API void cc_debugerror_post(const char * source, const char * format, ...);
2152:info:build                   ^
2153:info:build In file included from SoAudioRenderAction.cpp:35:
2154:info:build In file included from ../../include/Inventor/actions/SoAudioRenderAction.h:27:
2155:info:build In file included from ../../include/Inventor/actions/SoAction.h:27:
2156:info:build ../../include/Inventor/SbBasic.h:99:5: error: call to function 'cc_debugerror_post' that is neither visible in the template definition nor found by argument-dependent lookup
2157:info:build     cc_debugerror_post(funcname, "divide by zero error.", divider);
2158:info:build     ^
2159:info:build ../../include/Inventor/SbVec3d.h:77:38: note: in instantiation of function template specialization 'SbDividerChk<double>' requested here
2160:info:build   SbVec3d & operator /= (double d) { SbDividerChk("SbVec3d::operator/=(double)", d); return operator *= (1.0 / d); }
2161:info:build                                      ^
2162:info:build ../../include/Inventor/C/errors/debugerror.h:59:19: note: 'cc_debugerror_post' should be declared prior to the call site
2163:info:build COIN_DLL_API void cc_debugerror_post(const char * source, const char * format, ...);
2164:info:build                   ^
2165:info:build 2 errors generated.
2166:info:build make[4]: *** [SoAudioRenderAction.lo] Error 1
2167:info:build In file included from SoLineHighlightRenderAction.cpp:47:
2168:info:build In file included from ../../include/Inventor/actions/SoLineHighlightRenderAction.h:27:
2169:info:build In file included from ../../include/Inventor/actions/SoGLRenderAction.h:27:
2170:info:build In file included from ../../include/Inventor/actions/SoAction.h:27:
2171:info:build ../../include/Inventor/SbBasic.h:99:5: error: call to function 'cc_debugerror_post' that is neither visible in the template definition nor found by argument-dependent lookup
2172:info:build     cc_debugerror_post(funcname, "divide by zero error.", divider);
2173:info:build     ^
2174:info:build ../../include/Inventor/SbVec2s.h:71:35: note: in instantiation of function template specialization 'SbDividerChk<int>' requested here
2175:info:build   SbVec2s & operator /= (int d) { SbDividerChk("SbVec2s::operator/=(int)", d); vec[0] /= d; vec[1] /= d; return *this; }
2176:info:build                                   ^
2177:info:build ../../include/Inventor/C/errors/debugerror.h:59:19: note: 'cc_debugerror_post' should be declared prior to the call site
2178:info:build COIN_DLL_API void cc_debugerror_post(const char * source, const char * format, ...);
2179:info:build                   ^
2180:info:build In file included from SoLineHighlightRenderAction.cpp:47:
2181:info:build In file included from ../../include/Inventor/actions/SoLineHighlightRenderAction.h:27:
2182:info:build In file included from ../../include/Inventor/actions/SoGLRenderAction.h:27:
2183:info:build In file included from ../../include/Inventor/actions/SoAction.h:27:
2184:info:build ../../include/Inventor/SbBasic.h:99:5: error: call to function 'cc_debugerror_post' that is neither visible in the template definition nor found by argument-dependent lookup
2185:info:build     cc_debugerror_post(funcname, "divide by zero error.", divider);
2186:info:build     ^
2187:info:build ../../include/Inventor/SbVec2s.h:72:38: note: in instantiation of function template specialization 'SbDividerChk<double>' requested here
2188:info:build In file included from SoHandleEventAction.cpp:40:
2189:info:build   SbVec2s & operator /= (double d) { SbDividerChk("SbVec2s::operator/=(double)", d); return operator *= (1.0 / d); }
2190:info:build                                      ^
2191:info:build In file included from ../../include/Inventor/actions/SoHandleEventAction.h:27:
2192:info:build In file included from ../../include/Inventor/actions/SoAction.h../../include/Inventor/C/errors/debugerror.h:59:27:
2193:info:build :19: ../../include/Inventor/SbBasic.hnote: :'cc_debugerror_post' should be declared prior to the call site99
2194:info:build :5: COIN_DLL_API void cc_debugerror_post(const char * source, const char * format, ...);
2195:info:build                   ^
2196:info:build error: call to function 'cc_debugerror_post' that is neither visible in the template definition nor found by argument-dependent lookup
2197:info:build     cc_debugerror_post(funcname, "divide by zero error.", divider);
2198:info:build     ^
2199:info:build In file included from SoLineHighlightRenderAction.cpp:47:
2200:info:build In file included from ../../include/Inventor/actions/SoLineHighlightRenderAction.h../../include/Inventor/SbVec2s.h:71:35::27 :
2201:info:build note: In file included from in instantiation of function template specialization 'SbDividerChk<int>' requested here../../include/Inventor/actions/SoGLRenderAction.h
2202:info:build :27:
2203:info:build In file included from ../../include/Inventor/actions/SoAction.h:27:
2204:info:build   SbVec2s & operator /= (int d) { SbDividerChk("SbVec2s::operator/=(int)", d); vec[0] /= d; vec[1] /= d; return *this; }../../include/Inventor/SbBasic.h
2205:info:build :                                  ^99
2206:info:build :5: error: call to function 'cc_debugerror_post' that is neither visible in the template definition nor found by argument-dependent lookup
2207:info:build     cc_debugerror_post(funcname, "divide by zero error.", divider);
2208:info:build     ^
2209:info:build ../../include/Inventor/C/errors/debugerror.h:59:19: note: 'cc_debugerror_post' should be declared prior to the call site
2210:info:build COIN_DLL_API void cc_debugerror_post(const char * source, const char * format, ...);
2211:info:build ../../include/Inventor/SbVec2f.h                  ^:
2212:info:build 70:37: note: in instantiation of function template specialization 'SbDividerChk<float>' requested here
2213:info:build   SbVec2f & operator /= (float d) { SbDividerChk("SbVec2f::operator/=(float)", d); return operator *= (1.0f / d); }
2214:info:build                                     ^
2215:info:build ../../include/Inventor/C/errors/debugerror.h:59:19: note: 'cc_debugerror_post' should be declared prior to the call site
2216:info:build COIN_DLL_API void cc_debugerror_post(const char * source, const char * format, ...);
2217:info:build                   ^
2218:info:build In file included from SoHandleEventAction.cpp:40:
2219:info:build In file included from ../../include/Inventor/actions/SoHandleEventAction.h:27:
2220:info:build In file included from ../../include/Inventor/actions/SoAction.h:27:
2221:info:build ../../include/Inventor/SbBasic.h:99:5: error: call to function 'cc_debugerror_post' that is neither visible in the template definition nor found by argument-dependent lookup
2222:info:build     cc_debugerror_post(funcname, "divide by zero error.", divider);
2223:info:build     ^
2224:info:build ../../include/Inventor/SbVec2s.h:72:38: note: in instantiation of function template specialization 'SbDividerChk<double>' requested here
2225:info:build   SbVec2s & operator /= (double d) { SbDividerChk("SbVec2s::operator/=(double)", d); return operator *= (1.0 / d); }
2226:info:build                                      ^
2227:info:build ../../include/Inventor/C/errors/debugerror.h:59:19: note: 'cc_debugerror_post' should be declared prior to the call site
2228:info:build COIN_DLL_API void cc_debugerror_post(const char * source, const char * format, ...);
2229:info:build                   ^
2230:info:build In file included from SoHandleEventAction.cpp:40:
2231:info:build In file included from ../../include/Inventor/actions/SoHandleEventAction.h:27:
2232:info:build In file included from ../../include/Inventor/actions/SoAction.h:27:
2233:info:build ../../include/Inventor/SbBasic.h:99:5: error: call to function 'cc_debugerror_post' that is neither visible in the template definition nor found by argument-dependent lookup
2234:info:build     cc_debugerror_post(funcname, "divide by zero error.", divider);
2235:info:build     ^
2236:info:build ../../include/Inventor/SbVec2f.h:70:37: note: in instantiation of function template specialization 'SbDividerChk<float>' requested here
2237:info:build   SbVec2f & operator /= (float d) { SbDividerChk("SbVec2f::operator/=(float)", d); return operator *= (1.0f / d); }
2238:info:build                                     ^
2239:info:build ../../include/Inventor/C/errors/debugerror.h:59:19: note: 'cc_debugerror_post' should be declared prior to the call site
2240:info:build COIN_DLL_API void cc_debugerror_post(const char * source, const char * format, ...);
2241:info:build                   ^
2242:info:build In file included from SoRayPickAction.cpp:121:
2243:info:build In file included from ../../include/Inventor/actions/SoRayPickAction.h:27:
2244:info:build In file included from ../../include/Inventor/actions/SoPickAction.h:27:
2245:info:build In file included from ../../include/Inventor/actions/SoAction.h:27:
2246:info:build ../../include/Inventor/SbBasic.h:99:5: error: call to function 'cc_debugerror_post' that is neither visible in the template definition nor found by argument-dependent lookup
2247:info:build     cc_debugerror_post(funcname, "divide by zero error.", divider);
2248:info:build     ^
2249:info:build ../../include/Inventor/SbVec2s.h:71:35: note: in instantiation of function template specialization 'SbDividerChk<int>' requested here
2250:info:build   SbVec2s & operator /= (int d) { SbDividerChk("SbVec2s::operator/=(int)", d); vec[0] /= d; vec[1] /= d; return *this; }
2251:info:build                                   ^
2252:info:build ../../include/Inventor/C/errors/debugerror.h:59:19: note: 'cc_debugerror_post' should be declared prior to the call site
2253:info:build COIN_DLL_API void cc_debugerror_post(const char * source, const char * format, ...);
2254:info:build                   ^
2255:info:build In file included from SoRayPickAction.cpp:121:
2256:info:build In file included from ../../include/Inventor/actions/SoRayPickAction.h:27:
2257:info:build In file included from ../../include/Inventor/actions/SoPickAction.h:27:
2258:info:build In file included from ../../include/Inventor/actions/SoAction.h:27:
2259:info:build ../../include/Inventor/SbBasic.h:99:5: error: call to function 'cc_debugerror_post' that is neither visible in the template definition nor found by argument-dependent lookup
2260:info:build     cc_debugerror_post(funcname, "divide by zero error.", divider);
2261:info:build     ^
2262:info:build ../../include/Inventor/SbVec2s.h:72:38: note: in instantiation of function template specialization 'SbDividerChk<double>' requested here
2263:info:build   SbVec2s & operator /= (double d) { SbDividerChk("SbVec2s::operator/=(double)", d); return operator *= (1.0 / d); }
2264:info:build                                      ^
2265:info:build ../../include/Inventor/C/errors/debugerror.h:59:19: note: 'cc_debugerror_post' should be declared prior to the call site
2266:info:build COIN_DLL_API void cc_debugerror_post(const char * source, const char * format, ...);
2267:info:build                   ^
2268:info:build In file included from SoRayPickAction.cpp:121:
2269:info:build In file included from ../../include/Inventor/actions/SoRayPickAction.h:27:
2270:info:build In file included from ../../include/Inventor/actions/SoPickAction.h:27:
2271:info:build In file included from ../../include/Inventor/actions/SoAction.h:27:
2272:info:build ../../include/Inventor/SbBasic.h:99:5: error: call to function 'cc_debugerror_post' that is neither visible in the template definition nor found by argument-dependent lookup
2273:info:build     cc_debugerror_post(funcname, "divide by zero error.", divider);
2274:info:build     ^
2275:info:build ../../include/Inventor/SbVec2f.h:70:37: note: in instantiation of function template specialization 'SbDividerChk<float>' requested here
2276:info:build   SbVec2f & operator /= (float d) { SbDividerChk("SbVec2f::operator/=(float)", d); return operator *= (1.0f / d); }
2277:info:build                                     ^
2278:info:build ../../include/Inventor/C/errors/debugerror.h:59:19: note: 'cc_debugerror_post' should be declared prior to the call site
2279:info:build COIN_DLL_API void cc_debugerror_post(const char * source, const char * format, ...);
2280:info:build                   ^
2281:info:build 3 errors generated.
2282:info:build 3 errors generated.
2283:info:build 3 errors generated.
2284:info:build make[4]: *** [SoLineHighlightRenderAction.lo] Error 1
2285:info:build make[4]: *** [SoHandleEventAction.lo] Error 1
2286:info:build make[4]: *** [SoRayPickAction.lo] Error 1
2287:info:build In file included from SoBoxHighlightRenderAction.cpp:42:
2288:info:build In file included from ../../include/Inventor/actions/SoBoxHighlightRenderAction.h:27:
2289:info:build In file included from ../../include/Inventor/actions/SoGLRenderAction.h:27:
2290:info:build In file included from ../../include/Inventor/actions/SoAction.h:27:
2291:info:build ../../include/Inventor/SbBasic.h:99:5: error: call to function 'cc_debugerror_post' that is neither visible in the template definition nor found by argument-dependent lookup
2292:info:build     cc_debugerror_post(funcname, "divide by zero error.", divider);
2293:info:build     ^
2294:info:build ../../include/Inventor/SbVec2s.h:71:35: note: in instantiation of function template specialization 'SbDividerChk<int>' requested here
2295:info:build   SbVec2s & operator /= (int d) { SbDividerChk("SbVec2s::operator/=(int)", d); vec[0] /= d; vec[1] /= d; return *this; }
2296:info:build                                   ^
2297:info:build ../../include/Inventor/C/errors/debugerror.h:59:19: note: 'cc_debugerror_post' should be declared prior to the call site
2298:info:build COIN_DLL_API void cc_debugerror_post(const char * source, const char * format, ...);
2299:info:build                   ^
2300:info:build In file included from SoBoxHighlightRenderAction.cpp:42:
2301:info:build In file included from ../../include/Inventor/actions/SoBoxHighlightRenderAction.h:27:
2302:info:build In file included from ../../include/Inventor/actions/SoGLRenderAction.h:27:
2303:info:build In file included from ../../include/Inventor/actions/SoAction.h:27:
2304:info:build ../../include/Inventor/SbBasic.h:99:5: error: call to function 'cc_debugerror_post' that is neither visible in the template definition nor found by argument-dependent lookup
2305:info:build     cc_debugerror_post(funcname, "divide by zero error.", divider);
2306:info:build     ^
2307:info:build ../../include/Inventor/SbVec2s.h:72:38: note: in instantiation of function template specialization 'SbDividerChk<double>' requested here
2308:info:build   SbVec2s & operator /= (double d) { SbDividerChk("SbVec2s::operator/=(double)", d); return operator *= (1.0 / d); }
2309:info:build                                      ^
2310:info:build ../../include/Inventor/C/errors/debugerror.h:59:19: note: 'cc_debugerror_post' should be declared prior to the call site
2311:info:build COIN_DLL_API void cc_debugerror_post(const char * source, const char * format, ...);
2312:info:build                   ^
2313:info:build In file included from SoBoxHighlightRenderAction.cpp:42:
2314:info:build In file included from ../../include/Inventor/actions/SoBoxHighlightRenderAction.h:27:
2315:info:build In file included from ../../include/Inventor/actions/SoGLRenderAction.h:27:
2316:info:build In file included from ../../include/Inventor/actions/SoAction.h:27:
2317:info:build ../../include/Inventor/SbBasic.h:99:5: error: call to function 'cc_debugerror_post' that is neither visible in the template definition nor found by argument-dependent lookup
2318:info:build     cc_debugerror_post(funcname, "divide by zero error.", divider);
2319:info:build     ^
2320:info:build ../../include/Inventor/SbVec2f.h:70:37: note: in instantiation of function template specialization 'SbDividerChk<float>' requested here
2321:info:build   SbVec2f & operator /= (float d) { SbDividerChk("SbVec2f::operator/=(float)", d); return operator *= (1.0f / d); }
2322:info:build                                     ^
2323:info:build ../../include/Inventor/C/errors/debugerror.h:59:19: note: 'cc_debugerror_post' should be declared prior to the call site
2324:info:build COIN_DLL_API void cc_debugerror_post(const char * source, const char * format, ...);
2325:info:build                   ^
2326:info:build 3 errors generated.
2327:info:build make[4]: *** [SoBoxHighlightRenderAction.lo] Error 1
2328:info:build In file included from SoCallbackAction.cpp:130:
2329:info:build In file included from ../../include/Inventor/actions/SoCallbackAction.h:29:
2330:info:build In file included from ../../include/Inventor/actions/SoAction.h:27:
2331:info:build ../../include/Inventor/SbBasic.h:99:5: error: call to function 'cc_debugerror_post' that is neither visible in the template definition nor found by argument-dependent lookup
2332:info:build     cc_debugerror_post(funcname, "divide by zero error.", divider);
2333:info:build     ^
2334:info:build ../../include/Inventor/SbVec3f.h:78:37: note: in instantiation of function template specialization 'SbDividerChk<float>' requested here
2335:info:build   SbVec3f & operator /= (float d) { SbDividerChk("SbVec3f::operator/=(float)", d); return operator *= (1.0f / d); }
2336:info:build                                     ^
2337:info:build ../../include/Inventor/C/errors/debugerror.h:59:19: note: 'cc_debugerror_post' should be declared prior to the call site
2338:info:build COIN_DLL_API void cc_debugerror_post(const char * source, const char * format, ...);
2339:info:build                   ^
2340:info:build In file included from SoCallbackAction.cpp:130:
2341:info:build In file included from ../../include/Inventor/actions/SoCallbackAction.h:29:
2342:info:build In file included from ../../include/Inventor/actions/SoAction.h:27:
2343:info:build ../../include/Inventor/SbBasic.h:99:5: error: call to function 'cc_debugerror_post' that is neither visible in the template definition nor found by argument-dependent lookup
2344:info:build     cc_debugerror_post(funcname, "divide by zero error.", divider);
2345:info:build     ^
2346:info:build ../../include/Inventor/SbVec2s.h:71:35: note: in instantiation of function template specialization 'SbDividerChk<int>' requested here
2347:info:build   SbVec2s & operator /= (int d) { SbDividerChk("SbVec2s::operator/=(int)", d); vec[0] /= d; vec[1] /= d; return *this; }
2348:info:build                                   ^
2349:info:build ../../include/Inventor/C/errors/debugerror.h:59:19: note: 'cc_debugerror_post' should be declared prior to the call site
2350:info:build COIN_DLL_API void cc_debugerror_post(const char * source, const char * format, ...);
2351:info:build                   ^
2352:info:build In file included from SoCallbackAction.cpp:130:
2353:info:build In file included from ../../include/Inventor/actions/SoCallbackAction.h:29:
2354:info:build In file included from ../../include/Inventor/actions/SoAction.h:27:
2355:info:build ../../include/Inventor/SbBasic.h:99:5: error: call to function 'cc_debugerror_post' that is neither visible in the template definition nor found by argument-dependent lookup
2356:info:build     cc_debugerror_post(funcname, "divide by zero error.", divider);
2357:info:build     ^
2358:info:build ../../include/Inventor/SbVec2s.h:72:38: note: in instantiation of function template specialization 'SbDividerChk<double>' requested here
2359:info:build   SbVec2s & operator /= (double d) { SbDividerChk("SbVec2s::operator/=(double)", d); return operator *= (1.0 / d); }
2360:info:build                                      ^
2361:info:build ../../include/Inventor/C/errors/debugerror.h:59:19: note: 'cc_debugerror_post' should be declared prior to the call site
2362:info:build COIN_DLL_API void cc_debugerror_post(const char * source, const char * format, ...);
2363:info:build                   ^
2364:info:build 3 errors generated.
2365:info:build make[4]: *** [SoCallbackAction.lo] Error 1
2366:info:build In file included from SoAction.cpp:219:
2367:info:build In file included from ../../src/misc/SoDBP.h:38:
2368:info:build ../../src/misc/SbHash.h:355:21: warning: comparison of integers of different signs: 'unsigned int' and 'int' [-Wsign-compare]
2369:info:build         if (chain_l > chain_length_max) { chain_length_max = chain_l; }
2370:info:build             ~~~~~~~ ^ ~~~~~~~~~~~~~~~~
2371:info:build ../../src/misc/SbHash.h:370:39: warning: unused parameter 'obj' [-Wunused-parameter]
2372:info:build     void operator()(Key & key, Type & obj, SbList<Key> * list) {
2373:info:build                                       ^
2374:info:build In file included from SoAction.cpp:197:
2375:info:build In file included from ../../include/Inventor/actions/SoAction.h:27:
2376:info:build ../../include/Inventor/SbBasic.h:99:5: error: call to function 'cc_debugerror_post' that is neither visible in the template definition nor found by argument-dependent lookup
2377:info:build     cc_debugerror_post(funcname, "divide by zero error.", divider);
2378:info:build     ^
2379:info:build ../../include/Inventor/SbVec3f.h:78:37: note: in instantiation of function template specialization 'SbDividerChk<float>' requested here
2380:info:build   SbVec3f & operator /= (float d) { SbDividerChk("SbVec3f::operator/=(float)", d); return operator *= (1.0f / d); }
2381:info:build                                     ^
2382:info:build ../../include/Inventor/C/errors/debugerror.h:59:19: note: 'cc_debugerror_post' should be declared prior to the call site
2383:info:build COIN_DLL_API void cc_debugerror_post(const char * source, const char * format, ...);
2384:info:build                   ^
2385:info:build In file included from SoAction.cpp:197:
2386:info:build In file included from ../../include/Inventor/actions/SoAction.h:27:
2387:info:build ../../include/Inventor/SbBasic.h:99:5: error: call to function 'cc_debugerror_post' that is neither visible in the template definition nor found by argument-dependent lookup
2388:info:build     cc_debugerror_post(funcname, "divide by zero error.", divider);
2389:info:build     ^
2390:info:build ../../include/Inventor/SbVec2s.h:71:35: note: in instantiation of function template specialization 'SbDividerChk<int>' requested here
2391:info:build   SbVec2s & operator /= (int d) { SbDividerChk("SbVec2s::operator/=(int)", d); vec[0] /= d; vec[1] /= d; return *this; }
2392:info:build                                   ^
2393:info:build ../../include/Inventor/C/errors/debugerror.h:59:19: note: 'cc_debugerror_post' should be declared prior to the call site
2394:info:build COIN_DLL_API void cc_debugerror_post(const char * source, const char * format, ...);
2395:info:build                   ^
2396:info:build In file included from SoAction.cpp:197:
2397:info:build In file included from ../../include/Inventor/actions/SoAction.h:27:
2398:info:build ../../include/Inventor/SbBasic.h:99:5: error: call to function 'cc_debugerror_post' that is neither visible in the template definition nor found by argument-dependent lookup
2399:info:build     cc_debugerror_post(funcname, "divide by zero error.", divider);
2400:info:build     ^
2401:info:build ../../include/Inventor/SbVec2s.h:72:38: note: in instantiation of function template specialization 'SbDividerChk<double>' requested here
2402:info:build   SbVec2s & operator /= (double d) { SbDividerChk("SbVec2s::operator/=(double)", d); return operator *= (1.0 / d); }
2403:info:build                                      ^
2404:info:build ../../include/Inventor/C/errors/debugerror.h:59:19: note: 'cc_debugerror_post' should be declared prior to the call site
2405:info:build COIN_DLL_API void cc_debugerror_post(const char * source, const char * format, ...);
2406:info:build                   ^
2407:info:build 2 warnings and 3 errors generated.
2408:info:build make[4]: *** [SoAction.lo] Error 1
2409:info:build In file included from SoReorganizeAction.cpp:242:
2410:info:build In file included from ../../include/Inventor/actions/SoReorganizeAction.h:27:
2411:info:build In file included from ../../include/Inventor/actions/SoSimplifyAction.h:27:
2412:info:build In file included from ../../include/Inventor/actions/SoAction.h:27:
2413:info:build ../../include/Inventor/SbBasic.h:99:5: error: call to function 'cc_debugerror_post' that is neither visible in the template definition nor found by argument-dependent lookup
2414:info:build     cc_debugerror_post(funcname, "divide by zero error.", divider);
2415:info:build     ^
2416:info:build ../../include/Inventor/SbVec3f.h:78:37: note: in instantiation of function template specialization 'SbDividerChk<float>' requested here
2417:info:build   SbVec3f & operator /= (float d) { SbDividerChk("SbVec3f::operator/=(float)", d); return operator *= (1.0f / d); }
2418:info:build                                     ^
2419:info:build ../../include/Inventor/C/errors/debugerror.h:59:19: note: 'cc_debugerror_post' should be declared prior to the call site
2420:info:build COIN_DLL_API void cc_debugerror_post(const char * source, const char * format, ...);
2421:info:build                   ^
2422:info:build In file included from SoReorganizeAction.cpp:242:
2423:info:build In file included from ../../include/Inventor/actions/SoReorganizeAction.h:27:
2424:info:build In file included from ../../include/Inventor/actions/SoSimplifyAction.h:27:
2425:info:build In file included from ../../include/Inventor/actions/SoAction.h:27:
2426:info:build ../../include/Inventor/SbBasic.h:99:5: error: call to function 'cc_debugerror_post' that is neither visible in the template definition nor found by argument-dependent lookup
2427:info:build     cc_debugerror_post(funcname, "divide by zero error.", divider);
2428:info:build     ^
2429:info:build ../../include/Inventor/SbVec2s.h:71:35: note: in instantiation of function template specialization 'SbDividerChk<int>' requested here
2430:info:build   SbVec2s & operator /= (int d) { SbDividerChk("SbVec2s::operator/=(int)", d); vec[0] /= d; vec[1] /= d; return *this; }
2431:info:build                                   ^
2432:info:build ../../include/Inventor/C/errors/debugerror.h:59:19: note: 'cc_debugerror_post' should be declared prior to the call site
2433:info:build COIN_DLL_API void cc_debugerror_post(const char * source, const char * format, ...);
2434:info:build                   ^
2435:info:build In file included from SoReorganizeAction.cpp:242:
2436:info:build In file included from ../../include/Inventor/actions/SoReorganizeAction.h:27:
2437:info:build In file included from ../../include/Inventor/actions/SoSimplifyAction.h:27:
2438:info:build In file included from ../../include/Inventor/actions/SoAction.h:27:
2439:info:build ../../include/Inventor/SbBasic.h:99:5: error: call to function 'cc_debugerror_post' that is neither visible in the template definition nor found by argument-dependent lookup
2440:info:build     cc_debugerror_post(funcname, "divide by zero error.", divider);
2441:info:build     ^
2442:info:build ../../include/Inventor/SbVec2s.h:72:38: note: in instantiation of function template specialization 'SbDividerChk<double>' requested here
2443:info:build   SbVec2s & operator /= (double d) { SbDividerChk("SbVec2s::operator/=(double)", d); return operator *= (1.0 / d); }
2444:info:build                                      ^
2445:info:build ../../include/Inventor/C/errors/debugerror.h:59:19: note: 'cc_debugerror_post' should be declared prior to the call site
2446:info:build COIN_DLL_API void cc_debugerror_post(const char * source, const char * format, ...);
2447:info:build                   ^
2448:info:build 3 errors generated.
2449:info:build make[4]: *** [SoReorganizeAction.lo] Error 1
2450:info:build In file included from SoGLRenderAction.cpp:56:
2451:info:build In file included from ../../include/Inventor/actions/SoGLRenderAction.h:27:
2452:info:build In file included from ../../include/Inventor/actions/SoAction.h:27:
2453:info:build ../../include/Inventor/SbBasic.h:99:5: error: call to function 'cc_debugerror_post' that is neither visible in the template definition nor found by argument-dependent lookup
2454:info:build     cc_debugerror_post(funcname, "divide by zero error.", divider);
2455:info:build     ^
2456:info:build ../../include/Inventor/SbVec2s.h:71:35: note: in instantiation of function template specialization 'SbDividerChk<int>' requested here
2457:info:build   SbVec2s & operator /= (int d) { SbDividerChk("SbVec2s::operator/=(int)", d); vec[0] /= d; vec[1] /= d; return *this; }
2458:info:build                                   ^
2459:info:build ../../include/Inventor/C/errors/debugerror.h:59:19: note: 'cc_debugerror_post' should be declared prior to the call site
2460:info:build COIN_DLL_API void cc_debugerror_post(const char * source, const char * format, ...);
2461:info:build                   ^
2462:info:build In file included from SoGLRenderAction.cpp:56:
2463:info:build In file included from ../../include/Inventor/actions/SoGLRenderAction.h:27:
2464:info:build In file included from ../../include/Inventor/actions/SoAction.h:27:
2465:info:build ../../include/Inventor/SbBasic.h:99:5: error: call to function 'cc_debugerror_post' that is neither visible in the template definition nor found by argument-dependent lookup
2466:info:build     cc_debugerror_post(funcname, "divide by zero error.", divider);
2467:info:build     ^
2468:info:build ../../include/Inventor/SbVec2s.h:72:38: note: in instantiation of function template specialization 'SbDividerChk<double>' requested here
2469:info:build   SbVec2s & operator /= (double d) { SbDividerChk("SbVec2s::operator/=(double)", d); return operator *= (1.0 / d); }
2470:info:build                                      ^
2471:info:build ../../include/Inventor/C/errors/debugerror.h:59:19: note: 'cc_debugerror_post' should be declared prior to the call site
2472:info:build COIN_DLL_API void cc_debugerror_post(const char * source, const char * format, ...);
2473:info:build                   ^
2474:info:build In file included from SoGLRenderAction.cpp:56:
2475:info:build In file included from ../../include/Inventor/actions/SoGLRenderAction.h:27:
2476:info:build In file included from ../../include/Inventor/actions/SoAction.h:27:
2477:info:build ../../include/Inventor/SbBasic.h:99:5: error: call to function 'cc_debugerror_post' that is neither visible in the template definition nor found by argument-dependent lookup
2478:info:build     cc_debugerror_post(funcname, "divide by zero error.", divider);
2479:info:build     ^
2480:info:build ../../include/Inventor/SbVec2f.h:70:37: note: in instantiation of function template specialization 'SbDividerChk<float>' requested here
2481:info:build   SbVec2f & operator /= (float d) { SbDividerChk("SbVec2f::operator/=(float)", d); return operator *= (1.0f / d); }
2482:info:build                                     ^
2483:info:build ../../include/Inventor/C/errors/debugerror.h:59:19: note: 'cc_debugerror_post' should be declared prior to the call site
2484:info:build COIN_DLL_API void cc_debugerror_post(const char * source, const char * format, ...);
2485:info:build                   ^
2486:info:build 3 errors generated.
2487:info:build make[4]: *** [SoGLRenderAction.lo] Error 1
2488:info:build In file included from SoToVRML2Action.cpp:152:
2489:info:build ../../src/misc/SbHash.h:355:21: warning: comparison of integers of different signs: 'unsigned int' and 'int' [-Wsign-compare]
2490:info:build         if (chain_l > chain_length_max) { chain_length_max = chain_l; }
2491:info:build             ~~~~~~~ ^ ~~~~~~~~~~~~~~~~
2492:info:build ../../src/misc/SbHash.h:370:39: warning: unused parameter 'obj' [-Wunused-parameter]
2493:info:build     void operator()(Key & key, Type & obj, SbList<Key> * list) {
2494:info:build                                       ^
2495:info:build In file included from SoToVRMLAction.cpp:42:
2496:info:build In file included from ../../include/Inventor/actions/SoToVRMLAction.h:27:
2497:info:build In file included from ../../include/Inventor/actions/SoAction.h:27:
2498:info:build ../../include/Inventor/SbBasic.h:99:5: error: call to function 'cc_debugerror_post' that is neither visible in the template definition nor found by argument-dependent lookup
2499:info:build     cc_debugerror_post(funcname, "divide by zero error.", divider);
2500:info:build     ^
2501:info:build ../../include/Inventor/SbVec3f.h:78:37: note: in instantiation of function template specialization 'SbDividerChk<float>' requested here
2502:info:build   SbVec3f & operator /= (float d) { SbDividerChk("SbVec3f::operator/=(float)", d); return operator *= (1.0f / d); }
2503:info:build                                     ^
2504:info:build ../../include/Inventor/C/errors/debugerror.h:59:19: note: 'cc_debugerror_post' should be declared prior to the call site
2505:info:build COIN_DLL_API void cc_debugerror_post(const char * source, const char * format, ...);
2506:info:build                   ^
2507:info:build In file included from SoToVRMLAction.cpp:42:
2508:info:build In file included from ../../include/Inventor/actions/SoToVRMLAction.h:27:
2509:info:build In file included from ../../include/Inventor/actions/SoAction.h:27:
2510:info:build ../../include/Inventor/SbBasic.h:99:5: error: call to function 'cc_debugerror_post' that is neither visible in the template definition nor found by argument-dependent lookup
2511:info:build     cc_debugerror_post(funcname, "divide by zero error.", divider);
2512:info:build     ^
2513:info:build ../../include/Inventor/SbVec2s.h:71:35: note: in instantiation of function template specialization 'SbDividerChk<int>' requested here
2514:info:build   SbVec2s & operator /= (int d) { SbDividerChk("SbVec2s::operator/=(int)", d); vec[0] /= d; vec[1] /= d; return *this; }
2515:info:build                                   ^
2516:info:build ../../include/Inventor/C/errors/debugerror.h:59:19: note: 'cc_debugerror_post' should be declared prior to the call site
2517:info:build COIN_DLL_API void cc_debugerror_post(const char * source, const char * format, ...);
2518:info:build                   ^
2519:info:build In file included from SoToVRMLAction.cpp:42:
2520:info:build In file included from ../../include/Inventor/actions/SoToVRMLAction.h:27:
2521:info:build In file included from ../../include/Inventor/actions/SoAction.h:27:
2522:info:build ../../include/Inventor/SbBasic.h:99:5: error: call to function 'cc_debugerror_post' that is neither visible in the template definition nor found by argument-dependent lookup
2523:info:build     cc_debugerror_post(funcname, "divide by zero error.", divider);
2524:info:build     ^
2525:info:build ../../include/Inventor/SbVec2s.h:72:38: note: in instantiation of function template specialization 'SbDividerChk<double>' requested here
2526:info:build   SbVec2s & operator /= (double d) { SbDividerChk("SbVec2s::operator/=(double)", d); return operator *= (1.0 / d); }
2527:info:build                                      ^
2528:info:build ../../include/Inventor/C/errors/debugerror.h:59:19: note: 'cc_debugerror_post' should be declared prior to the call site
2529:info:build COIN_DLL_API void cc_debugerror_post(const char * source, const char * format, ...);
2530:info:build                   ^
2531:info:build 3 errors generated.
2532:info:build make[4]: *** [SoToVRMLAction.lo] Error 1
2533:info:build In file included from SoToVRML2Action.cpp:112:
2534:info:build In file included from ../../include/Inventor/actions/SoToVRML2Action.h:27:
2535:info:build In file included from ../../include/Inventor/actions/SoToVRMLAction.h:27:
2536:info:build In file included from ../../include/Inventor/actions/SoAction.h:27:
2537:info:build ../../include/Inventor/SbBasic.h:99:5: error: call to function 'cc_debugerror_post' that is neither visible in the template definition nor found by argument-dependent lookup
2538:info:build     cc_debugerror_post(funcname, "divide by zero error.", divider);
2539:info:build     ^
2540:info:build ../../include/Inventor/SbVec3f.h:78:37: note: in instantiation of function template specialization 'SbDividerChk<float>' requested here
2541:info:build   SbVec3f & operator /= (float d) { SbDividerChk("SbVec3f::operator/=(float)", d); return operator *= (1.0f / d); }
2542:info:build                                     ^
2543:info:build ../../include/Inventor/C/errors/debugerror.h:59:19: note: 'cc_debugerror_post' should be declared prior to the call site
2544:info:build COIN_DLL_API void cc_debugerror_post(const char * source, const char * format, ...);
2545:info:build                   ^
2546:info:build In file included from SoToVRML2Action.cpp:112:
2547:info:build In file included from ../../include/Inventor/actions/SoToVRML2Action.h:27:
2548:info:build In file included from ../../include/Inventor/actions/SoToVRMLAction.h:27:
2549:info:build In file included from ../../include/Inventor/actions/SoAction.h:27:
2550:info:build ../../include/Inventor/SbBasic.h:99:5: error: call to function 'cc_debugerror_post' that is neither visible in the template definition nor found by argument-dependent lookup
2551:info:build     cc_debugerror_post(funcname, "divide by zero error.", divider);
2552:info:build     ^
2553:info:build ../../include/Inventor/SbVec2s.h:71:35: note: in instantiation of function template specialization 'SbDividerChk<int>' requested here
2554:info:build   SbVec2s & operator /= (int d) { SbDividerChk("SbVec2s::operator/=(int)", d); vec[0] /= d; vec[1] /= d; return *this; }
2555:info:build                                   ^
2556:info:build ../../include/Inventor/C/errors/debugerror.h:59:19: note: 'cc_debugerror_post' should be declared prior to the call site
2557:info:build COIN_DLL_API void cc_debugerror_post(const char * source, const char * format, ...);
2558:info:build                   ^
2559:info:build In file included from SoToVRML2Action.cpp:112:
2560:info:build In file included from ../../include/Inventor/actions/SoToVRML2Action.h:27:
2561:info:build In file included from ../../include/Inventor/actions/SoToVRMLAction.h:27:
2562:info:build In file included from ../../include/Inventor/actions/SoAction.h:27:
2563:info:build ../../include/Inventor/SbBasic.h:99:5: error: call to function 'cc_debugerror_post' that is neither visible in the template definition nor found by argument-dependent lookup
2564:info:build     cc_debugerror_post(funcname, "divide by zero error.", divider);
2565:info:build     ^
2566:info:build ../../include/Inventor/SbVec2s.h:72:38: note: in instantiation of function template specialization 'SbDividerChk<double>' requested here
2567:info:build   SbVec2s & operator /= (double d) { SbDividerChk("SbVec2s::operator/=(double)", d); return operator *= (1.0 / d); }
2568:info:build                                      ^
2569:info:build ../../include/Inventor/C/errors/debugerror.h:59:19: note: 'cc_debugerror_post' should be declared prior to the call site
2570:info:build COIN_DLL_API void cc_debugerror_post(const char * source, const char * format, ...);
2571:info:build                   ^
2572:info:build 2 warnings and 3 errors generated.
2573:info:build make[4]: *** [SoToVRML2Action.lo] Error 1
2574:info:build make[4]: Leaving directory `/opt/local/var/macports/build/_opt_local_var_macports_sources_rsync.macports.org_release_tarballs_ports_graphics_Coin/Coin/work/Coin-3.1.3/src/actions'
2575:info:build make[3]: *** [all-recursive] Error 1
2576:info:build make[3]: Leaving directory `/opt/local/var/macports/build/_opt_local_var_macports_sources_rsync.macports.org_release_tarballs_ports_graphics_Coin/Coin/work/Coin-3.1.3/src'
2577:info:build make[2]: *** [all] Error 2
2578:info:build make[2]: Leaving directory `/opt/local/var/macports/build/_opt_local_var_macports_sources_rsync.macports.org_release_tarballs_ports_graphics_Coin/Coin/work/Coin-3.1.3/src'
2579:info:build make[1]: *** [all-recursive] Error 1
2580:info:build make[1]: Leaving directory `/opt/local/var/macports/build/_opt_local_var_macports_sources_rsync.macports.org_release_tarballs_ports_graphics_Coin/Coin/work/Coin-3.1.3'
2581:info:build make: *** [all] Error 2
2582:info:build make: Leaving directory `/opt/local/var/macports/build/_opt_local_var_macports_sources_rsync.macports.org_release_tarballs_ports_graphics_Coin/Coin/work/Coin-3.1.3'
2583:info:build Command failed:  cd "/opt/local/var/macports/build/_opt_local_var_macports_sources_rsync.macports.org_release_tarballs_ports_graphics_Coin/Coin/work/Coin-3.1.3" && /usr/bin/make -j18 -w all
2584:info:build Exit code: 2
2585:error:build org.macports.build for port Coin returned: command execution failed
2586:debug:build Error code: CHILDSTATUS 41782 2
2587:debug:build Backtrace: command execution failed
2588    while executing
2589"system -nice 0 $fullcmdstring"
2590    ("eval" body line 1)
2591    invoked from within
2592"eval system $notty $nice \$fullcmdstring"
2593    invoked from within
2594"command_exec build"
2595    (procedure "portbuild::build_main" line 8)
2596    invoked from within
2597"$procedure $targetname"
2598:info:build Warning: targets not executed for Coin: org.macports.activate org.macports.build org.macports.destroot org.macports.install
2599:notice:build Please see the log file for port Coin for details:
2600    /opt/local/var/macports/logs/_opt_local_var_macports_sources_rsync.macports.org_release_tarballs_ports_graphics_Coin/Coin/main.log