Ticket #36981: config.log

File config.log, 15.1 KB (added by udbraumann, 10 years ago)
Line 
1This file contains any messages produced by compilers while
2running configure, to aid debugging if configure makes a mistake.
3
4It was created by GNU C Runtime Library configure 1.0, which was
5generated by GNU Autoconf 2.64.  Invocation command line was
6
7  $ /opt/local/var/macports/build/_opt_local_var_macports_sources_rsync.macports.org_release_ports_lang_gcc47/libstdcxx/work/gcc-4.7.2/libgcc/configure --cache-file=./config.cache --prefix=/opt/local --includedir=/opt/local/include/gcc47 --infodir=/opt/local/share/info --mandir=/opt/local/share/man --datarootdir=/opt/local/share/gcc-4.7 --with-libiconv-prefix=/opt/local --with-local-prefix=/opt/local --with-system-zlib --disable-nls --with-gxx-include-dir=/opt/local/include/gcc47/c++/ --with-gmp=/opt/local --with-mpfr=/opt/local --with-mpc=/opt/local --with-ppl=/opt/local --with-cloog=/opt/local --enable-cloog-backend=isl --disable-cloog-version-check --enable-stage1-checking --disable-multilib --enable-lto --enable-libstdcxx-time --with-as=/opt/local/bin/as --with-ld=/opt/local/bin/ld --with-ar=/opt/local/bin/ar --with-bugurl=https://trac.macports.org/newticket --disable-ppl-version-check --with-pkgversion=MacPorts gcc47 4.7.2_2 --enable-languages=c,c++,lto --program-transform-name=s&$&-mp-4.7& --disable-option-checking --with-target-subdir=ppc-apple-darwin9 --build=ppc-apple-darwin9 --host=ppc-apple-darwin9 --target=ppc-apple-darwin9 --srcdir=../../../gcc-4.7.2/libgcc --disable-intermodule --enable-checking=yes --disable-coverage --enable-languages=c,c++,lto
8
9## --------- ##
10## Platform. ##
11## --------- ##
12
13hostname = Macintosh-2.local
14uname -m = Power Macintosh
15uname -r = 9.8.0
16uname -s = Darwin
17uname -v = Darwin Kernel Version 9.8.0: Wed Jul 15 16:57:01 PDT 2009; root:xnu-1228.15.4~1/RELEASE_PPC
18
19/usr/bin/uname -p = powerpc
20/bin/uname -X     = unknown
21
22/bin/arch              = unknown
23/usr/bin/arch -k       = unknown
24/usr/convex/getsysinfo = unknown
25/usr/bin/hostinfo      = Mach kernel version:
26         Darwin Kernel Version 9.8.0: Wed Jul 15 16:57:01 PDT 2009; root:xnu-1228.15.4~1/RELEASE_PPC
27Kernel configured for a single processor only.
281 processor is physically available.
291 processor is logically available.
30Processor type: ppc7450 (PowerPC 7450)
31Processor active: 0
32Primary memory available: 1.00 gigabytes
33Default processor set: 86 tasks, 284 threads, 1 processors
34Load average: 1.50, Mach factor: 0.37
35/bin/machine           = unknown
36/usr/bin/oslevel       = unknown
37/bin/universe          = unknown
38
39PATH: /opt/local/bin
40PATH: /opt/local/sbin
41PATH: /bin
42PATH: /sbin
43PATH: /usr/bin
44PATH: /usr/sbin
45
46
47## ----------- ##
48## Core tests. ##
49## ----------- ##
50
51configure:1976: creating cache ./config.cache
52configure:2144: checking build system type
53configure:2158: result: powerpc-apple-darwin9
54configure:2178: checking host system type
55configure:2191: result: powerpc-apple-darwin9
56configure:2289: checking for --enable-version-specific-runtime-libs
57configure:2302: result: no
58configure:2350: checking for a BSD-compatible install
59configure:2418: result: /usr/bin/install -c
60configure:2434: checking for gawk
61configure:2461: result: gawk
62configure:2561: checking for ppc-apple-darwin9-ar
63configure:2588: result: /opt/local/bin/ar
64configure:2653: checking for ppc-apple-darwin9-lipo
65configure:2680: result: lipo
66configure:2745: checking for ppc-apple-darwin9-nm
67configure:2772: result: /opt/local/var/macports/build/_opt_local_var_macports_sources_rsync.macports.org_release_ports_lang_gcc47/libstdcxx/work/build/./gcc/nm
68configure:2837: checking for ppc-apple-darwin9-ranlib
69configure:2864: result: /opt/local/bin/ranlib
70configure:2929: checking for ppc-apple-darwin9-strip
71configure:2956: result: /opt/local/bin/strip
72configure:3018: checking whether ln -s works
73configure:3022: result: yes
74configure:3039: checking for ppc-apple-darwin9-gcc
75configure:3066: result: /opt/local/var/macports/build/_opt_local_var_macports_sources_rsync.macports.org_release_ports_lang_gcc47/libstdcxx/work/build/./gcc/xgcc -B/opt/local/var/macports/build/_opt_local_var_macports_sources_rsync.macports.org_release_ports_lang_gcc47/libstdcxx/work/build/./gcc/ -B/opt/local/ppc-apple-darwin9/bin/ -B/opt/local/ppc-apple-darwin9/lib/ -isystem /opt/local/ppc-apple-darwin9/include -isystem /opt/local/ppc-apple-darwin9/sys-include   
76configure:3335: checking for C compiler version
77configure:3344: /opt/local/var/macports/build/_opt_local_var_macports_sources_rsync.macports.org_release_ports_lang_gcc47/libstdcxx/work/build/./gcc/xgcc -B/opt/local/var/macports/build/_opt_local_var_macports_sources_rsync.macports.org_release_ports_lang_gcc47/libstdcxx/work/build/./gcc/ -B/opt/local/ppc-apple-darwin9/bin/ -B/opt/local/ppc-apple-darwin9/lib/ -isystem /opt/local/ppc-apple-darwin9/include -isystem /opt/local/ppc-apple-darwin9/sys-include    --version >&5
78xgcc (MacPorts gcc47 4.7.2_2) 4.7.2
79Copyright (C) 2012 Free Software Foundation, Inc.
80This is free software; see the source for copying conditions.  There is NO
81warranty; not even for MERCHANTABILITY or FITNESS FOR A PARTICULAR PURPOSE.
82
83configure:3355: $? = 0
84configure:3344: /opt/local/var/macports/build/_opt_local_var_macports_sources_rsync.macports.org_release_ports_lang_gcc47/libstdcxx/work/build/./gcc/xgcc -B/opt/local/var/macports/build/_opt_local_var_macports_sources_rsync.macports.org_release_ports_lang_gcc47/libstdcxx/work/build/./gcc/ -B/opt/local/ppc-apple-darwin9/bin/ -B/opt/local/ppc-apple-darwin9/lib/ -isystem /opt/local/ppc-apple-darwin9/include -isystem /opt/local/ppc-apple-darwin9/sys-include    -v >&5
85Reading specs from /opt/local/var/macports/build/_opt_local_var_macports_sources_rsync.macports.org_release_ports_lang_gcc47/libstdcxx/work/build/./gcc/specs
86COLLECT_GCC=/opt/local/var/macports/build/_opt_local_var_macports_sources_rsync.macports.org_release_ports_lang_gcc47/libstdcxx/work/build/./gcc/xgcc
87COLLECT_LTO_WRAPPER=/opt/local/var/macports/build/_opt_local_var_macports_sources_rsync.macports.org_release_ports_lang_gcc47/libstdcxx/work/build/./gcc/lto-wrapper
88Target: ppc-apple-darwin9
89Configured with: ../gcc-4.7.2/configure --prefix=/opt/local --build=ppc-apple-darwin9 --includedir=/opt/local/include/gcc47 --infodir=/opt/local/share/info --mandir=/opt/local/share/man --datarootdir=/opt/local/share/gcc-4.7 --with-libiconv-prefix=/opt/local --with-local-prefix=/opt/local --with-system-zlib --disable-nls --program-suffix=-mp-4.7 --with-gxx-include-dir=/opt/local/include/gcc47/c++/ --with-gmp=/opt/local --with-mpfr=/opt/local --with-mpc=/opt/local --with-ppl=/opt/local --with-cloog=/opt/local --enable-cloog-backend=isl --disable-cloog-version-check --enable-stage1-checking --disable-multilib --enable-lto --enable-libstdcxx-time --with-as=/opt/local/bin/as --with-ld=/opt/local/bin/ld --with-ar=/opt/local/bin/ar --with-bugurl=https://trac.macports.org/newticket --disable-ppl-version-check --enable-languages=c++ --with-pkgversion='MacPorts gcc47 4.7.2_2'
90Thread model: posix
91gcc version 4.7.2 (MacPorts gcc47 4.7.2_2)
92configure:3355: $? = 0
93configure:3344: /opt/local/var/macports/build/_opt_local_var_macports_sources_rsync.macports.org_release_ports_lang_gcc47/libstdcxx/work/build/./gcc/xgcc -B/opt/local/var/macports/build/_opt_local_var_macports_sources_rsync.macports.org_release_ports_lang_gcc47/libstdcxx/work/build/./gcc/ -B/opt/local/ppc-apple-darwin9/bin/ -B/opt/local/ppc-apple-darwin9/lib/ -isystem /opt/local/ppc-apple-darwin9/include -isystem /opt/local/ppc-apple-darwin9/sys-include    -V >&5
94xgcc: error: unrecognized command line option '-V'
95xgcc: fatal error: no input files
96compilation terminated.
97configure:3355: $? = 1
98configure:3344: /opt/local/var/macports/build/_opt_local_var_macports_sources_rsync.macports.org_release_ports_lang_gcc47/libstdcxx/work/build/./gcc/xgcc -B/opt/local/var/macports/build/_opt_local_var_macports_sources_rsync.macports.org_release_ports_lang_gcc47/libstdcxx/work/build/./gcc/ -B/opt/local/ppc-apple-darwin9/bin/ -B/opt/local/ppc-apple-darwin9/lib/ -isystem /opt/local/ppc-apple-darwin9/include -isystem /opt/local/ppc-apple-darwin9/sys-include    -qversion >&5
99xgcc: error: unrecognized command line option '-qversion'
100xgcc: fatal error: no input files
101compilation terminated.
102configure:3355: $? = 1
103configure:3371: /opt/local/var/macports/build/_opt_local_var_macports_sources_rsync.macports.org_release_ports_lang_gcc47/libstdcxx/work/build/./gcc/xgcc -B/opt/local/var/macports/build/_opt_local_var_macports_sources_rsync.macports.org_release_ports_lang_gcc47/libstdcxx/work/build/./gcc/ -B/opt/local/ppc-apple-darwin9/bin/ -B/opt/local/ppc-apple-darwin9/lib/ -isystem /opt/local/ppc-apple-darwin9/include -isystem /opt/local/ppc-apple-darwin9/sys-include    -o conftest -g -O2   conftest.c  >&5
104xgcc: internal compiler error: Segmentation fault (program cc1)
105Please submit a full bug report,
106with preprocessed source if appropriate.
107See <https://trac.macports.org/newticket> for instructions.
108configure:3374: $? = 4
109configure:3562: checking for suffix of object files
110configure:3584: /opt/local/var/macports/build/_opt_local_var_macports_sources_rsync.macports.org_release_ports_lang_gcc47/libstdcxx/work/build/./gcc/xgcc -B/opt/local/var/macports/build/_opt_local_var_macports_sources_rsync.macports.org_release_ports_lang_gcc47/libstdcxx/work/build/./gcc/ -B/opt/local/ppc-apple-darwin9/bin/ -B/opt/local/ppc-apple-darwin9/lib/ -isystem /opt/local/ppc-apple-darwin9/include -isystem /opt/local/ppc-apple-darwin9/sys-include    -c -g -O2  conftest.c >&5
111xgcc: internal compiler error: Segmentation fault (program cc1)
112Please submit a full bug report,
113with preprocessed source if appropriate.
114See <https://trac.macports.org/newticket> for instructions.
115configure:3588: $? = 4
116configure: failed program was:
117| /* confdefs.h */
118| #define PACKAGE_NAME "GNU C Runtime Library"
119| #define PACKAGE_TARNAME "libgcc"
120| #define PACKAGE_VERSION "1.0"
121| #define PACKAGE_STRING "GNU C Runtime Library 1.0"
122| #define PACKAGE_BUGREPORT ""
123| #define PACKAGE_URL "http://www.gnu.org/software/libgcc/"
124| /* end confdefs.h.  */
125|
126| int
127| main ()
128| {
129|
130|   ;
131|   return 0;
132| }
133configure:3602: error: in `/opt/local/var/macports/build/_opt_local_var_macports_sources_rsync.macports.org_release_ports_lang_gcc47/libstdcxx/work/build/ppc-apple-darwin9/libgcc':
134configure:3605: error: cannot compute suffix of object files: cannot compile
135See `config.log' for more details.
136
137## ---------------- ##
138## Cache variables. ##
139## ---------------- ##
140
141ac_cv_build=powerpc-apple-darwin9
142ac_cv_env_CC_set=set
143ac_cv_env_CC_value='/opt/local/var/macports/build/_opt_local_var_macports_sources_rsync.macports.org_release_ports_lang_gcc47/libstdcxx/work/build/./gcc/xgcc -B/opt/local/var/macports/build/_opt_local_var_macports_sources_rsync.macports.org_release_ports_lang_gcc47/libstdcxx/work/build/./gcc/ -B/opt/local/ppc-apple-darwin9/bin/ -B/opt/local/ppc-apple-darwin9/lib/ -isystem /opt/local/ppc-apple-darwin9/include -isystem /opt/local/ppc-apple-darwin9/sys-include   '
144ac_cv_env_CFLAGS_set=set
145ac_cv_env_CFLAGS_value='-g -O2'
146ac_cv_env_CPPFLAGS_set=set
147ac_cv_env_CPPFLAGS_value=
148ac_cv_env_CPP_set=set
149ac_cv_env_CPP_value='/opt/local/bin/gcc-mp-4.5 -E'
150ac_cv_env_LDFLAGS_set=set
151ac_cv_env_LDFLAGS_value=
152ac_cv_env_LIBS_set=
153ac_cv_env_LIBS_value=
154ac_cv_env_build_alias_set=set
155ac_cv_env_build_alias_value=ppc-apple-darwin9
156ac_cv_env_host_alias_set=set
157ac_cv_env_host_alias_value=ppc-apple-darwin9
158ac_cv_env_target_alias_set=set
159ac_cv_env_target_alias_value=ppc-apple-darwin9
160ac_cv_host=powerpc-apple-darwin9
161ac_cv_prog_AR=/opt/local/bin/ar
162ac_cv_prog_AWK=gawk
163ac_cv_prog_CC='/opt/local/var/macports/build/_opt_local_var_macports_sources_rsync.macports.org_release_ports_lang_gcc47/libstdcxx/work/build/./gcc/xgcc -B/opt/local/var/macports/build/_opt_local_var_macports_sources_rsync.macports.org_release_ports_lang_gcc47/libstdcxx/work/build/./gcc/ -B/opt/local/ppc-apple-darwin9/bin/ -B/opt/local/ppc-apple-darwin9/lib/ -isystem /opt/local/ppc-apple-darwin9/include -isystem /opt/local/ppc-apple-darwin9/sys-include   '
164ac_cv_prog_LIPO=lipo
165ac_cv_prog_NM=/opt/local/var/macports/build/_opt_local_var_macports_sources_rsync.macports.org_release_ports_lang_gcc47/libstdcxx/work/build/./gcc/nm
166ac_cv_prog_RANLIB=/opt/local/bin/ranlib
167ac_cv_prog_STRIP=/opt/local/bin/strip
168
169## ----------------- ##
170## Output variables. ##
171## ----------------- ##
172
173AR='/opt/local/bin/ar'
174AWK='gawk'
175CC='/opt/local/var/macports/build/_opt_local_var_macports_sources_rsync.macports.org_release_ports_lang_gcc47/libstdcxx/work/build/./gcc/xgcc -B/opt/local/var/macports/build/_opt_local_var_macports_sources_rsync.macports.org_release_ports_lang_gcc47/libstdcxx/work/build/./gcc/ -B/opt/local/ppc-apple-darwin9/bin/ -B/opt/local/ppc-apple-darwin9/lib/ -isystem /opt/local/ppc-apple-darwin9/include -isystem /opt/local/ppc-apple-darwin9/sys-include   '
176CFLAGS='-g -O2'
177CPP='/opt/local/bin/gcc-mp-4.5 -E'
178CPPFLAGS=''
179DEFS=''
180ECHO_C='\c'
181ECHO_N=''
182ECHO_T=''
183EXEEXT=''
184INSTALL_DATA='/usr/bin/install -c -m 644'
185INSTALL_PROGRAM='/usr/bin/install -c'
186INSTALL_SCRIPT='/usr/bin/install -c'
187LDFLAGS=''
188LIBOBJS=''
189LIBS=''
190LIPO='lipo'
191LN_S='ln -s'
192LTLIBOBJS=''
193MAINT='#'
194NM='/opt/local/var/macports/build/_opt_local_var_macports_sources_rsync.macports.org_release_ports_lang_gcc47/libstdcxx/work/build/./gcc/nm'
195OBJEXT=''
196PACKAGE_BUGREPORT=''
197PACKAGE_NAME='GNU C Runtime Library'
198PACKAGE_STRING='GNU C Runtime Library 1.0'
199PACKAGE_TARNAME='libgcc'
200PACKAGE_URL='http://www.gnu.org/software/libgcc/'
201PACKAGE_VERSION='1.0'
202PATH_SEPARATOR=':'
203PICFLAG='-fno-common'
204RANLIB='/opt/local/bin/ranlib'
205SHELL='/bin/sh'
206STRIP='/opt/local/bin/strip'
207ac_ct_CC=''
208asm_hidden_op=''
209bindir='${exec_prefix}/bin'
210build='powerpc-apple-darwin9'
211build_alias='ppc-apple-darwin9'
212build_cpu='powerpc'
213build_libsubdir='build-ppc-apple-darwin9'
214build_os='darwin9'
215build_subdir='build-ppc-apple-darwin9'
216build_vendor='apple'
217cpu_type=''
218datadir='${datarootdir}'
219datarootdir='/opt/local/share/gcc-4.7'
220decimal_float=''
221docdir='${datarootdir}/doc/${PACKAGE_TARNAME}'
222double_type_size=''
223dvidir='${docdir}'
224enable_decimal_float=''
225enable_shared='yes'
226exec_prefix='NONE'
227extra_parts=''
228fixed_point=''
229host='powerpc-apple-darwin9'
230host_alias='ppc-apple-darwin9'
231host_cpu='powerpc'
232host_noncanonical='ppc-apple-darwin9'
233host_os='darwin9'
234host_subdir='.'
235host_vendor='apple'
236htmldir='${docdir}'
237includedir='/opt/local/include/gcc47'
238infodir='/opt/local/share/info'
239libdir='${exec_prefix}/lib'
240libexecdir='${exec_prefix}/libexec'
241libgcc_topdir='../../../gcc-4.7.2/libgcc/..'
242localedir='${datarootdir}/locale'
243localstatedir='${prefix}/var'
244long_double_type_size=''
245mandir='/opt/local/share/man'
246oldincludedir='/usr/include'
247pdfdir='${docdir}'
248prefix='/opt/local'
249program_transform_name='s&$&-mp-4.7&'
250psdir='${docdir}'
251sbindir='${exec_prefix}/sbin'
252set_have_cc_tls=''
253set_use_emutls=''
254sfp_machine_header=''
255sharedstatedir='${prefix}/com'
256slibdir='$(libdir)'
257sysconfdir='${prefix}/etc'
258target_alias='ppc-apple-darwin9'
259target_noncanonical='ppc-apple-darwin9'
260target_subdir='ppc-apple-darwin9'
261tm_defines=''
262tm_file=''
263tmake_file=''
264toolexecdir='$(libdir)/gcc-lib/$(target_noncanonical)'
265toolexeclibdir='$(libdir)'
266vis_hide=''
267
268## ----------- ##
269## confdefs.h. ##
270## ----------- ##
271
272/* confdefs.h */
273#define PACKAGE_NAME "GNU C Runtime Library"
274#define PACKAGE_TARNAME "libgcc"
275#define PACKAGE_VERSION "1.0"
276#define PACKAGE_STRING "GNU C Runtime Library 1.0"
277#define PACKAGE_BUGREPORT ""
278#define PACKAGE_URL "http://www.gnu.org/software/libgcc/"
279
280configure: exit 1