Ticket #39839: main.2.log

File main.2.log, 40.2 KB (added by avijitshee88@…, 8 years ago)
Line 
1version:1
2:debug:main epoch: in tree: 1 installed: 1
3:debug:main clang-3.3 3.3_0 exists in the ports tree
4:debug:main clang-3.3 3.3_0 +analyzer+python27 is the latest installed
5:debug:main clang-3.3 3.3_0 +analyzer+python27 is active
6:debug:main Merging existing variants '+analyzer+python27' into variants
7:debug:main new fully merged portvariants: analyzer + python27 +
8:debug:main Changing to port directory: /opt/local/var/macports/sources/rsync.macports.org/release/tarballs/ports/lang/llvm-3.3
9:debug:main OS darwin/12.4.0 (Mac OS X 10.8) arch i386
10:debug:main org.macports.load registered provides 'load', a pre-existing procedure. Target override will not be provided
11:debug:main org.macports.unload registered provides 'unload', a pre-existing procedure. Target override will not be provided
12:debug:main org.macports.distfiles registered provides 'distfiles', a pre-existing procedure. Target override will not be provided
13:debug:main Using group file /opt/local/var/macports/sources/rsync.macports.org/release/tarballs/ports/_resources/port1.0/group/select-1.0.tcl
14:debug:main Reading variant descriptions from /opt/local/var/macports/sources/rsync.macports.org/release/tarballs/ports/_resources/port1.0/variant_descriptions.conf
15:debug:main universal variant already exists, so not adding the default one
16:debug:main Executing variant python27 provides python27
17:debug:main Executing variant analyzer provides analyzer
18:debug:main No need to upgrade! clang-3.3 3.3_0 >= clang-3.3 3.3_0
19:debug:main epoch: in tree: 1 installed: 1
20:debug:main llvm-3.3 3.3_0 exists in the ports tree
21:debug:main llvm-3.3 3.3_0  is the latest installed
22:debug:main llvm-3.3 3.3_0  is active
23:debug:main Merging existing variants '' into variants
24:debug:main new fully merged portvariants:
25:debug:main Changing to port directory: /opt/local/var/macports/sources/rsync.macports.org/release/tarballs/ports/lang/llvm-3.3
26:debug:main OS darwin/12.4.0 (Mac OS X 10.8) arch i386
27:debug:main org.macports.load registered provides 'load', a pre-existing procedure. Target override will not be provided
28:debug:main org.macports.unload registered provides 'unload', a pre-existing procedure. Target override will not be provided
29:debug:main org.macports.distfiles registered provides 'distfiles', a pre-existing procedure. Target override will not be provided
30:debug:main Using group file /opt/local/var/macports/sources/rsync.macports.org/release/tarballs/ports/_resources/port1.0/group/select-1.0.tcl
31:debug:main Reading variant descriptions from /opt/local/var/macports/sources/rsync.macports.org/release/tarballs/ports/_resources/port1.0/variant_descriptions.conf
32:debug:main universal variant already exists, so not adding the default one
33:debug:main No need to upgrade! llvm-3.3 3.3_0 >= llvm-3.3 3.3_0
34:debug:main epoch: in tree: 0 installed: 0
35:debug:main libffi 3.0.13_0 exists in the ports tree
36:debug:main libffi 3.0.13_0  is the latest installed
37:debug:main libffi 3.0.13_0  is active
38:debug:main Merging existing variants '' into variants
39:debug:main new fully merged portvariants:
40:debug:main Changing to port directory: /opt/local/var/macports/sources/rsync.macports.org/release/tarballs/ports/devel/libffi
41:debug:main OS darwin/12.4.0 (Mac OS X 10.8) arch i386
42:debug:main org.macports.load registered provides 'load', a pre-existing procedure. Target override will not be provided
43:debug:main org.macports.unload registered provides 'unload', a pre-existing procedure. Target override will not be provided
44:debug:main org.macports.distfiles registered provides 'distfiles', a pre-existing procedure. Target override will not be provided
45:debug:main Using group file /opt/local/var/macports/sources/rsync.macports.org/release/tarballs/ports/_resources/port1.0/group/muniversal-1.0.tcl
46:debug:main Reading variant descriptions from /opt/local/var/macports/sources/rsync.macports.org/release/tarballs/ports/_resources/port1.0/variant_descriptions.conf
47:debug:main universal variant already exists, so not adding the default one
48:debug:main No need to upgrade! libffi 3.0.13_0 >= libffi 3.0.13_0
49:debug:main epoch: in tree: 0 installed: 0
50:debug:main perl5 5.12.4_0 exists in the ports tree
51:debug:main perl5 5.12.4_0 +perl5_12 is the latest installed
52:debug:main perl5 5.12.4_0 +perl5_12 is active
53:debug:main Merging existing variants '+perl5_12' into variants
54:debug:main new fully merged portvariants: perl5_12 +
55:debug:main Changing to port directory: /opt/local/var/macports/sources/rsync.macports.org/release/tarballs/ports/lang/perl5
56:debug:main OS darwin/12.4.0 (Mac OS X 10.8) arch i386
57:debug:main org.macports.load registered provides 'load', a pre-existing procedure. Target override will not be provided
58:debug:main org.macports.unload registered provides 'unload', a pre-existing procedure. Target override will not be provided
59:debug:main org.macports.distfiles registered provides 'distfiles', a pre-existing procedure. Target override will not be provided
60:debug:main universal_variant is false, so not adding the default universal variant
61:debug:main Executing variant perl5_12 provides perl5_12
62:debug:main No need to upgrade! perl5 5.12.4_0 >= perl5 5.12.4_0
63:debug:main epoch: in tree: 0 installed: 0
64:debug:main perl5.12 5.12.4_2 exists in the ports tree
65:debug:main perl5.12 5.12.4_2  is the latest installed
66:debug:main perl5.12 5.12.4_2  is active
67:debug:main Merging existing variants '' into variants
68:debug:main new fully merged portvariants:
69:debug:main Changing to port directory: /opt/local/var/macports/sources/rsync.macports.org/release/tarballs/ports/lang/perl5.12
70:debug:main OS darwin/12.4.0 (Mac OS X 10.8) arch i386
71:debug:main org.macports.load registered provides 'load', a pre-existing procedure. Target override will not be provided
72:debug:main org.macports.unload registered provides 'unload', a pre-existing procedure. Target override will not be provided
73:debug:main org.macports.distfiles registered provides 'distfiles', a pre-existing procedure. Target override will not be provided
74:debug:main adding the default universal variant
75:debug:main Reading variant descriptions from /opt/local/var/macports/sources/rsync.macports.org/release/tarballs/ports/_resources/port1.0/variant_descriptions.conf
76:debug:main No need to upgrade! perl5.12 5.12.4_2 >= perl5.12 5.12.4_2
77:debug:main epoch: in tree: 0 installed: 0
78:debug:main gdbm 1.10_2 exists in the ports tree
79:debug:main gdbm 1.10_2  is the latest installed
80:debug:main gdbm 1.10_2  is active
81:debug:main Merging existing variants '' into variants
82:debug:main new fully merged portvariants:
83:debug:main Changing to port directory: /opt/local/var/macports/sources/rsync.macports.org/release/tarballs/ports/databases/gdbm
84:debug:main OS darwin/12.4.0 (Mac OS X 10.8) arch i386
85:debug:main org.macports.load registered provides 'load', a pre-existing procedure. Target override will not be provided
86:debug:main org.macports.unload registered provides 'unload', a pre-existing procedure. Target override will not be provided
87:debug:main org.macports.distfiles registered provides 'distfiles', a pre-existing procedure. Target override will not be provided
88:debug:main adding the default universal variant
89:debug:main Reading variant descriptions from /opt/local/var/macports/sources/rsync.macports.org/release/tarballs/ports/_resources/port1.0/variant_descriptions.conf
90:debug:main No need to upgrade! gdbm 1.10_2 >= gdbm 1.10_2
91:debug:main epoch: in tree: 0 installed: 0
92:debug:main gettext 0.18.3_0 exists in the ports tree
93:debug:main gettext 0.18.3_0  is the latest installed
94:debug:main gettext 0.18.3_0  is active
95:debug:main Merging existing variants '' into variants
96:debug:main new fully merged portvariants:
97:debug:main Changing to port directory: /opt/local/var/macports/sources/rsync.macports.org/release/tarballs/ports/devel/gettext
98:debug:main OS darwin/12.4.0 (Mac OS X 10.8) arch i386
99:debug:main org.macports.load registered provides 'load', a pre-existing procedure. Target override will not be provided
100:debug:main org.macports.unload registered provides 'unload', a pre-existing procedure. Target override will not be provided
101:debug:main org.macports.distfiles registered provides 'distfiles', a pre-existing procedure. Target override will not be provided
102:debug:main Using group file /opt/local/var/macports/sources/rsync.macports.org/release/tarballs/ports/_resources/port1.0/group/compiler_blacklist_versions-1.0.tcl
103:debug:main Using group file /opt/local/var/macports/sources/rsync.macports.org/release/tarballs/ports/_resources/port1.0/group/muniversal-1.0.tcl
104:debug:main Reading variant descriptions from /opt/local/var/macports/sources/rsync.macports.org/release/tarballs/ports/_resources/port1.0/variant_descriptions.conf
105:debug:main compiler clang 425.0.28 not blacklisted because does not match {clang < 211.10.1}
106:debug:main universal variant already exists, so not adding the default one
107:debug:main No need to upgrade! gettext 0.18.3_0 >= gettext 0.18.3_0
108:debug:main epoch: in tree: 0 installed: 0
109:debug:main expat 2.1.0_0 exists in the ports tree
110:debug:main expat 2.1.0_0  is the latest installed
111:debug:main expat 2.1.0_0  is active
112:debug:main Merging existing variants '' into variants
113:debug:main new fully merged portvariants:
114:debug:main Changing to port directory: /opt/local/var/macports/sources/rsync.macports.org/release/tarballs/ports/textproc/expat
115:debug:main OS darwin/12.4.0 (Mac OS X 10.8) arch i386
116:debug:main org.macports.load registered provides 'load', a pre-existing procedure. Target override will not be provided
117:debug:main org.macports.unload registered provides 'unload', a pre-existing procedure. Target override will not be provided
118:debug:main org.macports.distfiles registered provides 'distfiles', a pre-existing procedure. Target override will not be provided
119:debug:main adding the default universal variant
120:debug:main Reading variant descriptions from /opt/local/var/macports/sources/rsync.macports.org/release/tarballs/ports/_resources/port1.0/variant_descriptions.conf
121:debug:main No need to upgrade! expat 2.1.0_0 >= expat 2.1.0_0
122:debug:main epoch: in tree: 0 installed: 0
123:debug:main libiconv 1.14_0 exists in the ports tree
124:debug:main libiconv 1.14_0  is the latest installed
125:debug:main libiconv 1.14_0  is active
126:debug:main Merging existing variants '' into variants
127:debug:main new fully merged portvariants:
128:debug:main Changing to port directory: /opt/local/var/macports/sources/rsync.macports.org/release/tarballs/ports/textproc/libiconv
129:debug:main OS darwin/12.4.0 (Mac OS X 10.8) arch i386
130:debug:main org.macports.load registered provides 'load', a pre-existing procedure. Target override will not be provided
131:debug:main org.macports.unload registered provides 'unload', a pre-existing procedure. Target override will not be provided
132:debug:main org.macports.distfiles registered provides 'distfiles', a pre-existing procedure. Target override will not be provided
133:debug:main Using group file /opt/local/var/macports/sources/rsync.macports.org/release/tarballs/ports/_resources/port1.0/group/muniversal-1.0.tcl
134:debug:main Reading variant descriptions from /opt/local/var/macports/sources/rsync.macports.org/release/tarballs/ports/_resources/port1.0/variant_descriptions.conf
135:debug:main universal variant already exists, so not adding the default one
136:debug:main No need to upgrade! libiconv 1.14_0 >= libiconv 1.14_0
137:debug:main epoch: in tree: 0 installed: 0
138:debug:main ncurses 5.9_2 exists in the ports tree
139:debug:main ncurses 5.9_2  is the latest installed
140:debug:main ncurses 5.9_2  is active
141:debug:main Merging existing variants '' into variants
142:debug:main new fully merged portvariants:
143:debug:main Changing to port directory: /opt/local/var/macports/sources/rsync.macports.org/release/tarballs/ports/devel/ncurses
144:debug:main OS darwin/12.4.0 (Mac OS X 10.8) arch i386
145:debug:main org.macports.load registered provides 'load', a pre-existing procedure. Target override will not be provided
146:debug:main org.macports.unload registered provides 'unload', a pre-existing procedure. Target override will not be provided
147:debug:main org.macports.distfiles registered provides 'distfiles', a pre-existing procedure. Target override will not be provided
148:debug:main adding the default universal variant
149:debug:main Reading variant descriptions from /opt/local/var/macports/sources/rsync.macports.org/release/tarballs/ports/_resources/port1.0/variant_descriptions.conf
150:debug:main No need to upgrade! ncurses 5.9_2 >= ncurses 5.9_2
151:debug:main epoch: in tree: 0 installed: 0
152:debug:main llvm_select 0.2_0 exists in the ports tree
153:debug:main llvm_select 0.2_0  is the latest installed
154:debug:main llvm_select 0.2_0  is active
155:debug:main Merging existing variants '' into variants
156:debug:main new fully merged portvariants:
157:debug:main Changing to port directory: /opt/local/var/macports/sources/rsync.macports.org/release/tarballs/ports/sysutils/llvm_select
158:debug:main OS darwin/12.4.0 (Mac OS X 10.8) arch i386
159:debug:main org.macports.load registered provides 'load', a pre-existing procedure. Target override will not be provided
160:debug:main org.macports.unload registered provides 'unload', a pre-existing procedure. Target override will not be provided
161:debug:main org.macports.distfiles registered provides 'distfiles', a pre-existing procedure. Target override will not be provided
162:debug:main Using group file /opt/local/var/macports/sources/rsync.macports.org/release/tarballs/ports/_resources/port1.0/group/select-1.0.tcl
163:debug:main universal_variant is false, so not adding the default universal variant
164:debug:main No need to upgrade! llvm_select 0.2_0 >= llvm_select 0.2_0
165:debug:main epoch: in tree: 0 installed: 0
166:debug:main clang_select 0.1_0 exists in the ports tree
167:debug:main clang_select 0.1_0  is the latest installed
168:debug:main clang_select 0.1_0  is active
169:debug:main Merging existing variants '' into variants
170:debug:main new fully merged portvariants:
171:debug:main Changing to port directory: /opt/local/var/macports/sources/rsync.macports.org/release/tarballs/ports/sysutils/clang_select
172:debug:main OS darwin/12.4.0 (Mac OS X 10.8) arch i386
173:debug:main org.macports.load registered provides 'load', a pre-existing procedure. Target override will not be provided
174:debug:main org.macports.unload registered provides 'unload', a pre-existing procedure. Target override will not be provided
175:debug:main org.macports.distfiles registered provides 'distfiles', a pre-existing procedure. Target override will not be provided
176:debug:main Using group file /opt/local/var/macports/sources/rsync.macports.org/release/tarballs/ports/_resources/port1.0/group/select-1.0.tcl
177:debug:main universal_variant is false, so not adding the default universal variant
178:debug:main No need to upgrade! clang_select 0.1_0 >= clang_select 0.1_0
179:debug:main epoch: in tree: 0 installed: 0
180:debug:main ld64 136_2 exists in the ports tree
181:debug:main ld64 136_2 +llvm33 is the latest installed
182:debug:main ld64 136_2 +llvm33 is active
183:debug:main Merging existing variants '+llvm33' into variants
184:debug:main new fully merged portvariants: llvm33 +
185:debug:main Changing to port directory: /opt/local/var/macports/sources/rsync.macports.org/release/tarballs/ports/devel/ld64
186:debug:main OS darwin/12.4.0 (Mac OS X 10.8) arch i386
187:debug:main org.macports.load registered provides 'load', a pre-existing procedure. Target override will not be provided
188:debug:main org.macports.unload registered provides 'unload', a pre-existing procedure. Target override will not be provided
189:debug:main org.macports.distfiles registered provides 'distfiles', a pre-existing procedure. Target override will not be provided
190:debug:main Reading variant descriptions from /opt/local/var/macports/sources/rsync.macports.org/release/tarballs/ports/_resources/port1.0/variant_descriptions.conf
191:debug:main universal variant already exists, so not adding the default one
192:debug:main Executing variant llvm33 provides llvm33
193:debug:main No need to upgrade! ld64 136_2 >= ld64 136_2
194:debug:main epoch: in tree: 2 installed: 2
195:debug:main python27 2.7.5_0 exists in the ports tree
196:debug:main python27 2.7.5_0  is the latest installed
197:debug:main python27 2.7.5_0  is active
198:debug:main Merging existing variants '' into variants
199:debug:main new fully merged portvariants:
200:debug:main Changing to port directory: /opt/local/var/macports/sources/rsync.macports.org/release/tarballs/ports/lang/python27
201:debug:main OS darwin/12.4.0 (Mac OS X 10.8) arch i386
202:debug:main org.macports.load registered provides 'load', a pre-existing procedure. Target override will not be provided
203:debug:main org.macports.unload registered provides 'unload', a pre-existing procedure. Target override will not be provided
204:debug:main org.macports.distfiles registered provides 'distfiles', a pre-existing procedure. Target override will not be provided
205:debug:main Using group file /opt/local/var/macports/sources/rsync.macports.org/release/tarballs/ports/_resources/port1.0/group/select-1.0.tcl
206:debug:main Reading variant descriptions from /opt/local/var/macports/sources/rsync.macports.org/release/tarballs/ports/_resources/port1.0/variant_descriptions.conf
207:debug:main universal variant already exists, so not adding the default one
208:debug:main No need to upgrade! python27 2.7.5_0 >= python27 2.7.5_0
209:debug:main epoch: in tree: 0 installed: 0
210:debug:main zlib 1.2.8_0 exists in the ports tree
211:debug:main zlib 1.2.8_0  is the latest installed
212:debug:main zlib 1.2.8_0  is active
213:debug:main Merging existing variants '' into variants
214:debug:main new fully merged portvariants:
215:debug:main Changing to port directory: /opt/local/var/macports/sources/rsync.macports.org/release/tarballs/ports/archivers/zlib
216:debug:main OS darwin/12.4.0 (Mac OS X 10.8) arch i386
217:debug:main org.macports.load registered provides 'load', a pre-existing procedure. Target override will not be provided
218:debug:main org.macports.unload registered provides 'unload', a pre-existing procedure. Target override will not be provided
219:debug:main org.macports.distfiles registered provides 'distfiles', a pre-existing procedure. Target override will not be provided
220:debug:main Using group file /opt/local/var/macports/sources/rsync.macports.org/release/tarballs/ports/_resources/port1.0/group/xcodeversion-1.0.tcl
221:debug:main adding the default universal variant
222:debug:main Reading variant descriptions from /opt/local/var/macports/sources/rsync.macports.org/release/tarballs/ports/_resources/port1.0/variant_descriptions.conf
223:debug:main No need to upgrade! zlib 1.2.8_0 >= zlib 1.2.8_0
224:debug:main epoch: in tree: 1 installed: 1
225:debug:main openssl 1.0.1e_1 exists in the ports tree
226:debug:main openssl 1.0.1e_1  is the latest installed
227:debug:main openssl 1.0.1e_1  is active
228:debug:main Merging existing variants '' into variants
229:debug:main new fully merged portvariants:
230:debug:main Changing to port directory: /opt/local/var/macports/sources/rsync.macports.org/release/tarballs/ports/devel/openssl
231:debug:main OS darwin/12.4.0 (Mac OS X 10.8) arch i386
232:debug:main org.macports.load registered provides 'load', a pre-existing procedure. Target override will not be provided
233:debug:main org.macports.unload registered provides 'unload', a pre-existing procedure. Target override will not be provided
234:debug:main org.macports.distfiles registered provides 'distfiles', a pre-existing procedure. Target override will not be provided
235:debug:main Using group file /opt/local/var/macports/sources/rsync.macports.org/release/tarballs/ports/_resources/port1.0/group/muniversal-1.0.tcl
236:debug:main Reading variant descriptions from /opt/local/var/macports/sources/rsync.macports.org/release/tarballs/ports/_resources/port1.0/variant_descriptions.conf
237:debug:main universal variant already exists, so not adding the default one
238:debug:main No need to upgrade! openssl 1.0.1e_1 >= openssl 1.0.1e_1
239:debug:main epoch: in tree: 0 installed: 0
240:debug:main sqlite3 3.7.17_0 exists in the ports tree
241:debug:main sqlite3 3.7.17_0  is the latest installed
242:debug:main sqlite3 3.7.17_0  is active
243:debug:main Merging existing variants '' into variants
244:debug:main new fully merged portvariants:
245:debug:main Changing to port directory: /opt/local/var/macports/sources/rsync.macports.org/release/tarballs/ports/databases/sqlite3
246:debug:main OS darwin/12.4.0 (Mac OS X 10.8) arch i386
247:debug:main org.macports.load registered provides 'load', a pre-existing procedure. Target override will not be provided
248:debug:main org.macports.unload registered provides 'unload', a pre-existing procedure. Target override will not be provided
249:debug:main org.macports.distfiles registered provides 'distfiles', a pre-existing procedure. Target override will not be provided
250:debug:main adding the default universal variant
251:debug:main Reading variant descriptions from /opt/local/var/macports/sources/rsync.macports.org/release/tarballs/ports/_resources/port1.0/variant_descriptions.conf
252:debug:main No need to upgrade! sqlite3 3.7.17_0 >= sqlite3 3.7.17_0
253:debug:main epoch: in tree: 20090923 installed: 20090923
254:debug:main libedit 20121213-3.0_0 exists in the ports tree
255:debug:main libedit 20121213-3.0_0  is the latest installed
256:debug:main libedit 20121213-3.0_0  is active
257:debug:main Merging existing variants '' into variants
258:debug:main new fully merged portvariants:
259:debug:main Changing to port directory: /opt/local/var/macports/sources/rsync.macports.org/release/tarballs/ports/devel/libedit
260:debug:main OS darwin/12.4.0 (Mac OS X 10.8) arch i386
261:debug:main org.macports.load registered provides 'load', a pre-existing procedure. Target override will not be provided
262:debug:main org.macports.unload registered provides 'unload', a pre-existing procedure. Target override will not be provided
263:debug:main org.macports.distfiles registered provides 'distfiles', a pre-existing procedure. Target override will not be provided
264:debug:main Using group file /opt/local/var/macports/sources/rsync.macports.org/release/tarballs/ports/_resources/port1.0/group/muniversal-1.0.tcl
265:debug:main Reading variant descriptions from /opt/local/var/macports/sources/rsync.macports.org/release/tarballs/ports/_resources/port1.0/variant_descriptions.conf
266:debug:main universal variant already exists, so not adding the default one
267:debug:main No need to upgrade! libedit 20121213-3.0_0 >= libedit 20121213-3.0_0
268:debug:main epoch: in tree: 0 installed: 0
269:debug:main db46 4.6.21_8 exists in the ports tree
270:debug:main db46 4.6.21_8  is the latest installed
271:debug:main db46 4.6.21_8  is active
272:debug:main Merging existing variants '' into variants
273:debug:main new fully merged portvariants:
274:debug:main Changing to port directory: /opt/local/var/macports/sources/rsync.macports.org/release/tarballs/ports/databases/db46
275:debug:main OS darwin/12.4.0 (Mac OS X 10.8) arch i386
276:debug:main org.macports.load registered provides 'load', a pre-existing procedure. Target override will not be provided
277:debug:main org.macports.unload registered provides 'unload', a pre-existing procedure. Target override will not be provided
278:debug:main org.macports.distfiles registered provides 'distfiles', a pre-existing procedure. Target override will not be provided
279:debug:main Using group file /opt/local/var/macports/sources/rsync.macports.org/release/tarballs/ports/_resources/port1.0/group/muniversal-1.0.tcl
280:debug:main Reading variant descriptions from /opt/local/var/macports/sources/rsync.macports.org/release/tarballs/ports/_resources/port1.0/variant_descriptions.conf
281:debug:main Using group file /opt/local/var/macports/sources/rsync.macports.org/release/tarballs/ports/_resources/port1.0/group/select-1.0.tcl
282:debug:main universal variant already exists, so not adding the default one
283:debug:main No need to upgrade! db46 4.6.21_8 >= db46 4.6.21_8
284:debug:main epoch: in tree: 0 installed: 0
285:debug:main db_select 0.1_2 exists in the ports tree
286:debug:main db_select 0.1_2  is the latest installed
287:debug:main db_select 0.1_2  is active
288:debug:main Merging existing variants '' into variants
289:debug:main new fully merged portvariants:
290:debug:main Changing to port directory: /opt/local/var/macports/sources/rsync.macports.org/release/tarballs/ports/sysutils/db_select
291:debug:main OS darwin/12.4.0 (Mac OS X 10.8) arch i386
292:debug:main org.macports.load registered provides 'load', a pre-existing procedure. Target override will not be provided
293:debug:main org.macports.unload registered provides 'unload', a pre-existing procedure. Target override will not be provided
294:debug:main org.macports.distfiles registered provides 'distfiles', a pre-existing procedure. Target override will not be provided
295:debug:main Using group file /opt/local/var/macports/sources/rsync.macports.org/release/tarballs/ports/_resources/port1.0/group/select-1.0.tcl
296:debug:main universal_variant is false, so not adding the default universal variant
297:debug:main No need to upgrade! db_select 0.1_2 >= db_select 0.1_2
298:debug:main epoch: in tree: 0 installed: 0
299:debug:main bzip2 1.0.6_0 exists in the ports tree
300:debug:main bzip2 1.0.6_0  is the latest installed
301:debug:main bzip2 1.0.6_0  is active
302:debug:main Merging existing variants '' into variants
303:debug:main new fully merged portvariants:
304:debug:main Changing to port directory: /opt/local/var/macports/sources/rsync.macports.org/release/tarballs/ports/archivers/bzip2
305:debug:main OS darwin/12.4.0 (Mac OS X 10.8) arch i386
306:debug:main org.macports.load registered provides 'load', a pre-existing procedure. Target override will not be provided
307:debug:main org.macports.unload registered provides 'unload', a pre-existing procedure. Target override will not be provided
308:debug:main org.macports.distfiles registered provides 'distfiles', a pre-existing procedure. Target override will not be provided
309:debug:main Reading variant descriptions from /opt/local/var/macports/sources/rsync.macports.org/release/tarballs/ports/_resources/port1.0/variant_descriptions.conf
310:debug:main universal variant already exists, so not adding the default one
311:debug:main No need to upgrade! bzip2 1.0.6_0 >= bzip2 1.0.6_0
312:debug:main epoch: in tree: 0 installed: 0
313:debug:main python_select 0.3_2 exists in the ports tree
314:debug:main python_select 0.3_2  is the latest installed
315:debug:main python_select 0.3_2  is active
316:debug:main Merging existing variants '' into variants
317:debug:main new fully merged portvariants:
318:debug:main Changing to port directory: /opt/local/var/macports/sources/rsync.macports.org/release/tarballs/ports/sysutils/python_select
319:debug:main OS darwin/12.4.0 (Mac OS X 10.8) arch i386
320:debug:main org.macports.load registered provides 'load', a pre-existing procedure. Target override will not be provided
321:debug:main org.macports.unload registered provides 'unload', a pre-existing procedure. Target override will not be provided
322:debug:main org.macports.distfiles registered provides 'distfiles', a pre-existing procedure. Target override will not be provided
323:debug:main Using group file /opt/local/var/macports/sources/rsync.macports.org/release/tarballs/ports/_resources/port1.0/group/select-1.0.tcl
324:debug:main universal_variant is false, so not adding the default universal variant
325:debug:main No need to upgrade! python_select 0.3_2 >= python_select 0.3_2
326:msg:main --->  Computing dependencies for atlas:info:main .:debug:main atlas has no conflicts
327:debug:main Searching for dependency: clang-3.3
328:debug:main Found Dependency: receipt exists for clang-3.3
329:msg:main
330:debug:main Executing org.macports.main (atlas)
331:debug:main changing euid/egid - current euid: 0 - current egid: 0
332:debug:main egid changed to: 501
333:debug:main euid changed to: 502
334:debug:archivefetch archivefetch phase started at Tue Jul 23 20:38:03 CEST 2013
335:debug:archivefetch Executing org.macports.archivefetch (atlas)
336:debug:archivefetch Privilege de-escalation not attempted as not running as root.
337:debug:fetch fetch phase started at Tue Jul 23 20:38:03 CEST 2013
338:notice:fetch --->  Fetching distfiles for atlas
339:debug:fetch Executing org.macports.fetch (atlas)
340:debug:fetch Privilege de-escalation not attempted as not running as root.
341:debug:checksum checksum phase started at Tue Jul 23 20:38:03 CEST 2013
342:notice:checksum --->  Verifying checksum(s) for atlas
343:debug:checksum Executing org.macports.checksum (atlas)
344:info:checksum --->  Checksumming atlas3.10.1.tar.bz2
345:debug:checksum Correct (rmd160) checksum for atlas3.10.1.tar.bz2
346:debug:checksum Correct (sha256) checksum for atlas3.10.1.tar.bz2
347:info:checksum --->  Checksumming lapack-3.4.2.tgz
348:debug:checksum Correct (rmd160) checksum for lapack-3.4.2.tgz
349:debug:checksum Correct (sha256) checksum for lapack-3.4.2.tgz
350:debug:checksum Privilege de-escalation not attempted as not running as root.
351:debug:extract extract phase started at Tue Jul 23 20:38:04 CEST 2013
352:notice:extract --->  Extracting atlas
353:debug:extract Executing org.macports.extract (atlas)
354:debug:extract Privilege de-escalation not attempted as not running as root.
355:debug:patch patch phase started at Tue Jul 23 20:38:09 CEST 2013
356:debug:patch Executing org.macports.patch (atlas)
357:notice:patch --->  Applying patches to atlas
358:info:patch --->  Applying patch-emit_mm_c.diff
359:debug:patch Environment: CPATH='/opt/local/include' CC_PRINT_OPTIONS_FILE='/opt/local/var/macports/build/_opt_local_var_macports_sources_rsync.macports.org_release_tarballs_ports_math_atlas/atlas/work/.CC_PRINT_OPTIONS' LIBRARY_PATH='/opt/local/lib' CC_PRINT_OPTIONS='YES' MACOSX_DEPLOYMENT_TARGET='10.8'
360:debug:patch Assembled command: 'cd "/opt/local/var/macports/build/_opt_local_var_macports_sources_rsync.macports.org_release_tarballs_ports_math_atlas/atlas/work/atlas-3.10.1" && /usr/bin/patch -p0'
361:debug:patch Executing command line:  cd "/opt/local/var/macports/build/_opt_local_var_macports_sources_rsync.macports.org_release_tarballs_ports_math_atlas/atlas/work/atlas-3.10.1" && /usr/bin/patch -p0 < '/opt/local/var/macports/sources/rsync.macports.org/release/tarballs/ports/math/atlas/files/patch-emit_mm_c.diff'
362:info:patch patching file tune/blas/gemm/emit_mm.c
363:info:patch --->  Applying patch-ATL_cmm4x4x128_av_c.diff
364:debug:patch Environment: CPATH='/opt/local/include' CC_PRINT_OPTIONS_FILE='/opt/local/var/macports/build/_opt_local_var_macports_sources_rsync.macports.org_release_tarballs_ports_math_atlas/atlas/work/.CC_PRINT_OPTIONS' LIBRARY_PATH='/opt/local/lib' CC_PRINT_OPTIONS='YES' MACOSX_DEPLOYMENT_TARGET='10.8'
365:debug:patch Assembled command: 'cd "/opt/local/var/macports/build/_opt_local_var_macports_sources_rsync.macports.org_release_tarballs_ports_math_atlas/atlas/work/atlas-3.10.1" && /usr/bin/patch -p0'
366:debug:patch Executing command line:  cd "/opt/local/var/macports/build/_opt_local_var_macports_sources_rsync.macports.org_release_tarballs_ports_math_atlas/atlas/work/atlas-3.10.1" && /usr/bin/patch -p0 < '/opt/local/var/macports/sources/rsync.macports.org/release/tarballs/ports/math/atlas/files/patch-ATL_cmm4x4x128_av_c.diff'
367:info:patch patching file tune/blas/gemm/CASES/ATL_cmm4x4x128_av.c
368:debug:patch Executing proc-post-org.macports.patch-patch-0
369:debug:patch Privilege de-escalation not attempted as not running as root.
370:debug:configure configure phase started at Tue Jul 23 20:38:09 CEST 2013
371:notice:configure --->  Configuring atlas
372:debug:configure Using compiler 'MacPorts clang 3.3'
373:debug:configure Executing proc-pre-org.macports.configure-configure-0
374:msg:configure Selected C compiler: /opt/local/bin/clang-mp-3.3
375:msg:configure Selected F77 compiler: gfortran48
376:debug:configure Executing reinplace: /usr/bin/sed -E {s|GOODGCC =.*|GOODGCC = /opt/local/bin/clang-mp-3.3");|} < /opt/local/var/macports/build/_opt_local_var_macports_sources_rsync.macports.org_release_tarballs_ports_math_atlas/atlas/work/atlas-3.10.1/CONFIG/src/SpewMakeInc.c >@ file10
377:debug:configure euid/egid changed to: 0/0
378:debug:configure chowned /opt/local/var/macports/build/_opt_local_var_macports_sources_rsync.macports.org_release_tarballs_ports_math_atlas/atlas/work/atlas-3.10.1/CONFIG/src/SpewMakeInc.c to macports
379:debug:configure euid/egid changed to: 502/501
380:debug:configure euid/egid changed to: 0/0
381:debug:configure setting attributes on /opt/local/var/macports/build/_opt_local_var_macports_sources_rsync.macports.org_release_tarballs_ports_math_atlas/atlas/work/atlas-3.10.1/CONFIG/src/SpewMakeInc.c
382:debug:configure euid/egid changed to: 502/501
383:debug:configure Executing reinplace: /usr/bin/sed s|cc=gcc|cc=/opt/local/bin/clang-mp-3.3|g < /opt/local/var/macports/build/_opt_local_var_macports_sources_rsync.macports.org_release_tarballs_ports_math_atlas/atlas/work/atlas-3.10.1/configure >@ file10
384:debug:configure euid/egid changed to: 0/0
385:debug:configure chowned /opt/local/var/macports/build/_opt_local_var_macports_sources_rsync.macports.org_release_tarballs_ports_math_atlas/atlas/work/atlas-3.10.1/configure to macports
386:debug:configure euid/egid changed to: 502/501
387:debug:configure euid/egid changed to: 0/0
388:debug:configure setting attributes on /opt/local/var/macports/build/_opt_local_var_macports_sources_rsync.macports.org_release_tarballs_ports_math_atlas/atlas/work/atlas-3.10.1/configure
389:debug:configure euid/egid changed to: 502/501
390:debug:configure Executing reinplace: /usr/bin/sed s|-no-cpp-precomp||g < /opt/local/var/macports/build/_opt_local_var_macports_sources_rsync.macports.org_release_tarballs_ports_math_atlas/atlas/work/atlas-3.10.1/CONFIG/src/atlcomp.txt >@ file10
391:debug:configure euid/egid changed to: 0/0
392:debug:configure chowned /opt/local/var/macports/build/_opt_local_var_macports_sources_rsync.macports.org_release_tarballs_ports_math_atlas/atlas/work/atlas-3.10.1/CONFIG/src/atlcomp.txt to macports
393:debug:configure euid/egid changed to: 502/501
394:debug:configure euid/egid changed to: 0/0
395:debug:configure setting attributes on /opt/local/var/macports/build/_opt_local_var_macports_sources_rsync.macports.org_release_tarballs_ports_math_atlas/atlas/work/atlas-3.10.1/CONFIG/src/atlcomp.txt
396:debug:configure euid/egid changed to: 502/501
397:debug:configure Executing org.macports.configure (atlas)
398:debug:configure Environment: CPATH='/opt/local/include' CFLAGS='-pipe -O2 -arch x86_64' CPPFLAGS='-I/opt/local/include' CXXFLAGS='-pipe -O2 -arch x86_64' LIBRARY_PATH='/opt/local/lib' MACOSX_DEPLOYMENT_TARGET='10.8' CXX='/opt/local/bin/clang++-mp-3.3' CC_PRINT_OPTIONS_FILE='/opt/local/var/macports/build/_opt_local_var_macports_sources_rsync.macports.org_release_tarballs_ports_math_atlas/atlas/work/.CC_PRINT_OPTIONS' F90FLAGS='-pipe -O2 -m64' LDFLAGS='-L/opt/local/lib -arch x86_64' FCFLAGS='-pipe -O2 -m64' OBJC='/opt/local/bin/clang-mp-3.3' INSTALL='/usr/bin/install -c' OBJCFLAGS='-pipe -O2 -arch x86_64' FFLAGS='-pipe -O2 -m64' F77='/opt/local/bin/gfortran-mp-4.8' CC_PRINT_OPTIONS='YES' CC='/opt/local/bin/clang-mp-3.3'
399:debug:configure Assembled command: 'cd "/opt/local/var/macports/build/_opt_local_var_macports_sources_rsync.macports.org_release_tarballs_ports_math_atlas/atlas/work/atlas-3.10.1/build" && ../configure --prefix=/opt/local --with-netlib-lapack-tarfile=/opt/local/var/macports/distfiles/atlas/lapack-3.4.2.tgz -O 12 -v 5 --dylibs -Si omp 0 -C acg /opt/local/bin/clang-mp-3.3 -F acg '-O3 -fomit-frame-pointer -fPIC -march=native -mavx' -C if /opt/local/bin/gfortran-mp-4.8 -F if '-fomit-frame-pointer -mfpmath=sse -O3 -fno-schedule-insns2 -fPIC -msse4.2' -Ss f77lib /opt/local/lib/gcc48/libgfortran.dylib -b 64 -D c -DPentiumCPS=2700'
400:debug:configure Executing command line:  cd "/opt/local/var/macports/build/_opt_local_var_macports_sources_rsync.macports.org_release_tarballs_ports_math_atlas/atlas/work/atlas-3.10.1/build" && ../configure --prefix=/opt/local --with-netlib-lapack-tarfile=/opt/local/var/macports/distfiles/atlas/lapack-3.4.2.tgz -O 12 -v 5 --dylibs -Si omp 0 -C acg /opt/local/bin/clang-mp-3.3 -F acg '-O3 -fomit-frame-pointer -fPIC -march=native -mavx' -C if /opt/local/bin/gfortran-mp-4.8 -F if '-fomit-frame-pointer -mfpmath=sse -O3 -fno-schedule-insns2 -fPIC -msse4.2' -Ss f77lib /opt/local/lib/gcc48/libgfortran.dylib -b 64 -D c -DPentiumCPS=2700
401:info:configure /opt/local/bin/clang-mp-3.3 -I/opt/local/var/macports/build/_opt_local_var_macports_sources_rsync.macports.org_release_tarballs_ports_math_atlas/atlas/work/atlas-3.10.1/build/..//CONFIG/include  -g -w -DATL_DYLIBS -c /opt/local/var/macports/build/_opt_local_var_macports_sources_rsync.macports.org_release_tarballs_ports_math_atlas/atlas/work/atlas-3.10.1/build/..//CONFIG/src/atlconf_misc.c
402:info:configure In file included from /opt/local/var/macports/build/_opt_local_var_macports_sources_rsync.macports.org_release_tarballs_ports_math_atlas/atlas/work/atlas-3.10.1/build/..//CONFIG/src/atlconf_misc.c:30:
403:info:configure In file included from /opt/local/var/macports/build/_opt_local_var_macports_sources_rsync.macports.org_release_tarballs_ports_math_atlas/atlas/work/atlas-3.10.1/build/..//CONFIG/include/atlconf.h:4:
404:info:configure /usr/include/stdio.h:250:63: error: expected function body after function declarator
405:info:configure FILE    *fopen(const char * __restrict, const char * __restrict) __DARWIN_ALIAS_STARTING(__MAC_10_6, __IPHONE_2_0, __DARWIN_ALIAS(fopen));
406:info:configure                                                                  ^
407:info:configure In file included from /opt/local/var/macports/build/_opt_local_var_macports_sources_rsync.macports.org_release_tarballs_ports_math_atlas/atlas/work/atlas-3.10.1/build/..//CONFIG/src/atlconf_misc.c:30:
408:info:configure In file included from /opt/local/var/macports/build/_opt_local_var_macports_sources_rsync.macports.org_release_tarballs_ports_math_atlas/atlas/work/atlas-3.10.1/build/..//CONFIG/include/atlconf.h:6:
409:info:configure In file included from /usr/include/string.h:180:
410:info:configure /usr/include/strings.h:74:47: error: expected function body after function declarator
411:info:configure int      bcmp(const void *, const void *, size_t) __POSIX_C_DEPRECATED(200112L);
412:info:configure                                                   ^
413:info:configure /usr/include/strings.h:75:43: error: expected function body after function declarator
414:info:configure void     bcopy(const void *, void *, size_t) __POSIX_C_DEPRECATED(200112L);
415:info:configure                                              ^
416:info:configure /usr/include/strings.h:76:29: error: expected function body after function declarator
417:info:configure void     bzero(void *, size_t) __POSIX_C_DEPRECATED(200112L);
418:info:configure                                ^
419:info:configure /usr/include/strings.h:77:32: error: expected function body after function declarator
420:info:configure char    *index(const char *, int) __POSIX_C_DEPRECATED(200112L);
421:info:configure                                   ^
422:info:configure /usr/include/strings.h:78:33: error: expected function body after function declarator
423:info:configure char    *rindex(const char *, int) __POSIX_C_DEPRECATED(200112L);
424:info:configure                                    ^
425:info:configure 6 errors generated.
426:info:configure make: *** [atlconf_misc.o] Error 1
427:info:configure ./xconfig -d s /opt/local/var/macports/build/_opt_local_var_macports_sources_rsync.macports.org_release_tarballs_ports_math_atlas/atlas/work/atlas-3.10.1/build/../ -d b /opt/local/var/macports/build/_opt_local_var_macports_sources_rsync.macports.org_release_tarballs_ports_math_atlas/atlas/work/atlas-3.10.1/build  -Si lapackref 1 -O 12 -v 5 -D c -DATL_DYLIBS -Si omp 0 -C acg /opt/local/bin/clang-mp-3.3 -F acg '-O3 -fomit-frame-pointer -fPIC -march=native -mavx' -C if /opt/local/bin/gfortran-mp-4.8 -F if '-fomit-frame-pointer -mfpmath=sse -O3 -fno-schedule-insns2 -fPIC -msse4.2' -Ss f77lib /opt/local/lib/gcc48/libgfortran.dylib -b 64 -D c -DPentiumCPS=2700
428:info:configure /bin/sh: line 1: ./xconfig: No such file or directory
429:info:configure xconfig exited with 127
430:info:configure Command failed:  cd "/opt/local/var/macports/build/_opt_local_var_macports_sources_rsync.macports.org_release_tarballs_ports_math_atlas/atlas/work/atlas-3.10.1/build" && ../configure --prefix=/opt/local --with-netlib-lapack-tarfile=/opt/local/var/macports/distfiles/atlas/lapack-3.4.2.tgz -O 12 -v 5 --dylibs -Si omp 0 -C acg /opt/local/bin/clang-mp-3.3 -F acg '-O3 -fomit-frame-pointer -fPIC -march=native -mavx' -C if /opt/local/bin/gfortran-mp-4.8 -F if '-fomit-frame-pointer -mfpmath=sse -O3 -fno-schedule-insns2 -fPIC -msse4.2' -Ss f77lib /opt/local/lib/gcc48/libgfortran.dylib -b 64 -D c -DPentiumCPS=2700
431:info:configure Exit code: 127
432:error:configure org.macports.configure for port atlas returned: configure failure: command execution failed
433:debug:configure Error code: NONE
434:debug:configure Backtrace: configure failure: command execution failed
435    while executing
436"$procedure $targetname"
437:info:configure Warning: targets not executed for atlas: org.macports.activate org.macports.configure org.macports.build org.macports.destroot org.macports.install
438:notice:configure Please see the log file for port atlas for details:
439    /opt/local/var/macports/logs/_opt_local_var_macports_sources_rsync.macports.org_release_tarballs_ports_math_atlas/atlas/main.log