Ticket #39839: main.log

File main.log, 23.2 KB (added by avijitshee88@…, 8 years ago)
Line 
1version:1
2:debug:main pdflib has no conflicts
3:debug:main Executing org.macports.main (pdflib)
4:debug:main changing euid/egid - current euid: 0 - current egid: 0
5:debug:main egid changed to: 501
6:debug:main euid changed to: 502
7:debug:archivefetch archivefetch phase started at Tue Jul 23 17:44:06 CEST 2013
8:msg:archivefetch --->  Fetching archive for pdflib
9:debug:archivefetch Executing org.macports.archivefetch (pdflib)
10:debug:archivefetch euid/egid changed to: 0/0
11:debug:archivefetch chowned /opt/local/var/macports/incoming to macports
12:debug:archivefetch euid/egid changed to: 502/501
13:info:archivefetch --->  pdflib-7.0.5_1.darwin_12.x86_64.tbz2 doesn't seem to exist in /opt/local/var/macports/incoming/verified
14:msg:archivefetch --->  Attempting to fetch pdflib-7.0.5_1.darwin_12.x86_64.tbz2 from http://lil.fr.packages.macports.org/pdflib
15:debug:archivefetch Fetching archive failed:: The requested URL returned error: 404
16:msg:archivefetch --->  Attempting to fetch pdflib-7.0.5_1.darwin_12.x86_64.tbz2 from http://mse.uk.packages.macports.org/sites/packages.macports.org/pdflib
17:debug:archivefetch Fetching archive failed:: The requested URL returned error: 404
18:msg:archivefetch --->  Attempting to fetch pdflib-7.0.5_1.darwin_12.x86_64.tbz2 from http://packages.macports.org/pdflib
19:debug:archivefetch Fetching archive failed:: The requested URL returned error: 404
20:debug:archivefetch Privilege de-escalation not attempted as not running as root.
21:debug:fetch fetch phase started at Tue Jul 23 17:44:07 CEST 2013
22:notice:fetch --->  Fetching distfiles for pdflib
23:debug:fetch Executing org.macports.fetch (pdflib)
24:debug:fetch Privilege de-escalation not attempted as not running as root.
25:debug:checksum checksum phase started at Tue Jul 23 17:44:07 CEST 2013
26:notice:checksum --->  Verifying checksum(s) for pdflib
27:debug:checksum Executing org.macports.checksum (pdflib)
28:info:checksum --->  Checksumming PDFlib-Lite-7.0.5.tar.gz
29:debug:checksum Correct (md5) checksum for PDFlib-Lite-7.0.5.tar.gz
30:debug:checksum Correct (sha1) checksum for PDFlib-Lite-7.0.5.tar.gz
31:debug:checksum Correct (rmd160) checksum for PDFlib-Lite-7.0.5.tar.gz
32:debug:checksum Privilege de-escalation not attempted as not running as root.
33:debug:extract extract phase started at Tue Jul 23 17:44:07 CEST 2013
34:notice:extract --->  Extracting pdflib
35:debug:extract Executing org.macports.extract (pdflib)
36:info:extract --->  Extracting PDFlib-Lite-7.0.5.tar.gz
37:debug:extract setting option extract.args to '/opt/local/var/macports/distfiles/pdflib/PDFlib-Lite-7.0.5.tar.gz'
38:debug:extract Environment: CPATH='/opt/local/include' CC_PRINT_OPTIONS_FILE='/opt/local/var/macports/build/_opt_local_var_macports_sources_rsync.macports.org_release_tarballs_ports_print_pdflib/pdflib/work/.CC_PRINT_OPTIONS' LIBRARY_PATH='/opt/local/lib' CC_PRINT_OPTIONS='YES' MACOSX_DEPLOYMENT_TARGET='10.8'
39:debug:extract Assembled command: 'cd "/opt/local/var/macports/build/_opt_local_var_macports_sources_rsync.macports.org_release_tarballs_ports_print_pdflib/pdflib/work" && /usr/bin/gzip -dc '/opt/local/var/macports/distfiles/pdflib/PDFlib-Lite-7.0.5.tar.gz' | /usr/bin/gnutar --no-same-owner -xf -'
40:debug:extract Executing command line:  cd "/opt/local/var/macports/build/_opt_local_var_macports_sources_rsync.macports.org_release_tarballs_ports_print_pdflib/pdflib/work" && /usr/bin/gzip -dc '/opt/local/var/macports/distfiles/pdflib/PDFlib-Lite-7.0.5.tar.gz' | /usr/bin/gnutar --no-same-owner -xf -
41:debug:extract euid/egid changed to: 0/0
42:debug:extract chowned /opt/local/var/macports/build/_opt_local_var_macports_sources_rsync.macports.org_release_tarballs_ports_print_pdflib/pdflib/work to macports
43:debug:extract euid/egid changed to: 502/501
44:debug:extract Privilege de-escalation not attempted as not running as root.
45:debug:patch patch phase started at Tue Jul 23 17:44:07 CEST 2013
46:debug:patch Executing org.macports.patch (pdflib)
47:notice:patch --->  Applying patches to pdflib
48:info:patch --->  Applying patch-perl_Makefile.diff
49:debug:patch Environment: CPATH='/opt/local/include' CC_PRINT_OPTIONS_FILE='/opt/local/var/macports/build/_opt_local_var_macports_sources_rsync.macports.org_release_tarballs_ports_print_pdflib/pdflib/work/.CC_PRINT_OPTIONS' LIBRARY_PATH='/opt/local/lib' CC_PRINT_OPTIONS='YES' MACOSX_DEPLOYMENT_TARGET='10.8'
50:debug:patch Assembled command: 'cd "/opt/local/var/macports/build/_opt_local_var_macports_sources_rsync.macports.org_release_tarballs_ports_print_pdflib/pdflib/work/PDFlib-Lite-7.0.5" && /usr/bin/patch -p0'
51:debug:patch Executing command line:  cd "/opt/local/var/macports/build/_opt_local_var_macports_sources_rsync.macports.org_release_tarballs_ports_print_pdflib/pdflib/work/PDFlib-Lite-7.0.5" && /usr/bin/patch -p0 < '/opt/local/var/macports/sources/rsync.macports.org/release/tarballs/ports/print/pdflib/files/patch-perl_Makefile.diff'
52:info:patch patching file bind/pdflib/perl/Makefile
53:info:patch --->  Applying patch-libtool.diff
54:debug:patch Environment: CPATH='/opt/local/include' CC_PRINT_OPTIONS_FILE='/opt/local/var/macports/build/_opt_local_var_macports_sources_rsync.macports.org_release_tarballs_ports_print_pdflib/pdflib/work/.CC_PRINT_OPTIONS' LIBRARY_PATH='/opt/local/lib' CC_PRINT_OPTIONS='YES' MACOSX_DEPLOYMENT_TARGET='10.8'
55:debug:patch Assembled command: 'cd "/opt/local/var/macports/build/_opt_local_var_macports_sources_rsync.macports.org_release_tarballs_ports_print_pdflib/pdflib/work/PDFlib-Lite-7.0.5" && /usr/bin/patch -p0'
56:debug:patch Executing command line:  cd "/opt/local/var/macports/build/_opt_local_var_macports_sources_rsync.macports.org_release_tarballs_ports_print_pdflib/pdflib/work/PDFlib-Lite-7.0.5" && /usr/bin/patch -p0 < '/opt/local/var/macports/sources/rsync.macports.org/release/tarballs/ports/print/pdflib/files/patch-libtool.diff'
57:info:patch patching file config/mkcommon.inc.in
58:info:patch patching file config/mkmainlib.inc.in
59:debug:patch Executing proc-post-org.macports.patch-patch-0
60:debug:patch Executing reinplace: /usr/bin/sed {s/PYTHONLIBDIR=`cat << EOF | python/PYTHONLIBDIR=`cat << EOF | $PYTHONBIN/g} < /opt/local/var/macports/build/_opt_local_var_macports_sources_rsync.macports.org_release_tarballs_ports_print_pdflib/pdflib/work/PDFlib-Lite-7.0.5/configure >@ file10
61:debug:patch euid/egid changed to: 0/0
62:debug:patch chowned /opt/local/var/macports/build/_opt_local_var_macports_sources_rsync.macports.org_release_tarballs_ports_print_pdflib/pdflib/work/PDFlib-Lite-7.0.5/configure to macports
63:debug:patch euid/egid changed to: 502/501
64:debug:patch euid/egid changed to: 0/0
65:debug:patch setting attributes on /opt/local/var/macports/build/_opt_local_var_macports_sources_rsync.macports.org_release_tarballs_ports_print_pdflib/pdflib/work/PDFlib-Lite-7.0.5/configure
66:debug:patch euid/egid changed to: 502/501
67:debug:patch Privilege de-escalation not attempted as not running as root.
68:debug:configure configure phase started at Tue Jul 23 17:44:07 CEST 2013
69:notice:configure --->  Configuring pdflib
70:debug:configure Using compiler 'Mac OS X clang'
71:debug:configure Executing org.macports.configure (pdflib)
72:debug:configure Environment: CPATH='/opt/local/include' CFLAGS='-pipe -O2 -arch x86_64' CPPFLAGS='-isystem/opt/local/include' CXXFLAGS='-pipe -O2 -arch x86_64' LIBRARY_PATH='/opt/local/lib' MACOSX_DEPLOYMENT_TARGET='10.8' CXX='/usr/bin/clang++' CC_PRINT_OPTIONS_FILE='/opt/local/var/macports/build/_opt_local_var_macports_sources_rsync.macports.org_release_tarballs_ports_print_pdflib/pdflib/work/.CC_PRINT_OPTIONS' F90FLAGS='-pipe -O2 -m64' LDFLAGS='-L/opt/local/lib -arch x86_64' OBJC='/usr/bin/clang' FCFLAGS='-pipe -O2 -m64' INSTALL='/usr/bin/install -c' OBJCFLAGS='-pipe -O2 -arch x86_64' FFLAGS='-pipe -O2 -m64' CC_PRINT_OPTIONS='YES' CC='/usr/bin/clang'
73:debug:configure Assembled command: 'cd "/opt/local/var/macports/build/_opt_local_var_macports_sources_rsync.macports.org_release_tarballs_ports_print_pdflib/pdflib/work/PDFlib-Lite-7.0.5" && ./configure --prefix=/opt/local --without-java --without-perl --without-py --without-tcl --without-ruby'
74:debug:configure Executing command line:  cd "/opt/local/var/macports/build/_opt_local_var_macports_sources_rsync.macports.org_release_tarballs_ports_print_pdflib/pdflib/work/PDFlib-Lite-7.0.5" && ./configure --prefix=/opt/local --without-java --without-perl --without-py --without-tcl --without-ruby
75:info:configure checking build system type... i386-apple-darwin12.4.0
76:info:configure checking host system type... i386-apple-darwin12.4.0
77:info:configure checking MACHDEP... darwin12
78:info:configure checking for gcc... /usr/bin/clang
79:info:configure checking for C compiler default output file name... a.out
80:info:configure checking whether the C compiler works... yes
81:info:configure checking whether we are cross compiling... no
82:info:configure checking for suffix of executables...
83:info:configure checking for suffix of object files... o
84:info:configure checking whether we are using the GNU C compiler... yes
85:info:configure checking whether /usr/bin/clang accepts -g... yes
86:info:configure checking for /usr/bin/clang option to accept ANSI C... none needed
87:info:configure checking how to run the C preprocessor... /usr/bin/clang -E
88:info:configure checking for a BSD-compatible install... /usr/bin/install -c
89:info:configure checking Mac build Architecture... ./configure: line 3778: echounknown architecture (--with-macarch): command not found
90:info:configure  -isysroot   -Wl,-syslibroot,
91:info:configure checking for a sed that does not truncate output... /opt/local/bin/gsed
92:info:configure checking for egrep... grep -E
93:info:configure checking for ld used by /usr/bin/clang... /usr/bin/ld
94:info:configure checking if the linker (/usr/bin/ld) is GNU ld... no
95:info:configure checking for /usr/bin/ld option to reload object files... -r
96:info:configure checking for BSD-compatible nm... /opt/local/bin/nm
97:info:configure checking whether ln -s works... yes
98:info:configure checking how to recognize dependent libraries... pass_all
99:info:configure checking for ANSI C header files... no
100:info:configure checking for sys/types.h... no
101:info:configure checking for sys/stat.h... no
102:info:configure checking for stdlib.h... no
103:info:configure checking for string.h... no
104:info:configure checking for memory.h... no
105:info:configure checking for strings.h... no
106:info:configure checking for inttypes.h... no
107:info:configure checking for stdint.h... no
108:info:configure checking for unistd.h... no
109:info:configure checking dlfcn.h usability... no
110:info:configure checking dlfcn.h presence... yes
111:info:configure configure: WARNING: dlfcn.h: present but cannot be compiled
112:info:configure configure: WARNING: dlfcn.h:     check for missing prerequisite headers?
113:info:configure configure: WARNING: dlfcn.h: see the Autoconf documentation
114:info:configure configure: WARNING: dlfcn.h:     section "Present But Cannot Be Compiled"
115:info:configure configure: WARNING: dlfcn.h: proceeding with the preprocessor's result
116:info:configure configure: WARNING: dlfcn.h: in the future, the compiler will take precedence
117:info:configure configure: WARNING:     ## ------------------------------------------ ##
118:info:configure configure: WARNING:     ## Report this to the AC_PACKAGE_NAME lists.  ##
119:info:configure configure: WARNING:     ## ------------------------------------------ ##
120:info:configure checking for dlfcn.h... yes
121:info:configure checking whether we are using the GNU C++ compiler... yes
122:info:configure checking whether /usr/bin/clang++ accepts -g... yes
123:info:configure checking how to run the C++ preprocessor... /usr/bin/clang++ -E
124:info:configure checking for g77... no
125:info:configure checking for f77... no
126:info:configure checking for xlf... no
127:info:configure checking for frt... no
128:info:configure checking for pgf77... no
129:info:configure checking for fort77... no
130:info:configure checking for fl32... no
131:info:configure checking for af77... no
132:info:configure checking for f90... no
133:info:configure checking for xlf90... no
134:info:configure checking for pgf90... no
135:info:configure checking for epcf90... no
136:info:configure checking for f95... no
137:info:configure checking for fort... no
138:info:configure checking for xlf95... no
139:info:configure checking for ifc... no
140:info:configure checking for efc... no
141:info:configure checking for pgf95... no
142:info:configure checking for lf95... no
143:info:configure checking for gfortran... gfortran
144:info:configure checking whether we are using the GNU Fortran 77 compiler... no
145:info:configure checking whether gfortran accepts -g... no
146:info:configure checking the maximum length of command line arguments... 196608
147:info:configure checking command to parse /opt/local/bin/nm output from /usr/bin/clang object... ok
148:info:configure checking for objdir... .libs
149:info:configure checking for ar... ar
150:info:configure checking for ranlib... ranlib
151:info:configure checking for strip... strip
152:info:configure checking if /usr/bin/clang supports -fno-rtti -fno-exceptions... yes
153:info:configure checking for /usr/bin/clang option to produce PIC... -fno-common
154:info:configure checking if /usr/bin/clang PIC flag -fno-common works... yes
155:info:configure checking if /usr/bin/clang static flag -static works... no
156:info:configure checking if /usr/bin/clang supports -c -o file.o... yes
157:info:configure checking whether the /usr/bin/clang linker (/usr/bin/ld) supports shared libraries... yes
158:info:configure checking dynamic linker characteristics... darwin12.4.0 dyld
159:info:configure checking how to hardcode library paths into programs... immediate
160:info:configure checking whether stripping libraries is possible... yes
161:info:configure checking for dlopen in -ldl... yes
162:info:configure checking whether a program can dlopen itself... no
163:info:configure checking if libtool supports shared libraries... yes
164:info:configure checking whether to build shared libraries... yes
165:info:configure checking whether to build static libraries... yes
166:info:configure configure: creating libtool
167:info:configure appending configuration tag "CXX" to libtool
168:info:configure checking for ld used by /usr/bin/clang++... /usr/bin/ld
169:info:configure checking if the linker (/usr/bin/ld) is GNU ld... no
170:info:configure checking whether the /usr/bin/clang++ linker (/usr/bin/ld) supports shared libraries... yes
171:info:configure checking for /usr/bin/clang++ option to produce PIC... -fno-common
172:info:configure checking if /usr/bin/clang++ PIC flag -fno-common works... yes
173:info:configure checking if /usr/bin/clang++ static flag -static works... no
174:info:configure checking if /usr/bin/clang++ supports -c -o file.o... yes
175:info:configure checking whether the /usr/bin/clang++ linker (/usr/bin/ld) supports shared libraries... yes
176:info:configure checking dynamic linker characteristics... darwin12.4.0 dyld
177:info:configure checking how to hardcode library paths into programs... immediate
178:info:configure appending configuration tag "F77" to libtool
179:info:configure checking if libtool supports shared libraries... yes
180:info:configure checking whether to build shared libraries... yes
181:info:configure checking whether to build static libraries... yes
182:info:configure checking for gfortran option to produce PIC... -fno-common
183:info:configure checking if gfortran PIC flag -fno-common works... no
184:info:configure checking if gfortran static flag -static works... no
185:info:configure checking if gfortran supports -c -o file.o... no
186:info:configure checking whether the gfortran linker (/usr/bin/ld) supports shared libraries... yes
187:info:configure checking dynamic linker characteristics... darwin12.4.0 dyld
188:info:configure checking how to hardcode library paths into programs... immediate
189:info:configure checking whether byte ordering is bigendian... no
190:info:configure checking for PDF import library PDI... not found
191:info:configure checking for PDFlib PLOP (PDF Linearization, Optimization, Privacy)... not found
192:info:configure checking for PDFlib base library pdflib... found
193:info:configure checking for pCOS... not found
194:info:configure checking for PDFlib TET... not found
195:info:configure checking for PDFlib PDPAGE... not found
196:info:configure checking for PDFlib lib CL... not found
197:info:configure checking whether we are using the GNU C++ compiler... (cached) yes
198:info:configure checking whether /usr/bin/clang++ accepts -g... (cached) yes
199:info:configure checking whether the previously found C++ compiler works... yes
200:info:configure configure: creating ./config.status
201:info:configure config.status: creating pdflib-config
202:info:configure config.status: creating config/mkbind.inc
203:info:configure config.status: creating config/mkcommon.inc
204:info:configure config.status: creating config/mklibs.inc
205:info:configure config.status: creating config/mkmainlib.inc
206:info:configure config.status: creating config/mkprogs.inc
207:info:configure config.status: creating config/mkpsubdirs.inc
208:info:configure config.status: creating config/mksubdirs.inc
209:info:configure config.status: executing default commands
210:info:configure _____________________________________________________________
211:info:configure For your convenience, here's a summary of configure's results:
212:info:configure
213:info:configure Support for shared libraries:           yes
214:info:configure C++ language binding for PDFlib:        yes
215:info:configure Java language binding for PDFlib:       no
216:info:configure Perl language binding for PDFlib:       no
217:info:configure Python language binding for PDFlib:     no
218:info:configure Ruby language binding for PDFlib:       no
219:info:configure Tcl language binding for PDFlib:        no
220:info:configure PDF import library (PDI):               no
221:info:configure Large file support:                     yes
222:info:configure      Note: if you purchase the additional PDF import library (PDI)
223:info:configure      you can also manipulate existing PDF documents with PDFlib.
224:info:configure      The additional block feature can be used to personalize PDF.
225:info:configure      See http://www.pdflib.com for details.
226:info:configure
227:info:configure Please observe the licensing terms for commercial PDFlib usage.
228:info:configure PDFlib license agreement and purchase order can be found in the doc directory.
229:info:configure
230:debug:configure Privilege de-escalation not attempted as not running as root.
231:debug:build build phase started at Tue Jul 23 17:44:13 CEST 2013
232:notice:build --->  Building pdflib
233:debug:build Executing org.macports.build (pdflib)
234:debug:build Environment: CPATH='/opt/local/include' CC_PRINT_OPTIONS_FILE='/opt/local/var/macports/build/_opt_local_var_macports_sources_rsync.macports.org_release_tarballs_ports_print_pdflib/pdflib/work/.CC_PRINT_OPTIONS' LIBRARY_PATH='/opt/local/lib' CC_PRINT_OPTIONS='YES' MACOSX_DEPLOYMENT_TARGET='10.8'
235:debug:build Assembled command: 'cd "/opt/local/var/macports/build/_opt_local_var_macports_sources_rsync.macports.org_release_tarballs_ports_print_pdflib/pdflib/work/PDFlib-Lite-7.0.5" && /usr/bin/make -w all'
236:debug:build Executing command line:  cd "/opt/local/var/macports/build/_opt_local_var_macports_sources_rsync.macports.org_release_tarballs_ports_print_pdflib/pdflib/work/PDFlib-Lite-7.0.5" && /usr/bin/make -w all
237:info:build make: Entering directory `/opt/local/var/macports/build/_opt_local_var_macports_sources_rsync.macports.org_release_tarballs_ports_print_pdflib/pdflib/work/PDFlib-Lite-7.0.5'
238:info:build make[1]: Entering directory `/opt/local/var/macports/build/_opt_local_var_macports_sources_rsync.macports.org_release_tarballs_ports_print_pdflib/pdflib/work/PDFlib-Lite-7.0.5/libs'
239:info:build make[2]: Entering directory `/opt/local/var/macports/build/_opt_local_var_macports_sources_rsync.macports.org_release_tarballs_ports_print_pdflib/pdflib/work/PDFlib-Lite-7.0.5/libs/pdcore'
240:info:build ../../libtool --silent --mode=compile --tag=CC /usr/bin/clang -c -isystem/opt/local/include -I/Developer/Headers/FlatCarbon -I../../libs/pdcore -I../../libs/pdflib  -I../../libs/flate    -pipe -O2 -arch x86_64 -D_LARGEFILE_SOURCE -D_FILE_OFFSET_BITS=64 -DPDF_MAC_PLATFORM=\""Mac OS X"\" -DPACKAGE_NAME=\"\" -DPACKAGE_TARNAME=\"\" -DPACKAGE_VERSION=\"\" -DPACKAGE_STRING=\"\" -DPACKAGE_BUGREPORT=\"\" -DHAVE_DLFCN_H=1  -Wall    pc_aes.c
241:info:build In file included from pc_aes.c:31:
242:info:build In file included from ../../libs/pdcore/pc_util.h:23:
243:info:build In file included from /usr/include/string.h:180:
244:info:build /usr/include/strings.h:74:47: error: expected function body after function declarator
245:info:build int      bcmp(const void *, const void *, size_t) __POSIX_C_DEPRECATED(200112L);
246:info:build                                                   ^
247:info:build /usr/include/strings.h:75:43: error: expected function body after function declarator
248:info:build void     bcopy(const void *, void *, size_t) __POSIX_C_DEPRECATED(200112L);
249:info:build                                              ^
250:info:build /usr/include/strings.h:76:29: error: expected function body after function declarator
251:info:build void     bzero(void *, size_t) __POSIX_C_DEPRECATED(200112L);
252:info:build                                ^
253:info:build /usr/include/strings.h:77:32: error: expected function body after function declarator
254:info:build char    *index(const char *, int) __POSIX_C_DEPRECATED(200112L);
255:info:build                                   ^
256:info:build /usr/include/strings.h:78:33: error: expected function body after function declarator
257:info:build char    *rindex(const char *, int) __POSIX_C_DEPRECATED(200112L);
258:info:build                                    ^
259:info:build In file included from pc_aes.c:31:
260:info:build In file included from ../../libs/pdcore/pc_util.h:26:
261:info:build /usr/include/stdio.h:250:63: error: expected function body after function declarator
262:info:build FILE    *fopen(const char * __restrict, const char * __restrict) __DARWIN_ALIAS_STARTING(__MAC_10_6, __IPHONE_2_0, __DARWIN_ALIAS(fopen));
263:info:build                                                                  ^
264:info:build 6 errors generated.
265:info:build make[2]: *** [pc_aes.lo] Error 1
266:info:build make[2]: Leaving directory `/opt/local/var/macports/build/_opt_local_var_macports_sources_rsync.macports.org_release_tarballs_ports_print_pdflib/pdflib/work/PDFlib-Lite-7.0.5/libs/pdcore'
267:info:build make[1]: *** [all] Error 2
268:info:build make[1]: Leaving directory `/opt/local/var/macports/build/_opt_local_var_macports_sources_rsync.macports.org_release_tarballs_ports_print_pdflib/pdflib/work/PDFlib-Lite-7.0.5/libs'
269:info:build make: *** [all] Error 2
270:info:build make: Leaving directory `/opt/local/var/macports/build/_opt_local_var_macports_sources_rsync.macports.org_release_tarballs_ports_print_pdflib/pdflib/work/PDFlib-Lite-7.0.5'
271:info:build Command failed:  cd "/opt/local/var/macports/build/_opt_local_var_macports_sources_rsync.macports.org_release_tarballs_ports_print_pdflib/pdflib/work/PDFlib-Lite-7.0.5" && /usr/bin/make -w all
272:info:build Exit code: 2
273:error:build org.macports.build for port pdflib returned: command execution failed
274:debug:build Error code: CHILDSTATUS 22822 2
275:debug:build Backtrace: command execution failed
276    while executing
277"system -nice 0 $fullcmdstring"
278    ("eval" body line 1)
279    invoked from within
280"eval system $notty $nice \$fullcmdstring"
281    invoked from within
282"command_exec build"
283    (procedure "portbuild::build_main" line 8)
284    invoked from within
285"$procedure $targetname"
286:info:build Warning: targets not executed for pdflib: org.macports.activate org.macports.build org.macports.destroot org.macports.install
287:notice:build Please see the log file for port pdflib for details:
288    /opt/local/var/macports/logs/_opt_local_var_macports_sources_rsync.macports.org_release_tarballs_ports_print_pdflib/pdflib/main.log