| 1 | This file contains any messages produced by compilers while |
|---|
| 2 | running configure, to aid debugging if configure makes a mistake. |
|---|
| 3 | |
|---|
| 4 | It was created by MacPorts configure 2.2.99, which was |
|---|
| 5 | generated by GNU Autoconf 2.69. Invocation command line was |
|---|
| 6 | |
|---|
| 7 | $ ./configure --enable-readline |
|---|
| 8 | |
|---|
| 9 | ## --------- ## |
|---|
| 10 | ## Platform. ## |
|---|
| 11 | ## --------- ## |
|---|
| 12 | |
|---|
| 13 | hostname = leom-3.local |
|---|
| 14 | uname -m = x86_64 |
|---|
| 15 | uname -r = 13.0.0 |
|---|
| 16 | uname -s = Darwin |
|---|
| 17 | uname -v = Darwin Kernel Version 13.0.0: Thu Aug 29 21:26:29 PDT 2013; root:xnu-2422.1.68~1/RELEASE_X86_64 |
|---|
| 18 | |
|---|
| 19 | /usr/bin/uname -p = i386 |
|---|
| 20 | /bin/uname -X = unknown |
|---|
| 21 | |
|---|
| 22 | /bin/arch = unknown |
|---|
| 23 | /usr/bin/arch -k = unknown |
|---|
| 24 | /usr/convex/getsysinfo = unknown |
|---|
| 25 | /usr/bin/hostinfo = Mach kernel version: |
|---|
| 26 | Darwin Kernel Version 13.0.0: Thu Aug 29 21:26:29 PDT 2013; root:xnu-2422.1.68~1/RELEASE_X86_64 |
|---|
| 27 | Kernel configured for up to 8 processors. |
|---|
| 28 | 4 processors are physically available. |
|---|
| 29 | 8 processors are logically available. |
|---|
| 30 | Processor type: i486 (Intel 80486) |
|---|
| 31 | Processors active: 0 1 2 3 4 5 6 7 |
|---|
| 32 | Primary memory available: 8.00 gigabytes |
|---|
| 33 | Default processor set: 248 tasks, 1255 threads, 8 processors |
|---|
| 34 | Load average: 1.21, Mach factor: 6.78 |
|---|
| 35 | /bin/machine = unknown |
|---|
| 36 | /usr/bin/oslevel = unknown |
|---|
| 37 | /bin/universe = unknown |
|---|
| 38 | |
|---|
| 39 | PATH: /opt/local/bin |
|---|
| 40 | PATH: /opt/local/sbin |
|---|
| 41 | PATH: /usr/bin |
|---|
| 42 | PATH: /bin |
|---|
| 43 | PATH: /usr/sbin |
|---|
| 44 | PATH: /sbin |
|---|
| 45 | PATH: /usr/local/bin |
|---|
| 46 | |
|---|
| 47 | |
|---|
| 48 | ## ----------- ## |
|---|
| 49 | ## Core tests. ## |
|---|
| 50 | ## ----------- ## |
|---|
| 51 | |
|---|
| 52 | configure:2679: checking build system type |
|---|
| 53 | configure:2693: result: x86_64-apple-darwin13.0.0 |
|---|
| 54 | configure:2713: checking host system type |
|---|
| 55 | configure:2726: result: x86_64-apple-darwin13.0.0 |
|---|
| 56 | configure:2746: checking target system type |
|---|
| 57 | configure:2759: result: x86_64-apple-darwin13.0.0 |
|---|
| 58 | configure:2787: checking MacPorts version |
|---|
| 59 | configure:2790: result: 2.2.99 |
|---|
| 60 | configure:2823: checking for sw_vers |
|---|
| 61 | configure:2841: found /usr/bin/sw_vers |
|---|
| 62 | configure:2853: result: /usr/bin/sw_vers |
|---|
| 63 | configure:2863: checking for defaults |
|---|
| 64 | configure:2881: found /usr/bin/defaults |
|---|
| 65 | configure:2893: result: /usr/bin/defaults |
|---|
| 66 | configure:2903: checking for xcode-select |
|---|
| 67 | configure:2921: found /usr/bin/xcode-select |
|---|
| 68 | configure:2933: result: /usr/bin/xcode-select |
|---|
| 69 | configure:2943: checking Mac OS X version |
|---|
| 70 | configure:2946: result: 10.9 |
|---|
| 71 | configure:2968: checking Xcode location |
|---|
| 72 | configure:2980: result: /Applications/Xcode.app/Contents/Developer |
|---|
| 73 | configure:2994: checking Xcode version |
|---|
| 74 | configure:3001: result: 5.0 |
|---|
| 75 | configure:3073: checking for gcc |
|---|
| 76 | configure:3089: found /usr/bin/gcc |
|---|
| 77 | configure:3100: result: gcc |
|---|
| 78 | configure:3329: checking for C compiler version |
|---|
| 79 | configure:3338: gcc --version >&5 |
|---|
| 80 | Apple LLVM version 5.0 (clang-500.2.75) (based on LLVM 3.3svn) |
|---|
| 81 | Target: x86_64-apple-darwin13.0.0 |
|---|
| 82 | Thread model: posix |
|---|
| 83 | Configured with: --prefix=/Applications/Xcode.app/Contents/Developer/usr --with-gxx-include-dir=/Applications/Xcode.app/Contents/Developer/Platforms/MacOSX.platform/Developer/SDKs/MacOSX10.8.sdk/usr/include/c++/4.2.1 |
|---|
| 84 | configure:3349: $? = 0 |
|---|
| 85 | configure:3338: gcc -v >&5 |
|---|
| 86 | Configured with: --prefix=/Applications/Xcode.app/Contents/Developer/usr --with-gxx-include-dir=/Applications/Xcode.app/Contents/Developer/Platforms/MacOSX.platform/Developer/SDKs/MacOSX10.8.sdk/usr/include/c++/4.2.1 |
|---|
| 87 | Apple LLVM version 5.0 (clang-500.2.75) (based on LLVM 3.3svn) |
|---|
| 88 | Target: x86_64-apple-darwin13.0.0 |
|---|
| 89 | Thread model: posix |
|---|
| 90 | configure:3349: $? = 0 |
|---|
| 91 | configure:3338: gcc -V >&5 |
|---|
| 92 | clang: error: argument to '-V' is missing (expected 1 value) |
|---|
| 93 | clang: error: no input files |
|---|
| 94 | configure:3349: $? = 1 |
|---|
| 95 | configure:3338: gcc -qversion >&5 |
|---|
| 96 | clang: error: no input files |
|---|
| 97 | configure:3349: $? = 1 |
|---|
| 98 | configure:3369: checking whether the C compiler works |
|---|
| 99 | configure:3391: gcc conftest.c >&5 |
|---|
| 100 | configure:3395: $? = 0 |
|---|
| 101 | configure:3443: result: yes |
|---|
| 102 | configure:3446: checking for C compiler default output file name |
|---|
| 103 | configure:3448: result: a.out |
|---|
| 104 | configure:3454: checking for suffix of executables |
|---|
| 105 | configure:3461: gcc -o conftest conftest.c >&5 |
|---|
| 106 | configure:3465: $? = 0 |
|---|
| 107 | configure:3487: result: |
|---|
| 108 | configure:3509: checking whether we are cross compiling |
|---|
| 109 | configure:3517: gcc -o conftest conftest.c >&5 |
|---|
| 110 | configure:3521: $? = 0 |
|---|
| 111 | configure:3528: ./conftest |
|---|
| 112 | configure:3532: $? = 0 |
|---|
| 113 | configure:3547: result: no |
|---|
| 114 | configure:3552: checking for suffix of object files |
|---|
| 115 | configure:3574: gcc -c conftest.c >&5 |
|---|
| 116 | configure:3578: $? = 0 |
|---|
| 117 | configure:3599: result: o |
|---|
| 118 | configure:3603: checking whether we are using the GNU C compiler |
|---|
| 119 | configure:3622: gcc -c conftest.c >&5 |
|---|
| 120 | configure:3622: $? = 0 |
|---|
| 121 | configure:3631: result: yes |
|---|
| 122 | configure:3640: checking whether gcc accepts -g |
|---|
| 123 | configure:3660: gcc -c -g conftest.c >&5 |
|---|
| 124 | configure:3660: $? = 0 |
|---|
| 125 | configure:3701: result: yes |
|---|
| 126 | configure:3718: checking for gcc option to accept ISO C89 |
|---|
| 127 | configure:3781: gcc -c -g -O2 conftest.c >&5 |
|---|
| 128 | configure:3781: $? = 0 |
|---|
| 129 | configure:3794: result: none needed |
|---|
| 130 | configure:3828: checking for a BSD-compatible install |
|---|
| 131 | configure:3896: result: /usr/bin/install -c |
|---|
| 132 | configure:3907: checking whether ln -s works |
|---|
| 133 | configure:3911: result: yes |
|---|
| 134 | configure:3918: checking whether make sets $(MAKE) |
|---|
| 135 | configure:3940: result: yes |
|---|
| 136 | configure:4003: checking for gcc |
|---|
| 137 | configure:4019: found /usr/bin/gcc |
|---|
| 138 | configure:4030: result: gcc |
|---|
| 139 | configure:4055: checking for Objective C compiler version |
|---|
| 140 | configure:4064: gcc --version >&5 |
|---|
| 141 | Apple LLVM version 5.0 (clang-500.2.75) (based on LLVM 3.3svn) |
|---|
| 142 | Target: x86_64-apple-darwin13.0.0 |
|---|
| 143 | Thread model: posix |
|---|
| 144 | Configured with: --prefix=/Applications/Xcode.app/Contents/Developer/usr --with-gxx-include-dir=/Applications/Xcode.app/Contents/Developer/Platforms/MacOSX.platform/Developer/SDKs/MacOSX10.8.sdk/usr/include/c++/4.2.1 |
|---|
| 145 | configure:4075: $? = 0 |
|---|
| 146 | configure:4064: gcc -v >&5 |
|---|
| 147 | Configured with: --prefix=/Applications/Xcode.app/Contents/Developer/usr --with-gxx-include-dir=/Applications/Xcode.app/Contents/Developer/Platforms/MacOSX.platform/Developer/SDKs/MacOSX10.8.sdk/usr/include/c++/4.2.1 |
|---|
| 148 | Apple LLVM version 5.0 (clang-500.2.75) (based on LLVM 3.3svn) |
|---|
| 149 | Target: x86_64-apple-darwin13.0.0 |
|---|
| 150 | Thread model: posix |
|---|
| 151 | configure:4075: $? = 0 |
|---|
| 152 | configure:4064: gcc -V >&5 |
|---|
| 153 | clang: error: argument to '-V' is missing (expected 1 value) |
|---|
| 154 | clang: error: no input files |
|---|
| 155 | configure:4075: $? = 1 |
|---|
| 156 | configure:4064: gcc -qversion >&5 |
|---|
| 157 | clang: error: no input files |
|---|
| 158 | configure:4075: $? = 1 |
|---|
| 159 | configure:4079: checking whether we are using the GNU Objective C compiler |
|---|
| 160 | configure:4098: gcc -c conftest.m >&5 |
|---|
| 161 | configure:4098: $? = 0 |
|---|
| 162 | configure:4107: result: yes |
|---|
| 163 | configure:4116: checking whether gcc accepts -g |
|---|
| 164 | configure:4136: gcc -c -g conftest.m >&5 |
|---|
| 165 | configure:4136: $? = 0 |
|---|
| 166 | configure:4177: result: yes |
|---|
| 167 | configure:4205: checking for bsdmake |
|---|
| 168 | configure:4238: result: no |
|---|
| 169 | configure:4205: checking for pmake |
|---|
| 170 | configure:4238: result: no |
|---|
| 171 | configure:4248: checking for bzip2 |
|---|
| 172 | configure:4266: found /usr/bin/bzip2 |
|---|
| 173 | configure:4278: result: /usr/bin/bzip2 |
|---|
| 174 | configure:4288: checking for bzr |
|---|
| 175 | configure:4321: result: no |
|---|
| 176 | configure:4328: checking for chown |
|---|
| 177 | configure:4347: found /usr/sbin/chown |
|---|
| 178 | configure:4359: result: /usr/sbin/chown |
|---|
| 179 | configure:4369: checking for cp |
|---|
| 180 | configure:4387: found /bin/cp |
|---|
| 181 | configure:4399: result: /bin/cp |
|---|
| 182 | configure:4409: checking for cpio |
|---|
| 183 | configure:4427: found /usr/bin/cpio |
|---|
| 184 | configure:4439: result: /usr/bin/cpio |
|---|
| 185 | configure:4449: checking for cvs |
|---|
| 186 | configure:4467: found /usr/bin/cvs |
|---|
| 187 | configure:4479: result: /usr/bin/cvs |
|---|
| 188 | configure:4489: checking for diff |
|---|
| 189 | configure:4507: found /usr/bin/diff |
|---|
| 190 | configure:4519: result: /usr/bin/diff |
|---|
| 191 | configure:4529: checking for dscl |
|---|
| 192 | configure:4547: found /usr/bin/dscl |
|---|
| 193 | configure:4559: result: /usr/bin/dscl |
|---|
| 194 | configure:4569: checking for dseditgroup |
|---|
| 195 | configure:4587: found /usr/sbin/dseditgroup |
|---|
| 196 | configure:4599: result: /usr/sbin/dseditgroup |
|---|
| 197 | configure:4609: checking for file |
|---|
| 198 | configure:4627: found /usr/bin/file |
|---|
| 199 | configure:4639: result: /usr/bin/file |
|---|
| 200 | configure:4649: checking for find |
|---|
| 201 | configure:4667: found /usr/bin/find |
|---|
| 202 | configure:4679: result: /usr/bin/find |
|---|
| 203 | configure:4689: checking for git |
|---|
| 204 | configure:4707: found /usr/bin/git |
|---|
| 205 | configure:4719: result: /usr/bin/git |
|---|
| 206 | configure:4731: checking for gnumake |
|---|
| 207 | configure:4750: found /usr/bin/gnumake |
|---|
| 208 | configure:4762: result: /usr/bin/gnumake |
|---|
| 209 | configure:4777: checking for gnupatch |
|---|
| 210 | configure:4811: result: no |
|---|
| 211 | configure:4777: checking for gpatch |
|---|
| 212 | configure:4811: result: no |
|---|
| 213 | configure:4823: checking for gnutar |
|---|
| 214 | configure:4857: result: no |
|---|
| 215 | configure:4823: checking for gtar |
|---|
| 216 | configure:4857: result: no |
|---|
| 217 | configure:4867: checking for gzip |
|---|
| 218 | configure:4885: found /usr/bin/gzip |
|---|
| 219 | configure:4897: result: /usr/bin/gzip |
|---|
| 220 | configure:4907: checking for hdiutil |
|---|
| 221 | configure:4925: found /usr/bin/hdiutil |
|---|
| 222 | configure:4937: result: /usr/bin/hdiutil |
|---|
| 223 | configure:4947: checking for hg |
|---|
| 224 | configure:4980: result: no |
|---|
| 225 | configure:4987: checking for launchctl |
|---|
| 226 | configure:5005: found /bin/launchctl |
|---|
| 227 | configure:5017: result: /bin/launchctl |
|---|
| 228 | configure:5027: checking for lipo |
|---|
| 229 | configure:5045: found /usr/bin/lipo |
|---|
| 230 | configure:5057: result: /usr/bin/lipo |
|---|
| 231 | configure:5067: checking for lsbom |
|---|
| 232 | configure:5085: found /usr/bin/lsbom |
|---|
| 233 | configure:5097: result: /usr/bin/lsbom |
|---|
| 234 | configure:5107: checking for lzma |
|---|
| 235 | configure:5140: result: no |
|---|
| 236 | configure:5147: checking for make |
|---|
| 237 | configure:5165: found /usr/bin/make |
|---|
| 238 | configure:5177: result: /usr/bin/make |
|---|
| 239 | configure:5187: checking for mdfind |
|---|
| 240 | configure:5205: found /usr/bin/mdfind |
|---|
| 241 | configure:5217: result: /usr/bin/mdfind |
|---|
| 242 | configure:5227: checking for mdls |
|---|
| 243 | configure:5245: found /usr/bin/mdls |
|---|
| 244 | configure:5257: result: /usr/bin/mdls |
|---|
| 245 | configure:5267: checking for mkbom |
|---|
| 246 | configure:5285: found /usr/bin/mkbom |
|---|
| 247 | configure:5297: result: /usr/bin/mkbom |
|---|
| 248 | configure:5307: checking for mtree |
|---|
| 249 | configure:5326: found /usr/sbin/mtree |
|---|
| 250 | configure:5338: result: /usr/sbin/mtree |
|---|
| 251 | configure:5348: checking for open |
|---|
| 252 | configure:5366: found /usr/bin/open |
|---|
| 253 | configure:5378: result: /usr/bin/open |
|---|
| 254 | configure:5388: checking for openssl |
|---|
| 255 | configure:5406: found /usr/bin/openssl |
|---|
| 256 | configure:5418: result: /usr/bin/openssl |
|---|
| 257 | configure:5428: checking for patch |
|---|
| 258 | configure:5446: found /usr/bin/patch |
|---|
| 259 | configure:5458: result: /usr/bin/patch |
|---|
| 260 | configure:5468: checking for pax |
|---|
| 261 | configure:5486: found /bin/pax |
|---|
| 262 | configure:5498: result: /bin/pax |
|---|
| 263 | configure:5508: checking for rmdir |
|---|
| 264 | configure:5526: found /bin/rmdir |
|---|
| 265 | configure:5538: result: /bin/rmdir |
|---|
| 266 | configure:5548: checking for rsync |
|---|
| 267 | configure:5566: found /usr/bin/rsync |
|---|
| 268 | configure:5578: result: /usr/bin/rsync |
|---|
| 269 | configure:5588: checking for sandbox-exec |
|---|
| 270 | configure:5606: found /usr/bin/sandbox-exec |
|---|
| 271 | configure:5618: result: /usr/bin/sandbox-exec |
|---|
| 272 | configure:5628: checking for sed |
|---|
| 273 | configure:5646: found /usr/bin/sed |
|---|
| 274 | configure:5658: result: /usr/bin/sed |
|---|
| 275 | configure:5668: checking for svn |
|---|
| 276 | configure:5686: found /usr/bin/svn |
|---|
| 277 | configure:5698: result: /usr/bin/svn |
|---|
| 278 | configure:5708: checking for swig |
|---|
| 279 | configure:5742: result: no |
|---|
| 280 | configure:5749: checking for tar |
|---|
| 281 | configure:5767: found /usr/bin/tar |
|---|
| 282 | configure:5779: result: /usr/bin/tar |
|---|
| 283 | configure:5789: checking for unzip |
|---|
| 284 | configure:5807: found /usr/bin/unzip |
|---|
| 285 | configure:5819: result: /usr/bin/unzip |
|---|
| 286 | configure:5829: checking for xar |
|---|
| 287 | configure:5847: found /usr/bin/xar |
|---|
| 288 | configure:5859: result: /usr/bin/xar |
|---|
| 289 | configure:5869: checking for xcodebuild |
|---|
| 290 | configure:5887: found /usr/bin/xcodebuild |
|---|
| 291 | configure:5899: result: /usr/bin/xcodebuild |
|---|
| 292 | configure:5909: checking for xcrun |
|---|
| 293 | configure:5927: found /usr/bin/xcrun |
|---|
| 294 | configure:5939: result: /usr/bin/xcrun |
|---|
| 295 | configure:5949: checking for xz |
|---|
| 296 | configure:5982: result: no |
|---|
| 297 | configure:5989: checking for zip |
|---|
| 298 | configure:6007: found /usr/bin/zip |
|---|
| 299 | configure:6019: result: /usr/bin/zip |
|---|
| 300 | configure:6030: checking for launchd |
|---|
| 301 | configure:6046: found /sbin/launchd |
|---|
| 302 | configure:6057: result: yes |
|---|
| 303 | configure:6092: checking for sed |
|---|
| 304 | configure:6122: result: /usr/bin/sed |
|---|
| 305 | configure:6135: checking which sed flag to use for extended regexp |
|---|
| 306 | configure:6145: result: -E (BSD) |
|---|
| 307 | configure:6162: checking for tar |
|---|
| 308 | configure:6192: result: /usr/bin/tar |
|---|
| 309 | configure:6201: checking whether tar supports -q |
|---|
| 310 | configure:6204: result: yes (bsdtar) |
|---|
| 311 | configure:6217: checking for tar |
|---|
| 312 | configure:6247: result: /usr/bin/tar |
|---|
| 313 | configure:6257: checking for gnutar |
|---|
| 314 | configure:6290: result: no |
|---|
| 315 | configure:6296: checking for which tar variant to use |
|---|
| 316 | configure:6303: result: /usr/bin/tar |
|---|
| 317 | configure:6307: checking for /usr/bin/tar --no-same-owner support |
|---|
| 318 | configure:6311: result: no |
|---|
| 319 | configure:6322: checking for patch |
|---|
| 320 | configure:6352: result: /usr/bin/patch |
|---|
| 321 | configure:6362: checking for gpatch |
|---|
| 322 | configure:6395: result: no |
|---|
| 323 | configure:6401: checking for GNU (FSF) patch |
|---|
| 324 | configure:6413: result: /usr/bin/patch |
|---|
| 325 | configure:6445: checking how to mark unused variables |
|---|
| 326 | configure:6451: gcc -c -g -O2 conftest.c >&5 |
|---|
| 327 | configure:6451: $? = 0 |
|---|
| 328 | configure:6461: result: |
|---|
| 329 | configure:6466: checking for gcc symbol visibility attribute |
|---|
| 330 | configure:6485: gcc -c -g -O2 conftest.c >&5 |
|---|
| 331 | configure:6485: $? = 0 |
|---|
| 332 | configure:6499: result: __attribute__((visibility("hidden"))) |
|---|
| 333 | configure:6684: checking for the pthreads library -lpthreads |
|---|
| 334 | configure:6717: gcc -o conftest -g -O2 conftest.c -lpthreads >&5 |
|---|
| 335 | ld: library not found for -lpthreads |
|---|
| 336 | clang: error: linker command failed with exit code 1 (use -v to see invocation) |
|---|
| 337 | configure:6717: $? = 1 |
|---|
| 338 | configure: failed program was: |
|---|
| 339 | | /* confdefs.h */ |
|---|
| 340 | | #define PACKAGE_NAME "MacPorts" |
|---|
| 341 | | #define PACKAGE_TARNAME "macports" |
|---|
| 342 | | #define PACKAGE_VERSION "2.2.99" |
|---|
| 343 | | #define PACKAGE_STRING "MacPorts 2.2.99" |
|---|
| 344 | | #define PACKAGE_BUGREPORT "macports-dev@lists.macosforge.org" |
|---|
| 345 | | #define PACKAGE_URL "" |
|---|
| 346 | | #define UNUSED __attribute__((unused)) |
|---|
| 347 | | #define MP_PRIVATE __attribute__((visibility("hidden"))) |
|---|
| 348 | | /* end confdefs.h. */ |
|---|
| 349 | | #include <pthread.h> |
|---|
| 350 | | int |
|---|
| 351 | | main () |
|---|
| 352 | | { |
|---|
| 353 | | pthread_t th; pthread_join(th, 0); |
|---|
| 354 | | pthread_attr_init(0); pthread_cleanup_push(0, 0); |
|---|
| 355 | | pthread_create(0,0,0,0); pthread_cleanup_pop(0); |
|---|
| 356 | | ; |
|---|
| 357 | | return 0; |
|---|
| 358 | | } |
|---|
| 359 | configure:6726: result: no |
|---|
| 360 | configure:6629: checking whether pthreads work without any flags |
|---|
| 361 | configure:6717: gcc -o conftest -g -O2 conftest.c >&5 |
|---|
| 362 | configure:6717: $? = 0 |
|---|
| 363 | configure:6726: result: yes |
|---|
| 364 | configure:6745: checking for joinable pthread attribute |
|---|
| 365 | configure:6760: gcc -o conftest -g -O2 conftest.c >&5 |
|---|
| 366 | configure:6760: $? = 0 |
|---|
| 367 | configure:6766: result: PTHREAD_CREATE_JOINABLE |
|---|
| 368 | configure:6776: checking if more special flags are required for pthreads |
|---|
| 369 | configure:6783: result: -D_THREAD_SAFE |
|---|
| 370 | configure:6820: checking how to run the Objective C preprocessor |
|---|
| 371 | configure:6847: gcc -E conftest.m |
|---|
| 372 | configure:6847: $? = 0 |
|---|
| 373 | configure:6861: gcc -E conftest.m |
|---|
| 374 | conftest.m:12:10: fatal error: 'ac_nonexistent.h' file not found |
|---|
| 375 | #include <ac_nonexistent.h> |
|---|
| 376 | ^ |
|---|
| 377 | 1 error generated. |
|---|
| 378 | configure:6861: $? = 1 |
|---|
| 379 | configure: failed program was: |
|---|
| 380 | | /* confdefs.h */ |
|---|
| 381 | | #define PACKAGE_NAME "MacPorts" |
|---|
| 382 | | #define PACKAGE_TARNAME "macports" |
|---|
| 383 | | #define PACKAGE_VERSION "2.2.99" |
|---|
| 384 | | #define PACKAGE_STRING "MacPorts 2.2.99" |
|---|
| 385 | | #define PACKAGE_BUGREPORT "macports-dev@lists.macosforge.org" |
|---|
| 386 | | #define PACKAGE_URL "" |
|---|
| 387 | | #define UNUSED __attribute__((unused)) |
|---|
| 388 | | #define MP_PRIVATE __attribute__((visibility("hidden"))) |
|---|
| 389 | | #define HAVE_PTHREAD 1 |
|---|
| 390 | | /* end confdefs.h. */ |
|---|
| 391 | | #include <ac_nonexistent.h> |
|---|
| 392 | configure:6886: result: gcc -E |
|---|
| 393 | configure:6906: gcc -E conftest.m |
|---|
| 394 | configure:6906: $? = 0 |
|---|
| 395 | configure:6920: gcc -E conftest.m |
|---|
| 396 | conftest.m:12:10: fatal error: 'ac_nonexistent.h' file not found |
|---|
| 397 | #include <ac_nonexistent.h> |
|---|
| 398 | ^ |
|---|
| 399 | 1 error generated. |
|---|
| 400 | configure:6920: $? = 1 |
|---|
| 401 | configure: failed program was: |
|---|
| 402 | | /* confdefs.h */ |
|---|
| 403 | | #define PACKAGE_NAME "MacPorts" |
|---|
| 404 | | #define PACKAGE_TARNAME "macports" |
|---|
| 405 | | #define PACKAGE_VERSION "2.2.99" |
|---|
| 406 | | #define PACKAGE_STRING "MacPorts 2.2.99" |
|---|
| 407 | | #define PACKAGE_BUGREPORT "macports-dev@lists.macosforge.org" |
|---|
| 408 | | #define PACKAGE_URL "" |
|---|
| 409 | | #define UNUSED __attribute__((unused)) |
|---|
| 410 | | #define MP_PRIVATE __attribute__((visibility("hidden"))) |
|---|
| 411 | | #define HAVE_PTHREAD 1 |
|---|
| 412 | | /* end confdefs.h. */ |
|---|
| 413 | | #include <ac_nonexistent.h> |
|---|
| 414 | configure:6949: checking for grep that handles long lines and -e |
|---|
| 415 | configure:7007: result: /usr/bin/grep |
|---|
| 416 | configure:7012: checking for egrep |
|---|
| 417 | configure:7074: result: /usr/bin/grep -E |
|---|
| 418 | configure:7079: checking for ANSI C header files |
|---|
| 419 | configure:7099: gcc -c -g -O2 conftest.m >&5 |
|---|
| 420 | configure:7099: $? = 0 |
|---|
| 421 | configure:7172: gcc -o conftest -g -O2 conftest.m >&5 |
|---|
| 422 | configure:7172: $? = 0 |
|---|
| 423 | configure:7172: ./conftest |
|---|
| 424 | configure:7172: $? = 0 |
|---|
| 425 | configure:7183: result: yes |
|---|
| 426 | configure:7196: checking for sys/types.h |
|---|
| 427 | configure:7196: gcc -c -g -O2 conftest.m >&5 |
|---|
| 428 | configure:7196: $? = 0 |
|---|
| 429 | configure:7196: result: yes |
|---|
| 430 | configure:7196: checking for sys/stat.h |
|---|
| 431 | configure:7196: gcc -c -g -O2 conftest.m >&5 |
|---|
| 432 | configure:7196: $? = 0 |
|---|
| 433 | configure:7196: result: yes |
|---|
| 434 | configure:7196: checking for stdlib.h |
|---|
| 435 | configure:7196: gcc -c -g -O2 conftest.m >&5 |
|---|
| 436 | configure:7196: $? = 0 |
|---|
| 437 | configure:7196: result: yes |
|---|
| 438 | configure:7196: checking for string.h |
|---|
| 439 | configure:7196: gcc -c -g -O2 conftest.m >&5 |
|---|
| 440 | configure:7196: $? = 0 |
|---|
| 441 | configure:7196: result: yes |
|---|
| 442 | configure:7196: checking for memory.h |
|---|
| 443 | configure:7196: gcc -c -g -O2 conftest.m >&5 |
|---|
| 444 | configure:7196: $? = 0 |
|---|
| 445 | configure:7196: result: yes |
|---|
| 446 | configure:7196: checking for strings.h |
|---|
| 447 | configure:7196: gcc -c -g -O2 conftest.m >&5 |
|---|
| 448 | configure:7196: $? = 0 |
|---|
| 449 | configure:7196: result: yes |
|---|
| 450 | configure:7196: checking for inttypes.h |
|---|
| 451 | configure:7196: gcc -c -g -O2 conftest.m >&5 |
|---|
| 452 | configure:7196: $? = 0 |
|---|
| 453 | configure:7196: result: yes |
|---|
| 454 | configure:7196: checking for stdint.h |
|---|
| 455 | configure:7196: gcc -c -g -O2 conftest.m >&5 |
|---|
| 456 | configure:7196: $? = 0 |
|---|
| 457 | configure:7196: result: yes |
|---|
| 458 | configure:7196: checking for unistd.h |
|---|
| 459 | configure:7196: gcc -c -g -O2 conftest.m >&5 |
|---|
| 460 | configure:7196: $? = 0 |
|---|
| 461 | configure:7196: result: yes |
|---|
| 462 | configure:7243: checking objc/objc.h usability |
|---|
| 463 | configure:7243: gcc -c -g -O2 conftest.m >&5 |
|---|
| 464 | configure:7243: $? = 0 |
|---|
| 465 | configure:7243: result: yes |
|---|
| 466 | configure:7243: checking objc/objc.h presence |
|---|
| 467 | configure:7243: gcc -E conftest.m |
|---|
| 468 | configure:7243: $? = 0 |
|---|
| 469 | configure:7243: result: yes |
|---|
| 470 | configure:7243: checking for objc/objc.h |
|---|
| 471 | configure:7243: result: yes |
|---|
| 472 | configure:7268: checking if linking libobjc requires pthreads |
|---|
| 473 | configure:7297: gcc -o conftest -g -O2 conftest.m -lobjc >&5 |
|---|
| 474 | conftest.m:32:7: error: use of undeclared identifier 'Object' |
|---|
| 475 | Object *obj = [Object alloc]; |
|---|
| 476 | ^ |
|---|
| 477 | conftest.m:32:15: error: use of undeclared identifier 'obj' |
|---|
| 478 | Object *obj = [Object alloc]; |
|---|
| 479 | ^ |
|---|
| 480 | conftest.m:32:22: error: use of undeclared identifier 'Object' |
|---|
| 481 | Object *obj = [Object alloc]; |
|---|
| 482 | ^ |
|---|
| 483 | conftest.m:33:7: warning: implicit declaration of function 'puts' is invalid in C99 [-Wimplicit-function-declaration] |
|---|
| 484 | puts([obj name]); |
|---|
| 485 | ^ |
|---|
| 486 | conftest.m:33:13: error: use of undeclared identifier 'obj' |
|---|
| 487 | puts([obj name]); |
|---|
| 488 | ^ |
|---|
| 489 | 1 warning and 4 errors generated. |
|---|
| 490 | configure:7297: $? = 1 |
|---|
| 491 | configure: failed program was: |
|---|
| 492 | | /* confdefs.h */ |
|---|
| 493 | | #define PACKAGE_NAME "MacPorts" |
|---|
| 494 | | #define PACKAGE_TARNAME "macports" |
|---|
| 495 | | #define PACKAGE_VERSION "2.2.99" |
|---|
| 496 | | #define PACKAGE_STRING "MacPorts 2.2.99" |
|---|
| 497 | | #define PACKAGE_BUGREPORT "macports-dev@lists.macosforge.org" |
|---|
| 498 | | #define PACKAGE_URL "" |
|---|
| 499 | | #define UNUSED __attribute__((unused)) |
|---|
| 500 | | #define MP_PRIVATE __attribute__((visibility("hidden"))) |
|---|
| 501 | | #define HAVE_PTHREAD 1 |
|---|
| 502 | | #define STDC_HEADERS 1 |
|---|
| 503 | | #define HAVE_SYS_TYPES_H 1 |
|---|
| 504 | | #define HAVE_SYS_STAT_H 1 |
|---|
| 505 | | #define HAVE_STDLIB_H 1 |
|---|
| 506 | | #define HAVE_STRING_H 1 |
|---|
| 507 | | #define HAVE_MEMORY_H 1 |
|---|
| 508 | | #define HAVE_STRINGS_H 1 |
|---|
| 509 | | #define HAVE_INTTYPES_H 1 |
|---|
| 510 | | #define HAVE_STDINT_H 1 |
|---|
| 511 | | #define HAVE_UNISTD_H 1 |
|---|
| 512 | | #define HAVE_OBJC_OBJC_H 1 |
|---|
| 513 | | /* end confdefs.h. */ |
|---|
| 514 | | |
|---|
| 515 | | |
|---|
| 516 | | #include <objc/objc.h> |
|---|
| 517 | | #include <objc/Object.h> |
|---|
| 518 | | |
|---|
| 519 | | int |
|---|
| 520 | | main () |
|---|
| 521 | | { |
|---|
| 522 | | |
|---|
| 523 | | Object *obj = [Object alloc]; |
|---|
| 524 | | puts([obj name]); |
|---|
| 525 | | |
|---|
| 526 | | ; |
|---|
| 527 | | return 0; |
|---|
| 528 | | } |
|---|
| 529 | | |
|---|
| 530 | configure:7335: gcc -o conftest -g -O2 -D_THREAD_SAFE conftest.m -lobjc >&5 |
|---|
| 531 | conftest.m:32:8: error: use of undeclared identifier 'Object' |
|---|
| 532 | Object *obj = [Object alloc]; |
|---|
| 533 | ^ |
|---|
| 534 | conftest.m:32:16: error: use of undeclared identifier 'obj' |
|---|
| 535 | Object *obj = [Object alloc]; |
|---|
| 536 | ^ |
|---|
| 537 | conftest.m:32:23: error: use of undeclared identifier 'Object' |
|---|
| 538 | Object *obj = [Object alloc]; |
|---|
| 539 | ^ |
|---|
| 540 | conftest.m:33:8: warning: implicit declaration of function 'puts' is invalid in C99 [-Wimplicit-function-declaration] |
|---|
| 541 | puts([obj name]); |
|---|
| 542 | ^ |
|---|
| 543 | conftest.m:33:14: error: use of undeclared identifier 'obj' |
|---|
| 544 | puts([obj name]); |
|---|
| 545 | ^ |
|---|
| 546 | 1 warning and 4 errors generated. |
|---|
| 547 | configure:7335: $? = 1 |
|---|
| 548 | configure: failed program was: |
|---|
| 549 | | /* confdefs.h */ |
|---|
| 550 | | #define PACKAGE_NAME "MacPorts" |
|---|
| 551 | | #define PACKAGE_TARNAME "macports" |
|---|
| 552 | | #define PACKAGE_VERSION "2.2.99" |
|---|
| 553 | | #define PACKAGE_STRING "MacPorts 2.2.99" |
|---|
| 554 | | #define PACKAGE_BUGREPORT "macports-dev@lists.macosforge.org" |
|---|
| 555 | | #define PACKAGE_URL "" |
|---|
| 556 | | #define UNUSED __attribute__((unused)) |
|---|
| 557 | | #define MP_PRIVATE __attribute__((visibility("hidden"))) |
|---|
| 558 | | #define HAVE_PTHREAD 1 |
|---|
| 559 | | #define STDC_HEADERS 1 |
|---|
| 560 | | #define HAVE_SYS_TYPES_H 1 |
|---|
| 561 | | #define HAVE_SYS_STAT_H 1 |
|---|
| 562 | | #define HAVE_STDLIB_H 1 |
|---|
| 563 | | #define HAVE_STRING_H 1 |
|---|
| 564 | | #define HAVE_MEMORY_H 1 |
|---|
| 565 | | #define HAVE_STRINGS_H 1 |
|---|
| 566 | | #define HAVE_INTTYPES_H 1 |
|---|
| 567 | | #define HAVE_STDINT_H 1 |
|---|
| 568 | | #define HAVE_UNISTD_H 1 |
|---|
| 569 | | #define HAVE_OBJC_OBJC_H 1 |
|---|
| 570 | | /* end confdefs.h. */ |
|---|
| 571 | | |
|---|
| 572 | | |
|---|
| 573 | | #include <objc/objc.h> |
|---|
| 574 | | #include <objc/Object.h> |
|---|
| 575 | | |
|---|
| 576 | | int |
|---|
| 577 | | main () |
|---|
| 578 | | { |
|---|
| 579 | | |
|---|
| 580 | | Object *obj = [Object alloc]; |
|---|
| 581 | | puts([obj name]); |
|---|
| 582 | | |
|---|
| 583 | | ; |
|---|
| 584 | | return 0; |
|---|
| 585 | | } |
|---|
| 586 | | |
|---|
| 587 | configure:7355: result: no |
|---|
| 588 | configure:7368: checking for Apple Objective-C runtime |
|---|
| 589 | configure:7397: gcc -o conftest -g -O2 -D_THREAD_SAFE conftest.m -lobjc >&5 |
|---|
| 590 | conftest.m:32:19: warning: implicit declaration of function 'objc_lookUpClass' is invalid in C99 [-Wimplicit-function-declaration] |
|---|
| 591 | id class = objc_lookUpClass("Object"); |
|---|
| 592 | ^ |
|---|
| 593 | conftest.m:32:11: warning: incompatible integer to pointer conversion initializing 'id' with an expression of type 'int' [-Wint-conversion] |
|---|
| 594 | id class = objc_lookUpClass("Object"); |
|---|
| 595 | ^ ~~~~~~~~~~~~~~~~~~~~~~~~~~ |
|---|
| 596 | conftest.m:33:24: warning: instance method '-alloc' not found (return type defaults to 'id') [-Wobjc-method-access] |
|---|
| 597 | id obj = [class alloc]; |
|---|
| 598 | ^~~~~ |
|---|
| 599 | conftest.m:34:8: warning: implicit declaration of function 'puts' is invalid in C99 [-Wimplicit-function-declaration] |
|---|
| 600 | puts([obj name]); |
|---|
| 601 | ^ |
|---|
| 602 | conftest.m:34:18: warning: instance method '-name' not found (return type defaults to 'id') [-Wobjc-method-access] |
|---|
| 603 | puts([obj name]); |
|---|
| 604 | ^~~~ |
|---|
| 605 | 5 warnings generated. |
|---|
| 606 | configure:7397: $? = 0 |
|---|
| 607 | configure:7412: result: yes |
|---|
| 608 | configure:7419: checking for GNU Objective C runtime |
|---|
| 609 | configure:7448: gcc -o conftest -g -O2 -D_THREAD_SAFE conftest.m -lobjc >&5 |
|---|
| 610 | conftest.m:32:19: warning: implicit declaration of function 'objc_lookup_class' is invalid in C99 [-Wimplicit-function-declaration] |
|---|
| 611 | id class = objc_lookup_class("Object"); |
|---|
| 612 | ^ |
|---|
| 613 | conftest.m:32:11: warning: incompatible integer to pointer conversion initializing 'id' with an expression of type 'int' [-Wint-conversion] |
|---|
| 614 | id class = objc_lookup_class("Object"); |
|---|
| 615 | ^ ~~~~~~~~~~~~~~~~~~~~~~~~~~~ |
|---|
| 616 | conftest.m:33:24: warning: instance method '-alloc' not found (return type defaults to 'id') [-Wobjc-method-access] |
|---|
| 617 | id obj = [class alloc]; |
|---|
| 618 | ^~~~~ |
|---|
| 619 | conftest.m:34:8: warning: implicit declaration of function 'puts' is invalid in C99 [-Wimplicit-function-declaration] |
|---|
| 620 | puts([obj name]); |
|---|
| 621 | ^ |
|---|
| 622 | conftest.m:34:18: warning: instance method '-name' not found (return type defaults to 'id') [-Wobjc-method-access] |
|---|
| 623 | puts([obj name]); |
|---|
| 624 | ^~~~ |
|---|
| 625 | 5 warnings generated. |
|---|
| 626 | Undefined symbols for architecture x86_64: |
|---|
| 627 | "_objc_lookup_class", referenced from: |
|---|
| 628 | _main in conftest-f6sHAz.o |
|---|
| 629 | ld: symbol(s) not found for architecture x86_64 |
|---|
| 630 | clang: error: linker command failed with exit code 1 (use -v to see invocation) |
|---|
| 631 | configure:7448: $? = 1 |
|---|
| 632 | configure: failed program was: |
|---|
| 633 | | /* confdefs.h */ |
|---|
| 634 | | #define PACKAGE_NAME "MacPorts" |
|---|
| 635 | | #define PACKAGE_TARNAME "macports" |
|---|
| 636 | | #define PACKAGE_VERSION "2.2.99" |
|---|
| 637 | | #define PACKAGE_STRING "MacPorts 2.2.99" |
|---|
| 638 | | #define PACKAGE_BUGREPORT "macports-dev@lists.macosforge.org" |
|---|
| 639 | | #define PACKAGE_URL "" |
|---|
| 640 | | #define UNUSED __attribute__((unused)) |
|---|
| 641 | | #define MP_PRIVATE __attribute__((visibility("hidden"))) |
|---|
| 642 | | #define HAVE_PTHREAD 1 |
|---|
| 643 | | #define STDC_HEADERS 1 |
|---|
| 644 | | #define HAVE_SYS_TYPES_H 1 |
|---|
| 645 | | #define HAVE_SYS_STAT_H 1 |
|---|
| 646 | | #define HAVE_STDLIB_H 1 |
|---|
| 647 | | #define HAVE_STRING_H 1 |
|---|
| 648 | | #define HAVE_MEMORY_H 1 |
|---|
| 649 | | #define HAVE_STRINGS_H 1 |
|---|
| 650 | | #define HAVE_INTTYPES_H 1 |
|---|
| 651 | | #define HAVE_STDINT_H 1 |
|---|
| 652 | | #define HAVE_UNISTD_H 1 |
|---|
| 653 | | #define HAVE_OBJC_OBJC_H 1 |
|---|
| 654 | | /* end confdefs.h. */ |
|---|
| 655 | | |
|---|
| 656 | | |
|---|
| 657 | | #include <objc/objc.h> |
|---|
| 658 | | #include <objc/objc-api.h> |
|---|
| 659 | | |
|---|
| 660 | | int |
|---|
| 661 | | main () |
|---|
| 662 | | { |
|---|
| 663 | | |
|---|
| 664 | | id class = objc_lookup_class("Object"); |
|---|
| 665 | | id obj = [class alloc]; |
|---|
| 666 | | puts([obj name]); |
|---|
| 667 | | |
|---|
| 668 | | ; |
|---|
| 669 | | return 0; |
|---|
| 670 | | } |
|---|
| 671 | | |
|---|
| 672 | configure:7463: result: no |
|---|
| 673 | configure:7475: Using Apple Objective-C runtime |
|---|
| 674 | configure:7555: checking for Apple Foundation library |
|---|
| 675 | configure:7591: gcc -o conftest -g -O2 conftest.m -framework Foundation >&5 |
|---|
| 676 | conftest.m:32:46: warning: 'initWithCString:' is deprecated [-Wdeprecated-declarations] |
|---|
| 677 | NSString *string = [[NSString alloc] initWithCString: "Hello World"]; |
|---|
| 678 | ^ |
|---|
| 679 | /Applications/Xcode.app/Contents/Developer/Platforms/MacOSX.platform/Developer/SDKs/MacOSX10.8.sdk/System/Library/Frameworks/Foundation.framework/Headers/NSString.h:361:1: note: method 'initWithCString:' declared here |
|---|
| 680 | - (id)initWithCString:(const char *)bytes NS_DEPRECATED(10_0, 10_4, 2_0, 2_0); |
|---|
| 681 | ^ |
|---|
| 682 | conftest.m:33:19: warning: class method '+length' not found (return type defaults to 'id') [-Wobjc-method-access] |
|---|
| 683 | [NSString length]; |
|---|
| 684 | ^~~~~~ |
|---|
| 685 | 2 warnings generated. |
|---|
| 686 | configure:7591: $? = 0 |
|---|
| 687 | configure:7609: result: yes |
|---|
| 688 | configure:7621: WARNING: GNUSTEP_SYSTEM_ROOT is not defined in your environment, preventing the use of GNUstep's Foundation library |
|---|
| 689 | configure:7708: Using Apple Foundation library |
|---|
| 690 | configure:7744: checking for CoreFoundation framework |
|---|
| 691 | configure:7772: gcc -o conftest -g -O2 conftest.c -framework CoreFoundation >&5 |
|---|
| 692 | configure:7772: $? = 0 |
|---|
| 693 | configure:7790: result: yes |
|---|
| 694 | configure:7804: checking for SystemConfiguration framework |
|---|
| 695 | configure:7832: gcc -o conftest -g -O2 conftest.c -framework SystemConfiguration >&5 |
|---|
| 696 | configure:7832: $? = 0 |
|---|
| 697 | configure:7850: result: yes |
|---|
| 698 | configure:7864: checking for IOKit framework |
|---|
| 699 | configure:7892: gcc -o conftest -g -O2 conftest.c -framework IOKit >&5 |
|---|
| 700 | conftest.c:36:6: warning: implicit declaration of function 'IORegisterForSystemPower' is invalid in C99 [-Wimplicit-function-declaration] |
|---|
| 701 | IORegisterForSystemPower(0, NULL, NULL, NULL); |
|---|
| 702 | ^ |
|---|
| 703 | 1 warning generated. |
|---|
| 704 | configure:7892: $? = 0 |
|---|
| 705 | configure:7910: result: yes |
|---|
| 706 | configure:7924: checking for CFNotificationCenterGetDarwinNotifyCenter |
|---|
| 707 | configure:7951: gcc -o conftest -g -O2 conftest.c -framework CoreFoundation >&5 |
|---|
| 708 | configure:7951: $? = 0 |
|---|
| 709 | configure:7969: result: yes |
|---|
| 710 | configure:7986: checking for whether we will build daemondo |
|---|
| 711 | configure:8003: result: yes |
|---|
| 712 | configure:8038: checking for ports tree |
|---|
| 713 | configure:8060: WARNING: No ports tree found |
|---|
| 714 | configure:8067: checking for MacPorts config directory |
|---|
| 715 | configure:8072: result: ${sysconfdir}/macports |
|---|
| 716 | configure:8145: checking for install user |
|---|
| 717 | configure:8151: result: root |
|---|
| 718 | configure:8165: checking for install group |
|---|
| 719 | configure:8185: result: admin |
|---|
| 720 | configure:8199: checking for macports user |
|---|
| 721 | configure:8205: result: macports |
|---|
| 722 | configure:8219: checking what permissions to use for installation directories |
|---|
| 723 | configure:8225: result: 0755 |
|---|
| 724 | configure:8265: checking for Applications installation directory |
|---|
| 725 | configure:8276: result: /Applications/MacPorts |
|---|
| 726 | configure:8295: checking for Frameworks installation directory |
|---|
| 727 | configure:8302: result: /opt/local/Library/Frameworks |
|---|
| 728 | configure:8328: checking for Universal CPU architectures |
|---|
| 729 | configure:8330: result: x86_64 i386 |
|---|
| 730 | configure:8341: checking how to run the C preprocessor |
|---|
| 731 | configure:8372: gcc -E conftest.c |
|---|
| 732 | configure:8372: $? = 0 |
|---|
| 733 | configure:8386: gcc -E conftest.c |
|---|
| 734 | conftest.c:29:10: fatal error: 'ac_nonexistent.h' file not found |
|---|
| 735 | #include <ac_nonexistent.h> |
|---|
| 736 | ^ |
|---|
| 737 | 1 error generated. |
|---|
| 738 | configure:8386: $? = 1 |
|---|
| 739 | configure: failed program was: |
|---|
| 740 | | /* confdefs.h */ |
|---|
| 741 | | #define PACKAGE_NAME "MacPorts" |
|---|
| 742 | | #define PACKAGE_TARNAME "macports" |
|---|
| 743 | | #define PACKAGE_VERSION "2.2.99" |
|---|
| 744 | | #define PACKAGE_STRING "MacPorts 2.2.99" |
|---|
| 745 | | #define PACKAGE_BUGREPORT "macports-dev@lists.macosforge.org" |
|---|
| 746 | | #define PACKAGE_URL "" |
|---|
| 747 | | #define UNUSED __attribute__((unused)) |
|---|
| 748 | | #define MP_PRIVATE __attribute__((visibility("hidden"))) |
|---|
| 749 | | #define HAVE_PTHREAD 1 |
|---|
| 750 | | #define STDC_HEADERS 1 |
|---|
| 751 | | #define HAVE_SYS_TYPES_H 1 |
|---|
| 752 | | #define HAVE_SYS_STAT_H 1 |
|---|
| 753 | | #define HAVE_STDLIB_H 1 |
|---|
| 754 | | #define HAVE_STRING_H 1 |
|---|
| 755 | | #define HAVE_MEMORY_H 1 |
|---|
| 756 | | #define HAVE_STRINGS_H 1 |
|---|
| 757 | | #define HAVE_INTTYPES_H 1 |
|---|
| 758 | | #define HAVE_STDINT_H 1 |
|---|
| 759 | | #define HAVE_UNISTD_H 1 |
|---|
| 760 | | #define HAVE_OBJC_OBJC_H 1 |
|---|
| 761 | | #define APPLE_RUNTIME 1 |
|---|
| 762 | | #define APPLE_FOUNDATION 1 |
|---|
| 763 | | #define HAVE_FRAMEWORK_COREFOUNDATION /**/ |
|---|
| 764 | | #define HAVE_FRAMEWORK_SYSTEMCONFIGURATION /**/ |
|---|
| 765 | | #define HAVE_FRAMEWORK_IOKIT /**/ |
|---|
| 766 | | #define HAVE_FUNCTION_CFNOTIFICATIONCENTERGETDARWINNOTIFYCENTER /**/ |
|---|
| 767 | | /* end confdefs.h. */ |
|---|
| 768 | | #include <ac_nonexistent.h> |
|---|
| 769 | configure:8411: result: gcc -E |
|---|
| 770 | configure:8431: gcc -E conftest.c |
|---|
| 771 | configure:8431: $? = 0 |
|---|
| 772 | configure:8445: gcc -E conftest.c |
|---|
| 773 | conftest.c:29:10: fatal error: 'ac_nonexistent.h' file not found |
|---|
| 774 | #include <ac_nonexistent.h> |
|---|
| 775 | ^ |
|---|
| 776 | 1 error generated. |
|---|
| 777 | configure:8445: $? = 1 |
|---|
| 778 | configure: failed program was: |
|---|
| 779 | | /* confdefs.h */ |
|---|
| 780 | | #define PACKAGE_NAME "MacPorts" |
|---|
| 781 | | #define PACKAGE_TARNAME "macports" |
|---|
| 782 | | #define PACKAGE_VERSION "2.2.99" |
|---|
| 783 | | #define PACKAGE_STRING "MacPorts 2.2.99" |
|---|
| 784 | | #define PACKAGE_BUGREPORT "macports-dev@lists.macosforge.org" |
|---|
| 785 | | #define PACKAGE_URL "" |
|---|
| 786 | | #define UNUSED __attribute__((unused)) |
|---|
| 787 | | #define MP_PRIVATE __attribute__((visibility("hidden"))) |
|---|
| 788 | | #define HAVE_PTHREAD 1 |
|---|
| 789 | | #define STDC_HEADERS 1 |
|---|
| 790 | | #define HAVE_SYS_TYPES_H 1 |
|---|
| 791 | | #define HAVE_SYS_STAT_H 1 |
|---|
| 792 | | #define HAVE_STDLIB_H 1 |
|---|
| 793 | | #define HAVE_STRING_H 1 |
|---|
| 794 | | #define HAVE_MEMORY_H 1 |
|---|
| 795 | | #define HAVE_STRINGS_H 1 |
|---|
| 796 | | #define HAVE_INTTYPES_H 1 |
|---|
| 797 | | #define HAVE_STDINT_H 1 |
|---|
| 798 | | #define HAVE_UNISTD_H 1 |
|---|
| 799 | | #define HAVE_OBJC_OBJC_H 1 |
|---|
| 800 | | #define APPLE_RUNTIME 1 |
|---|
| 801 | | #define APPLE_FOUNDATION 1 |
|---|
| 802 | | #define HAVE_FRAMEWORK_COREFOUNDATION /**/ |
|---|
| 803 | | #define HAVE_FRAMEWORK_SYSTEMCONFIGURATION /**/ |
|---|
| 804 | | #define HAVE_FRAMEWORK_IOKIT /**/ |
|---|
| 805 | | #define HAVE_FUNCTION_CFNOTIFICATIONCENTERGETDARWINNOTIFYCENTER /**/ |
|---|
| 806 | | /* end confdefs.h. */ |
|---|
| 807 | | #include <ac_nonexistent.h> |
|---|
| 808 | configure:8474: checking for ANSI C header files |
|---|
| 809 | configure:8578: result: yes |
|---|
| 810 | configure:8589: checking for dirent.h that defines DIR |
|---|
| 811 | configure:8608: gcc -c -g -O2 conftest.c >&5 |
|---|
| 812 | configure:8608: $? = 0 |
|---|
| 813 | configure:8616: result: yes |
|---|
| 814 | configure:8629: checking for library containing opendir |
|---|
| 815 | configure:8660: gcc -o conftest -g -O2 conftest.c >&5 |
|---|
| 816 | configure:8660: $? = 0 |
|---|
| 817 | configure:8677: result: none required |
|---|
| 818 | configure:8744: checking for sys/wait.h that is POSIX.1 compatible |
|---|
| 819 | configure:8770: gcc -c -g -O2 conftest.c >&5 |
|---|
| 820 | configure:8770: $? = 0 |
|---|
| 821 | configure:8777: result: yes |
|---|
| 822 | configure:8789: checking limits.h usability |
|---|
| 823 | configure:8789: gcc -c -g -O2 conftest.c >&5 |
|---|
| 824 | configure:8789: $? = 0 |
|---|
| 825 | configure:8789: result: yes |
|---|
| 826 | configure:8789: checking limits.h presence |
|---|
| 827 | configure:8789: gcc -E conftest.c |
|---|
| 828 | configure:8789: $? = 0 |
|---|
| 829 | configure:8789: result: yes |
|---|
| 830 | configure:8789: checking for limits.h |
|---|
| 831 | configure:8789: result: yes |
|---|
| 832 | configure:8789: checking paths.h usability |
|---|
| 833 | configure:8789: gcc -c -g -O2 conftest.c >&5 |
|---|
| 834 | configure:8789: $? = 0 |
|---|
| 835 | configure:8789: result: yes |
|---|
| 836 | configure:8789: checking paths.h presence |
|---|
| 837 | configure:8789: gcc -E conftest.c |
|---|
| 838 | configure:8789: $? = 0 |
|---|
| 839 | configure:8789: result: yes |
|---|
| 840 | configure:8789: checking for paths.h |
|---|
| 841 | configure:8789: result: yes |
|---|
| 842 | configure:8789: checking sys/file.h usability |
|---|
| 843 | configure:8789: gcc -c -g -O2 conftest.c >&5 |
|---|
| 844 | configure:8789: $? = 0 |
|---|
| 845 | configure:8789: result: yes |
|---|
| 846 | configure:8789: checking sys/file.h presence |
|---|
| 847 | configure:8789: gcc -E conftest.c |
|---|
| 848 | configure:8789: $? = 0 |
|---|
| 849 | configure:8789: result: yes |
|---|
| 850 | configure:8789: checking for sys/file.h |
|---|
| 851 | configure:8789: result: yes |
|---|
| 852 | configure:8789: checking crt_externs.h usability |
|---|
| 853 | configure:8789: gcc -c -g -O2 conftest.c >&5 |
|---|
| 854 | configure:8789: $? = 0 |
|---|
| 855 | configure:8789: result: yes |
|---|
| 856 | configure:8789: checking crt_externs.h presence |
|---|
| 857 | configure:8789: gcc -E conftest.c |
|---|
| 858 | configure:8789: $? = 0 |
|---|
| 859 | configure:8789: result: yes |
|---|
| 860 | configure:8789: checking for crt_externs.h |
|---|
| 861 | configure:8789: result: yes |
|---|
| 862 | configure:8789: checking fcntl.h usability |
|---|
| 863 | configure:8789: gcc -c -g -O2 conftest.c >&5 |
|---|
| 864 | configure:8789: $? = 0 |
|---|
| 865 | configure:8789: result: yes |
|---|
| 866 | configure:8789: checking fcntl.h presence |
|---|
| 867 | configure:8789: gcc -E conftest.c |
|---|
| 868 | configure:8789: $? = 0 |
|---|
| 869 | configure:8789: result: yes |
|---|
| 870 | configure:8789: checking for fcntl.h |
|---|
| 871 | configure:8789: result: yes |
|---|
| 872 | configure:8789: checking sys/fcntl.h usability |
|---|
| 873 | configure:8789: gcc -c -g -O2 conftest.c >&5 |
|---|
| 874 | configure:8789: $? = 0 |
|---|
| 875 | configure:8789: result: yes |
|---|
| 876 | configure:8789: checking sys/fcntl.h presence |
|---|
| 877 | configure:8789: gcc -E conftest.c |
|---|
| 878 | configure:8789: $? = 0 |
|---|
| 879 | configure:8789: result: yes |
|---|
| 880 | configure:8789: checking for sys/fcntl.h |
|---|
| 881 | configure:8789: result: yes |
|---|
| 882 | configure:8789: checking sys/cdefs.h usability |
|---|
| 883 | configure:8789: gcc -c -g -O2 conftest.c >&5 |
|---|
| 884 | configure:8789: $? = 0 |
|---|
| 885 | configure:8789: result: yes |
|---|
| 886 | configure:8789: checking sys/cdefs.h presence |
|---|
| 887 | configure:8789: gcc -E conftest.c |
|---|
| 888 | configure:8789: $? = 0 |
|---|
| 889 | configure:8789: result: yes |
|---|
| 890 | configure:8789: checking for sys/cdefs.h |
|---|
| 891 | configure:8789: result: yes |
|---|
| 892 | configure:8789: checking err.h usability |
|---|
| 893 | configure:8789: gcc -c -g -O2 conftest.c >&5 |
|---|
| 894 | configure:8789: $? = 0 |
|---|
| 895 | configure:8789: result: yes |
|---|
| 896 | configure:8789: checking err.h presence |
|---|
| 897 | configure:8789: gcc -E conftest.c |
|---|
| 898 | configure:8789: $? = 0 |
|---|
| 899 | configure:8789: result: yes |
|---|
| 900 | configure:8789: checking for err.h |
|---|
| 901 | configure:8789: result: yes |
|---|
| 902 | configure:8789: checking sys/socket.h usability |
|---|
| 903 | configure:8789: gcc -c -g -O2 conftest.c >&5 |
|---|
| 904 | configure:8789: $? = 0 |
|---|
| 905 | configure:8789: result: yes |
|---|
| 906 | configure:8789: checking sys/socket.h presence |
|---|
| 907 | configure:8789: gcc -E conftest.c |
|---|
| 908 | configure:8789: $? = 0 |
|---|
| 909 | configure:8789: result: yes |
|---|
| 910 | configure:8789: checking for sys/socket.h |
|---|
| 911 | configure:8789: result: yes |
|---|
| 912 | configure:8789: checking sys/event.h usability |
|---|
| 913 | configure:8789: gcc -c -g -O2 conftest.c >&5 |
|---|
| 914 | configure:8789: $? = 0 |
|---|
| 915 | configure:8789: result: yes |
|---|
| 916 | configure:8789: checking sys/event.h presence |
|---|
| 917 | configure:8789: gcc -E conftest.c |
|---|
| 918 | configure:8789: $? = 0 |
|---|
| 919 | configure:8789: result: yes |
|---|
| 920 | configure:8789: checking for sys/event.h |
|---|
| 921 | configure:8789: result: yes |
|---|
| 922 | configure:8789: checking sys/sysctl.h usability |
|---|
| 923 | configure:8789: gcc -c -g -O2 conftest.c >&5 |
|---|
| 924 | configure:8789: $? = 0 |
|---|
| 925 | configure:8789: result: yes |
|---|
| 926 | configure:8789: checking sys/sysctl.h presence |
|---|
| 927 | configure:8789: gcc -E conftest.c |
|---|
| 928 | configure:8789: $? = 0 |
|---|
| 929 | configure:8789: result: yes |
|---|
| 930 | configure:8789: checking for sys/sysctl.h |
|---|
| 931 | configure:8789: result: yes |
|---|
| 932 | configure:8789: checking readline/readline.h usability |
|---|
| 933 | configure:8789: gcc -c -g -O2 conftest.c >&5 |
|---|
| 934 | configure:8789: $? = 0 |
|---|
| 935 | configure:8789: result: yes |
|---|
| 936 | configure:8789: checking readline/readline.h presence |
|---|
| 937 | configure:8789: gcc -E conftest.c |
|---|
| 938 | configure:8789: $? = 0 |
|---|
| 939 | configure:8789: result: yes |
|---|
| 940 | configure:8789: checking for readline/readline.h |
|---|
| 941 | configure:8789: result: yes |
|---|
| 942 | configure:8789: checking readline/history.h usability |
|---|
| 943 | configure:8789: gcc -c -g -O2 conftest.c >&5 |
|---|
| 944 | configure:8789: $? = 0 |
|---|
| 945 | configure:8789: result: yes |
|---|
| 946 | configure:8789: checking readline/history.h presence |
|---|
| 947 | configure:8789: gcc -E conftest.c |
|---|
| 948 | configure:8789: $? = 0 |
|---|
| 949 | configure:8789: result: yes |
|---|
| 950 | configure:8789: checking for readline/history.h |
|---|
| 951 | configure:8789: result: yes |
|---|
| 952 | configure:8789: checking pwd.h usability |
|---|
| 953 | configure:8789: gcc -c -g -O2 conftest.c >&5 |
|---|
| 954 | configure:8789: $? = 0 |
|---|
| 955 | configure:8789: result: yes |
|---|
| 956 | configure:8789: checking pwd.h presence |
|---|
| 957 | configure:8789: gcc -E conftest.c |
|---|
| 958 | configure:8789: $? = 0 |
|---|
| 959 | configure:8789: result: yes |
|---|
| 960 | configure:8789: checking for pwd.h |
|---|
| 961 | configure:8789: result: yes |
|---|
| 962 | configure:8789: checking sys/paths.h usability |
|---|
| 963 | configure:8789: gcc -c -g -O2 conftest.c >&5 |
|---|
| 964 | configure:8789: $? = 0 |
|---|
| 965 | configure:8789: result: yes |
|---|
| 966 | configure:8789: checking sys/paths.h presence |
|---|
| 967 | configure:8789: gcc -E conftest.c |
|---|
| 968 | configure:8789: $? = 0 |
|---|
| 969 | configure:8789: result: yes |
|---|
| 970 | configure:8789: checking for sys/paths.h |
|---|
| 971 | configure:8789: result: yes |
|---|
| 972 | configure:8789: checking utime.h usability |
|---|
| 973 | configure:8789: gcc -c -g -O2 conftest.c >&5 |
|---|
| 974 | configure:8789: $? = 0 |
|---|
| 975 | configure:8789: result: yes |
|---|
| 976 | configure:8789: checking utime.h presence |
|---|
| 977 | configure:8789: gcc -E conftest.c |
|---|
| 978 | configure:8789: $? = 0 |
|---|
| 979 | configure:8789: result: yes |
|---|
| 980 | configure:8789: checking for utime.h |
|---|
| 981 | configure:8789: result: yes |
|---|
| 982 | configure:8806: checking for bzero |
|---|
| 983 | configure:8806: gcc -o conftest -g -O2 conftest.c >&5 |
|---|
| 984 | conftest.c:71:6: warning: incompatible redeclaration of library function 'bzero' [-Wincompatible-library-redeclaration] |
|---|
| 985 | char bzero (); |
|---|
| 986 | ^ |
|---|
| 987 | conftest.c:71:6: note: 'bzero' is a builtin with type 'void (void *, unsigned long)' |
|---|
| 988 | 1 warning generated. |
|---|
| 989 | configure:8806: $? = 0 |
|---|
| 990 | configure:8806: result: yes |
|---|
| 991 | configure:8806: checking for memset |
|---|
| 992 | configure:8806: gcc -o conftest -g -O2 conftest.c >&5 |
|---|
| 993 | conftest.c:72:6: warning: incompatible redeclaration of library function 'memset' [-Wincompatible-library-redeclaration] |
|---|
| 994 | char memset (); |
|---|
| 995 | ^ |
|---|
| 996 | conftest.c:72:6: note: 'memset' is a builtin with type 'void *(void *, int, unsigned long)' |
|---|
| 997 | 1 warning generated. |
|---|
| 998 | configure:8806: $? = 0 |
|---|
| 999 | configure:8806: result: yes |
|---|
| 1000 | configure:8806: checking for fgetln |
|---|
| 1001 | configure:8806: gcc -o conftest -g -O2 conftest.c >&5 |
|---|
| 1002 | configure:8806: $? = 0 |
|---|
| 1003 | configure:8806: result: yes |
|---|
| 1004 | configure:8806: checking for lockf |
|---|
| 1005 | configure:8806: gcc -o conftest -g -O2 conftest.c >&5 |
|---|
| 1006 | configure:8806: $? = 0 |
|---|
| 1007 | configure:8806: result: yes |
|---|
| 1008 | configure:8806: checking for flock |
|---|
| 1009 | configure:8806: gcc -o conftest -g -O2 conftest.c >&5 |
|---|
| 1010 | configure:8806: $? = 0 |
|---|
| 1011 | configure:8806: result: yes |
|---|
| 1012 | configure:8806: checking for setmode |
|---|
| 1013 | configure:8806: gcc -o conftest -g -O2 conftest.c >&5 |
|---|
| 1014 | configure:8806: $? = 0 |
|---|
| 1015 | configure:8806: result: yes |
|---|
| 1016 | configure:8806: checking for strcasecmp |
|---|
| 1017 | configure:8806: gcc -o conftest -g -O2 conftest.c >&5 |
|---|
| 1018 | conftest.c:77:6: warning: incompatible redeclaration of library function 'strcasecmp' [-Wincompatible-library-redeclaration] |
|---|
| 1019 | char strcasecmp (); |
|---|
| 1020 | ^ |
|---|
| 1021 | conftest.c:77:6: note: 'strcasecmp' is a builtin with type 'int (const char *, const char *)' |
|---|
| 1022 | 1 warning generated. |
|---|
| 1023 | configure:8806: $? = 0 |
|---|
| 1024 | configure:8806: result: yes |
|---|
| 1025 | configure:8806: checking for strncasecmp |
|---|
| 1026 | configure:8806: gcc -o conftest -g -O2 conftest.c >&5 |
|---|
| 1027 | conftest.c:78:6: warning: incompatible redeclaration of library function 'strncasecmp' [-Wincompatible-library-redeclaration] |
|---|
| 1028 | char strncasecmp (); |
|---|
| 1029 | ^ |
|---|
| 1030 | conftest.c:78:6: note: 'strncasecmp' is a builtin with type 'int (const char *, const char *, unsigned long)' |
|---|
| 1031 | 1 warning generated. |
|---|
| 1032 | configure:8806: $? = 0 |
|---|
| 1033 | configure:8806: result: yes |
|---|
| 1034 | configure:8806: checking for strlcpy |
|---|
| 1035 | configure:8806: gcc -o conftest -g -O2 conftest.c >&5 |
|---|
| 1036 | conftest.c:79:6: warning: incompatible redeclaration of library function 'strlcpy' [-Wincompatible-library-redeclaration] |
|---|
| 1037 | char strlcpy (); |
|---|
| 1038 | ^ |
|---|
| 1039 | conftest.c:79:6: note: 'strlcpy' is a builtin with type 'unsigned long (char *, const char *, unsigned long)' |
|---|
| 1040 | 1 warning generated. |
|---|
| 1041 | configure:8806: $? = 0 |
|---|
| 1042 | configure:8806: result: yes |
|---|
| 1043 | configure:8806: checking for strlcat |
|---|
| 1044 | configure:8806: gcc -o conftest -g -O2 conftest.c >&5 |
|---|
| 1045 | conftest.c:80:6: warning: incompatible redeclaration of library function 'strlcat' [-Wincompatible-library-redeclaration] |
|---|
| 1046 | char strlcat (); |
|---|
| 1047 | ^ |
|---|
| 1048 | conftest.c:80:6: note: 'strlcat' is a builtin with type 'unsigned long (char *, const char *, unsigned long)' |
|---|
| 1049 | 1 warning generated. |
|---|
| 1050 | configure:8806: $? = 0 |
|---|
| 1051 | configure:8806: result: yes |
|---|
| 1052 | configure:8806: checking for copyfile |
|---|
| 1053 | configure:8806: gcc -o conftest -g -O2 conftest.c >&5 |
|---|
| 1054 | configure:8806: $? = 0 |
|---|
| 1055 | configure:8806: result: yes |
|---|
| 1056 | configure:8806: checking for clearenv |
|---|
| 1057 | configure:8806: gcc -o conftest -g -O2 conftest.c >&5 |
|---|
| 1058 | Undefined symbols for architecture x86_64: |
|---|
| 1059 | "_clearenv", referenced from: |
|---|
| 1060 | _main in conftest-blua9C.o |
|---|
| 1061 | ld: symbol(s) not found for architecture x86_64 |
|---|
| 1062 | clang: error: linker command failed with exit code 1 (use -v to see invocation) |
|---|
| 1063 | configure:8806: $? = 1 |
|---|
| 1064 | configure: failed program was: |
|---|
| 1065 | | /* confdefs.h */ |
|---|
| 1066 | | #define PACKAGE_NAME "MacPorts" |
|---|
| 1067 | | #define PACKAGE_TARNAME "macports" |
|---|
| 1068 | | #define PACKAGE_VERSION "2.2.99" |
|---|
| 1069 | | #define PACKAGE_STRING "MacPorts 2.2.99" |
|---|
| 1070 | | #define PACKAGE_BUGREPORT "macports-dev@lists.macosforge.org" |
|---|
| 1071 | | #define PACKAGE_URL "" |
|---|
| 1072 | | #define UNUSED __attribute__((unused)) |
|---|
| 1073 | | #define MP_PRIVATE __attribute__((visibility("hidden"))) |
|---|
| 1074 | | #define HAVE_PTHREAD 1 |
|---|
| 1075 | | #define STDC_HEADERS 1 |
|---|
| 1076 | | #define HAVE_SYS_TYPES_H 1 |
|---|
| 1077 | | #define HAVE_SYS_STAT_H 1 |
|---|
| 1078 | | #define HAVE_STDLIB_H 1 |
|---|
| 1079 | | #define HAVE_STRING_H 1 |
|---|
| 1080 | | #define HAVE_MEMORY_H 1 |
|---|
| 1081 | | #define HAVE_STRINGS_H 1 |
|---|
| 1082 | | #define HAVE_INTTYPES_H 1 |
|---|
| 1083 | | #define HAVE_STDINT_H 1 |
|---|
| 1084 | | #define HAVE_UNISTD_H 1 |
|---|
| 1085 | | #define HAVE_OBJC_OBJC_H 1 |
|---|
| 1086 | | #define APPLE_RUNTIME 1 |
|---|
| 1087 | | #define APPLE_FOUNDATION 1 |
|---|
| 1088 | | #define HAVE_FRAMEWORK_COREFOUNDATION /**/ |
|---|
| 1089 | | #define HAVE_FRAMEWORK_SYSTEMCONFIGURATION /**/ |
|---|
| 1090 | | #define HAVE_FRAMEWORK_IOKIT /**/ |
|---|
| 1091 | | #define HAVE_FUNCTION_CFNOTIFICATIONCENTERGETDARWINNOTIFYCENTER /**/ |
|---|
| 1092 | | #define STDC_HEADERS 1 |
|---|
| 1093 | | #define HAVE_DIRENT_H 1 |
|---|
| 1094 | | #define HAVE_SYS_WAIT_H 1 |
|---|
| 1095 | | #define HAVE_LIMITS_H 1 |
|---|
| 1096 | | #define HAVE_PATHS_H 1 |
|---|
| 1097 | | #define HAVE_SYS_FILE_H 1 |
|---|
| 1098 | | #define HAVE_CRT_EXTERNS_H 1 |
|---|
| 1099 | | #define HAVE_FCNTL_H 1 |
|---|
| 1100 | | #define HAVE_SYS_FCNTL_H 1 |
|---|
| 1101 | | #define HAVE_SYS_CDEFS_H 1 |
|---|
| 1102 | | #define HAVE_ERR_H 1 |
|---|
| 1103 | | #define HAVE_SYS_SOCKET_H 1 |
|---|
| 1104 | | #define HAVE_SYS_EVENT_H 1 |
|---|
| 1105 | | #define HAVE_SYS_SYSCTL_H 1 |
|---|
| 1106 | | #define HAVE_READLINE_READLINE_H 1 |
|---|
| 1107 | | #define HAVE_READLINE_HISTORY_H 1 |
|---|
| 1108 | | #define HAVE_PWD_H 1 |
|---|
| 1109 | | #define HAVE_SYS_PATHS_H 1 |
|---|
| 1110 | | #define HAVE_UTIME_H 1 |
|---|
| 1111 | | #define HAVE_BZERO 1 |
|---|
| 1112 | | #define HAVE_MEMSET 1 |
|---|
| 1113 | | #define HAVE_FGETLN 1 |
|---|
| 1114 | | #define HAVE_LOCKF 1 |
|---|
| 1115 | | #define HAVE_FLOCK 1 |
|---|
| 1116 | | #define HAVE_SETMODE 1 |
|---|
| 1117 | | #define HAVE_STRCASECMP 1 |
|---|
| 1118 | | #define HAVE_STRNCASECMP 1 |
|---|
| 1119 | | #define HAVE_STRLCPY 1 |
|---|
| 1120 | | #define HAVE_STRLCAT 1 |
|---|
| 1121 | | #define HAVE_COPYFILE 1 |
|---|
| 1122 | | /* end confdefs.h. */ |
|---|
| 1123 | | /* Define clearenv to an innocuous variant, in case <limits.h> declares clearenv. |
|---|
| 1124 | | For example, HP-UX 11i <limits.h> declares gettimeofday. */ |
|---|
| 1125 | | #define clearenv innocuous_clearenv |
|---|
| 1126 | | |
|---|
| 1127 | | /* System header to define __stub macros and hopefully few prototypes, |
|---|
| 1128 | | which can conflict with char clearenv (); below. |
|---|
| 1129 | | Prefer <limits.h> to <assert.h> if __STDC__ is defined, since |
|---|
| 1130 | | <limits.h> exists even on freestanding compilers. */ |
|---|
| 1131 | | |
|---|
| 1132 | | #ifdef __STDC__ |
|---|
| 1133 | | # include <limits.h> |
|---|
| 1134 | | #else |
|---|
| 1135 | | # include <assert.h> |
|---|
| 1136 | | #endif |
|---|
| 1137 | | |
|---|
| 1138 | | #undef clearenv |
|---|
| 1139 | | |
|---|
| 1140 | | /* Override any GCC internal prototype to avoid an error. |
|---|
| 1141 | | Use char because int might match the return type of a GCC |
|---|
| 1142 | | builtin and then its argument prototype would still apply. */ |
|---|
| 1143 | | #ifdef __cplusplus |
|---|
| 1144 | | extern "C" |
|---|
| 1145 | | #endif |
|---|
| 1146 | | char clearenv (); |
|---|
| 1147 | | /* The GNU C library defines this for functions which it implements |
|---|
| 1148 | | to always fail with ENOSYS. Some functions are actually named |
|---|
| 1149 | | something starting with __ and the normal name is an alias. */ |
|---|
| 1150 | | #if defined __stub_clearenv || defined __stub___clearenv |
|---|
| 1151 | | choke me |
|---|
| 1152 | | #endif |
|---|
| 1153 | | |
|---|
| 1154 | | int |
|---|
| 1155 | | main () |
|---|
| 1156 | | { |
|---|
| 1157 | | return clearenv (); |
|---|
| 1158 | | ; |
|---|
| 1159 | | return 0; |
|---|
| 1160 | | } |
|---|
| 1161 | configure:8806: result: no |
|---|
| 1162 | configure:8806: checking for sysctlbyname |
|---|
| 1163 | configure:8806: gcc -o conftest -g -O2 conftest.c >&5 |
|---|
| 1164 | configure:8806: $? = 0 |
|---|
| 1165 | configure:8806: result: yes |
|---|
| 1166 | configure:8806: checking for kqueue |
|---|
| 1167 | configure:8806: gcc -o conftest -g -O2 conftest.c >&5 |
|---|
| 1168 | configure:8806: $? = 0 |
|---|
| 1169 | configure:8806: result: yes |
|---|
| 1170 | configure:8818: checking if readlink conforms to POSIX 1003.1a |
|---|
| 1171 | configure:8842: gcc -c -g -O2 conftest.c >&5 |
|---|
| 1172 | configure:8842: $? = 0 |
|---|
| 1173 | configure:8857: result: yes |
|---|
| 1174 | configure:8870: checking CommonCrypto/CommonDigest.h usability |
|---|
| 1175 | configure:8870: gcc -c -g -O2 conftest.c >&5 |
|---|
| 1176 | configure:8870: $? = 0 |
|---|
| 1177 | configure:8870: result: yes |
|---|
| 1178 | configure:8870: checking CommonCrypto/CommonDigest.h presence |
|---|
| 1179 | configure:8870: gcc -E conftest.c |
|---|
| 1180 | configure:8870: $? = 0 |
|---|
| 1181 | configure:8870: result: yes |
|---|
| 1182 | configure:8870: checking for CommonCrypto/CommonDigest.h |
|---|
| 1183 | configure:8870: result: yes |
|---|
| 1184 | configure:9072: checking for readline in -lreadline |
|---|
| 1185 | configure:9097: gcc -o conftest -g -O2 conftest.c -lreadline >&5 |
|---|
| 1186 | configure:9097: $? = 0 |
|---|
| 1187 | configure:9106: result: yes |
|---|
| 1188 | configure:9117: checking whether rl_username_completion_function is declared |
|---|
| 1189 | configure:9117: gcc -c -g -O2 conftest.c >&5 |
|---|
| 1190 | conftest.c:77:10: error: use of undeclared identifier 'rl_username_completion_function' |
|---|
| 1191 | (void) rl_username_completion_function; |
|---|
| 1192 | ^ |
|---|
| 1193 | 1 error generated. |
|---|
| 1194 | configure:9117: $? = 1 |
|---|
| 1195 | configure: failed program was: |
|---|
| 1196 | | /* confdefs.h */ |
|---|
| 1197 | | #define PACKAGE_NAME "MacPorts" |
|---|
| 1198 | | #define PACKAGE_TARNAME "macports" |
|---|
| 1199 | | #define PACKAGE_VERSION "2.2.99" |
|---|
| 1200 | | #define PACKAGE_STRING "MacPorts 2.2.99" |
|---|
| 1201 | | #define PACKAGE_BUGREPORT "macports-dev@lists.macosforge.org" |
|---|
| 1202 | | #define PACKAGE_URL "" |
|---|
| 1203 | | #define UNUSED __attribute__((unused)) |
|---|
| 1204 | | #define MP_PRIVATE __attribute__((visibility("hidden"))) |
|---|
| 1205 | | #define HAVE_PTHREAD 1 |
|---|
| 1206 | | #define STDC_HEADERS 1 |
|---|
| 1207 | | #define HAVE_SYS_TYPES_H 1 |
|---|
| 1208 | | #define HAVE_SYS_STAT_H 1 |
|---|
| 1209 | | #define HAVE_STDLIB_H 1 |
|---|
| 1210 | | #define HAVE_STRING_H 1 |
|---|
| 1211 | | #define HAVE_MEMORY_H 1 |
|---|
| 1212 | | #define HAVE_STRINGS_H 1 |
|---|
| 1213 | | #define HAVE_INTTYPES_H 1 |
|---|
| 1214 | | #define HAVE_STDINT_H 1 |
|---|
| 1215 | | #define HAVE_UNISTD_H 1 |
|---|
| 1216 | | #define HAVE_OBJC_OBJC_H 1 |
|---|
| 1217 | | #define APPLE_RUNTIME 1 |
|---|
| 1218 | | #define APPLE_FOUNDATION 1 |
|---|
| 1219 | | #define HAVE_FRAMEWORK_COREFOUNDATION /**/ |
|---|
| 1220 | | #define HAVE_FRAMEWORK_SYSTEMCONFIGURATION /**/ |
|---|
| 1221 | | #define HAVE_FRAMEWORK_IOKIT /**/ |
|---|
| 1222 | | #define HAVE_FUNCTION_CFNOTIFICATIONCENTERGETDARWINNOTIFYCENTER /**/ |
|---|
| 1223 | | #define STDC_HEADERS 1 |
|---|
| 1224 | | #define HAVE_DIRENT_H 1 |
|---|
| 1225 | | #define HAVE_SYS_WAIT_H 1 |
|---|
| 1226 | | #define HAVE_LIMITS_H 1 |
|---|
| 1227 | | #define HAVE_PATHS_H 1 |
|---|
| 1228 | | #define HAVE_SYS_FILE_H 1 |
|---|
| 1229 | | #define HAVE_CRT_EXTERNS_H 1 |
|---|
| 1230 | | #define HAVE_FCNTL_H 1 |
|---|
| 1231 | | #define HAVE_SYS_FCNTL_H 1 |
|---|
| 1232 | | #define HAVE_SYS_CDEFS_H 1 |
|---|
| 1233 | | #define HAVE_ERR_H 1 |
|---|
| 1234 | | #define HAVE_SYS_SOCKET_H 1 |
|---|
| 1235 | | #define HAVE_SYS_EVENT_H 1 |
|---|
| 1236 | | #define HAVE_SYS_SYSCTL_H 1 |
|---|
| 1237 | | #define HAVE_READLINE_READLINE_H 1 |
|---|
| 1238 | | #define HAVE_READLINE_HISTORY_H 1 |
|---|
| 1239 | | #define HAVE_PWD_H 1 |
|---|
| 1240 | | #define HAVE_SYS_PATHS_H 1 |
|---|
| 1241 | | #define HAVE_UTIME_H 1 |
|---|
| 1242 | | #define HAVE_BZERO 1 |
|---|
| 1243 | | #define HAVE_MEMSET 1 |
|---|
| 1244 | | #define HAVE_FGETLN 1 |
|---|
| 1245 | | #define HAVE_LOCKF 1 |
|---|
| 1246 | | #define HAVE_FLOCK 1 |
|---|
| 1247 | | #define HAVE_SETMODE 1 |
|---|
| 1248 | | #define HAVE_STRCASECMP 1 |
|---|
| 1249 | | #define HAVE_STRNCASECMP 1 |
|---|
| 1250 | | #define HAVE_STRLCPY 1 |
|---|
| 1251 | | #define HAVE_STRLCAT 1 |
|---|
| 1252 | | #define HAVE_COPYFILE 1 |
|---|
| 1253 | | #define HAVE_SYSCTLBYNAME 1 |
|---|
| 1254 | | #define HAVE_KQUEUE 1 |
|---|
| 1255 | | #define HAVE_COMMONCRYPTO_COMMONDIGEST_H 1 |
|---|
| 1256 | | #define HAVE_LIBREADLINE 1 |
|---|
| 1257 | | /* end confdefs.h. */ |
|---|
| 1258 | | |
|---|
| 1259 | | #include <stdio.h> |
|---|
| 1260 | | #if HAVE_READLINE_READLINE_H |
|---|
| 1261 | | # include <readline/readline.h> |
|---|
| 1262 | | #endif |
|---|
| 1263 | | |
|---|
| 1264 | | |
|---|
| 1265 | | int |
|---|
| 1266 | | main () |
|---|
| 1267 | | { |
|---|
| 1268 | | #ifndef rl_username_completion_function |
|---|
| 1269 | | #ifdef __cplusplus |
|---|
| 1270 | | (void) rl_username_completion_function; |
|---|
| 1271 | | #else |
|---|
| 1272 | | (void) rl_username_completion_function; |
|---|
| 1273 | | #endif |
|---|
| 1274 | | #endif |
|---|
| 1275 | | |
|---|
| 1276 | | ; |
|---|
| 1277 | | return 0; |
|---|
| 1278 | | } |
|---|
| 1279 | configure:9117: result: no |
|---|
| 1280 | configure:9133: checking whether rl_filename_completion_function is declared |
|---|
| 1281 | configure:9133: gcc -c -g -O2 conftest.c >&5 |
|---|
| 1282 | configure:9133: $? = 0 |
|---|
| 1283 | configure:9133: result: yes |
|---|
| 1284 | configure:9149: checking whether rl_completion_matches is declared |
|---|
| 1285 | configure:9149: gcc -c -g -O2 conftest.c >&5 |
|---|
| 1286 | configure:9149: $? = 0 |
|---|
| 1287 | configure:9149: result: yes |
|---|
| 1288 | configure:9165: checking whether username_completion_function is declared |
|---|
| 1289 | configure:9165: gcc -c -g -O2 conftest.c >&5 |
|---|
| 1290 | configure:9165: $? = 0 |
|---|
| 1291 | configure:9165: result: yes |
|---|
| 1292 | configure:9181: checking whether filename_completion_function is declared |
|---|
| 1293 | configure:9181: gcc -c -g -O2 conftest.c >&5 |
|---|
| 1294 | configure:9181: $? = 0 |
|---|
| 1295 | configure:9181: result: yes |
|---|
| 1296 | configure:9197: checking whether completion_matches is declared |
|---|
| 1297 | configure:9197: gcc -c -g -O2 conftest.c >&5 |
|---|
| 1298 | configure:9197: $? = 0 |
|---|
| 1299 | configure:9197: result: yes |
|---|
| 1300 | configure:9244: checking for Tcl configuration |
|---|
| 1301 | configure:9314: error: Can't find Tcl configuration definitions |
|---|
| 1302 | |
|---|
| 1303 | ## ---------------- ## |
|---|
| 1304 | ## Cache variables. ## |
|---|
| 1305 | ## ---------------- ## |
|---|
| 1306 | |
|---|
| 1307 | ac_cv_build=x86_64-apple-darwin13.0.0 |
|---|
| 1308 | ac_cv_c_compiler_gnu=yes |
|---|
| 1309 | ac_cv_env_BSDMAKE_set= |
|---|
| 1310 | ac_cv_env_BSDMAKE_value= |
|---|
| 1311 | ac_cv_env_BZIP2_set= |
|---|
| 1312 | ac_cv_env_BZIP2_value= |
|---|
| 1313 | ac_cv_env_CC_set= |
|---|
| 1314 | ac_cv_env_CC_value= |
|---|
| 1315 | ac_cv_env_CFLAGS_set= |
|---|
| 1316 | ac_cv_env_CFLAGS_value= |
|---|
| 1317 | ac_cv_env_CPPFLAGS_set= |
|---|
| 1318 | ac_cv_env_CPPFLAGS_value= |
|---|
| 1319 | ac_cv_env_CPP_set= |
|---|
| 1320 | ac_cv_env_CPP_value= |
|---|
| 1321 | ac_cv_env_CVS_set= |
|---|
| 1322 | ac_cv_env_CVS_value= |
|---|
| 1323 | ac_cv_env_GNUMAKE_set= |
|---|
| 1324 | ac_cv_env_GNUMAKE_value= |
|---|
| 1325 | ac_cv_env_GNUTAR_set= |
|---|
| 1326 | ac_cv_env_GNUTAR_value= |
|---|
| 1327 | ac_cv_env_LDFLAGS_set= |
|---|
| 1328 | ac_cv_env_LDFLAGS_value= |
|---|
| 1329 | ac_cv_env_LIBS_set= |
|---|
| 1330 | ac_cv_env_LIBS_value= |
|---|
| 1331 | ac_cv_env_LZMA_set= |
|---|
| 1332 | ac_cv_env_LZMA_value= |
|---|
| 1333 | ac_cv_env_MAKE_set= |
|---|
| 1334 | ac_cv_env_MAKE_value= |
|---|
| 1335 | ac_cv_env_MTREE_set= |
|---|
| 1336 | ac_cv_env_MTREE_value= |
|---|
| 1337 | ac_cv_env_OBJCFLAGS_set= |
|---|
| 1338 | ac_cv_env_OBJCFLAGS_value= |
|---|
| 1339 | ac_cv_env_OBJCPP_set= |
|---|
| 1340 | ac_cv_env_OBJCPP_value= |
|---|
| 1341 | ac_cv_env_OBJC_set= |
|---|
| 1342 | ac_cv_env_OBJC_value= |
|---|
| 1343 | ac_cv_env_OPENSSL_set= |
|---|
| 1344 | ac_cv_env_OPENSSL_value= |
|---|
| 1345 | ac_cv_env_OPEN_set= |
|---|
| 1346 | ac_cv_env_OPEN_value= |
|---|
| 1347 | ac_cv_env_RSYNC_set= |
|---|
| 1348 | ac_cv_env_RSYNC_value= |
|---|
| 1349 | ac_cv_env_SED_set= |
|---|
| 1350 | ac_cv_env_SED_value= |
|---|
| 1351 | ac_cv_env_SVN_set= |
|---|
| 1352 | ac_cv_env_SVN_value= |
|---|
| 1353 | ac_cv_env_SWIG_set= |
|---|
| 1354 | ac_cv_env_SWIG_value= |
|---|
| 1355 | ac_cv_env_TAR_set= |
|---|
| 1356 | ac_cv_env_TAR_value= |
|---|
| 1357 | ac_cv_env_XAR_set= |
|---|
| 1358 | ac_cv_env_XAR_value= |
|---|
| 1359 | ac_cv_env_XZ_set= |
|---|
| 1360 | ac_cv_env_XZ_value= |
|---|
| 1361 | ac_cv_env_build_alias_set= |
|---|
| 1362 | ac_cv_env_build_alias_value= |
|---|
| 1363 | ac_cv_env_host_alias_set= |
|---|
| 1364 | ac_cv_env_host_alias_value= |
|---|
| 1365 | ac_cv_env_target_alias_set= |
|---|
| 1366 | ac_cv_env_target_alias_value= |
|---|
| 1367 | ac_cv_func_bzero=yes |
|---|
| 1368 | ac_cv_func_clearenv=no |
|---|
| 1369 | ac_cv_func_copyfile=yes |
|---|
| 1370 | ac_cv_func_fgetln=yes |
|---|
| 1371 | ac_cv_func_flock=yes |
|---|
| 1372 | ac_cv_func_kqueue=yes |
|---|
| 1373 | ac_cv_func_lockf=yes |
|---|
| 1374 | ac_cv_func_memset=yes |
|---|
| 1375 | ac_cv_func_setmode=yes |
|---|
| 1376 | ac_cv_func_strcasecmp=yes |
|---|
| 1377 | ac_cv_func_strlcat=yes |
|---|
| 1378 | ac_cv_func_strlcpy=yes |
|---|
| 1379 | ac_cv_func_strncasecmp=yes |
|---|
| 1380 | ac_cv_func_sysctlbyname=yes |
|---|
| 1381 | ac_cv_have_decl_completion_matches=yes |
|---|
| 1382 | ac_cv_have_decl_filename_completion_function=yes |
|---|
| 1383 | ac_cv_have_decl_rl_completion_matches=yes |
|---|
| 1384 | ac_cv_have_decl_rl_filename_completion_function=yes |
|---|
| 1385 | ac_cv_have_decl_rl_username_completion_function=no |
|---|
| 1386 | ac_cv_have_decl_username_completion_function=yes |
|---|
| 1387 | ac_cv_header_CommonCrypto_CommonDigest_h=yes |
|---|
| 1388 | ac_cv_header_crt_externs_h=yes |
|---|
| 1389 | ac_cv_header_dirent_dirent_h=yes |
|---|
| 1390 | ac_cv_header_err_h=yes |
|---|
| 1391 | ac_cv_header_fcntl_h=yes |
|---|
| 1392 | ac_cv_header_inttypes_h=yes |
|---|
| 1393 | ac_cv_header_limits_h=yes |
|---|
| 1394 | ac_cv_header_memory_h=yes |
|---|
| 1395 | ac_cv_header_objc_objc_h=yes |
|---|
| 1396 | ac_cv_header_paths_h=yes |
|---|
| 1397 | ac_cv_header_pwd_h=yes |
|---|
| 1398 | ac_cv_header_readline_history_h=yes |
|---|
| 1399 | ac_cv_header_readline_readline_h=yes |
|---|
| 1400 | ac_cv_header_stdc=yes |
|---|
| 1401 | ac_cv_header_stdint_h=yes |
|---|
| 1402 | ac_cv_header_stdlib_h=yes |
|---|
| 1403 | ac_cv_header_string_h=yes |
|---|
| 1404 | ac_cv_header_strings_h=yes |
|---|
| 1405 | ac_cv_header_sys_cdefs_h=yes |
|---|
| 1406 | ac_cv_header_sys_event_h=yes |
|---|
| 1407 | ac_cv_header_sys_fcntl_h=yes |
|---|
| 1408 | ac_cv_header_sys_file_h=yes |
|---|
| 1409 | ac_cv_header_sys_paths_h=yes |
|---|
| 1410 | ac_cv_header_sys_socket_h=yes |
|---|
| 1411 | ac_cv_header_sys_stat_h=yes |
|---|
| 1412 | ac_cv_header_sys_sysctl_h=yes |
|---|
| 1413 | ac_cv_header_sys_types_h=yes |
|---|
| 1414 | ac_cv_header_sys_wait_h=yes |
|---|
| 1415 | ac_cv_header_unistd_h=yes |
|---|
| 1416 | ac_cv_header_utime_h=yes |
|---|
| 1417 | ac_cv_host=x86_64-apple-darwin13.0.0 |
|---|
| 1418 | ac_cv_lib_readline_readline=yes |
|---|
| 1419 | ac_cv_objc_compiler_gnu=yes |
|---|
| 1420 | ac_cv_objc_foundation_apple=yes |
|---|
| 1421 | ac_cv_objext=o |
|---|
| 1422 | ac_cv_path_BZIP2=/usr/bin/bzip2 |
|---|
| 1423 | ac_cv_path_CHOWN=/usr/sbin/chown |
|---|
| 1424 | ac_cv_path_CP=/bin/cp |
|---|
| 1425 | ac_cv_path_CPIO=/usr/bin/cpio |
|---|
| 1426 | ac_cv_path_CVS=/usr/bin/cvs |
|---|
| 1427 | ac_cv_path_DEFAULTS=/usr/bin/defaults |
|---|
| 1428 | ac_cv_path_DIFF=/usr/bin/diff |
|---|
| 1429 | ac_cv_path_DSCL=/usr/bin/dscl |
|---|
| 1430 | ac_cv_path_DSEDITGROUP=/usr/sbin/dseditgroup |
|---|
| 1431 | ac_cv_path_EGREP='/usr/bin/grep -E' |
|---|
| 1432 | ac_cv_path_FILE=/usr/bin/file |
|---|
| 1433 | ac_cv_path_FIND=/usr/bin/find |
|---|
| 1434 | ac_cv_path_GIT=/usr/bin/git |
|---|
| 1435 | ac_cv_path_GNUMAKE=/usr/bin/gnumake |
|---|
| 1436 | ac_cv_path_GREP=/usr/bin/grep |
|---|
| 1437 | ac_cv_path_GZIP=/usr/bin/gzip |
|---|
| 1438 | ac_cv_path_HDIUTIL=/usr/bin/hdiutil |
|---|
| 1439 | ac_cv_path_LAUNCHCTL=/bin/launchctl |
|---|
| 1440 | ac_cv_path_LIPO=/usr/bin/lipo |
|---|
| 1441 | ac_cv_path_LSBOM=/usr/bin/lsbom |
|---|
| 1442 | ac_cv_path_MAKE=/usr/bin/make |
|---|
| 1443 | ac_cv_path_MDFIND=/usr/bin/mdfind |
|---|
| 1444 | ac_cv_path_MDLS=/usr/bin/mdls |
|---|
| 1445 | ac_cv_path_MKBOM=/usr/bin/mkbom |
|---|
| 1446 | ac_cv_path_MTREE=/usr/sbin/mtree |
|---|
| 1447 | ac_cv_path_OPEN=/usr/bin/open |
|---|
| 1448 | ac_cv_path_OPENSSL=/usr/bin/openssl |
|---|
| 1449 | ac_cv_path_PATCH=/usr/bin/patch |
|---|
| 1450 | ac_cv_path_PAX=/bin/pax |
|---|
| 1451 | ac_cv_path_RMDIR=/bin/rmdir |
|---|
| 1452 | ac_cv_path_RSYNC=/usr/bin/rsync |
|---|
| 1453 | ac_cv_path_SANDBOX_EXEC=/usr/bin/sandbox-exec |
|---|
| 1454 | ac_cv_path_SED=/usr/bin/sed |
|---|
| 1455 | ac_cv_path_SVN=/usr/bin/svn |
|---|
| 1456 | ac_cv_path_SW_VERS=/usr/bin/sw_vers |
|---|
| 1457 | ac_cv_path_TAR=/usr/bin/tar |
|---|
| 1458 | ac_cv_path_UNZIP=/usr/bin/unzip |
|---|
| 1459 | ac_cv_path_XAR=/usr/bin/xar |
|---|
| 1460 | ac_cv_path_XCODEBUILD=/usr/bin/xcodebuild |
|---|
| 1461 | ac_cv_path_XCODE_SELECT=/usr/bin/xcode-select |
|---|
| 1462 | ac_cv_path_XCRUN=/usr/bin/xcrun |
|---|
| 1463 | ac_cv_path_ZIP=/usr/bin/zip |
|---|
| 1464 | ac_cv_path_install='/usr/bin/install -c' |
|---|
| 1465 | ac_cv_prog_CPP='gcc -E' |
|---|
| 1466 | ac_cv_prog_HAVE_LAUNCHD=yes |
|---|
| 1467 | ac_cv_prog_OBJCPP='gcc -E' |
|---|
| 1468 | ac_cv_prog_ac_ct_CC=gcc |
|---|
| 1469 | ac_cv_prog_ac_ct_OBJC=gcc |
|---|
| 1470 | ac_cv_prog_cc_c89= |
|---|
| 1471 | ac_cv_prog_cc_g=yes |
|---|
| 1472 | ac_cv_prog_make_make_set=yes |
|---|
| 1473 | ac_cv_prog_objc_g=yes |
|---|
| 1474 | ac_cv_search_opendir='none required' |
|---|
| 1475 | ac_cv_target=x86_64-apple-darwin13.0.0 |
|---|
| 1476 | mp_cv_attribute_mp_private='__attribute__((visibility("hidden")))' |
|---|
| 1477 | mp_cv_have_framework_corefoundation=yes |
|---|
| 1478 | mp_cv_have_framework_iokit=yes |
|---|
| 1479 | mp_cv_have_framework_systemconfiguration=yes |
|---|
| 1480 | mp_cv_have_function_cfnotificationcentergetdarwinnotifycenter=yes |
|---|
| 1481 | mp_cv_objc_req_pthread=no |
|---|
| 1482 | mp_cv_objc_runtime_apple=yes |
|---|
| 1483 | mp_cv_objc_runtime_gnu=no |
|---|
| 1484 | mp_cv_readlink_is_posix_1003_1a=yes |
|---|
| 1485 | |
|---|
| 1486 | ## ----------------- ## |
|---|
| 1487 | ## Output variables. ## |
|---|
| 1488 | ## ----------------- ## |
|---|
| 1489 | |
|---|
| 1490 | BSDMAKE='' |
|---|
| 1491 | BZIP2='/usr/bin/bzip2' |
|---|
| 1492 | BZR='' |
|---|
| 1493 | CC='gcc' |
|---|
| 1494 | CFLAGS='-g -O2' |
|---|
| 1495 | CFLAGS_LIBCURL='' |
|---|
| 1496 | CFLAGS_PEDANTIC='-pedantic' |
|---|
| 1497 | CFLAGS_QUICHEEATERS='-Wextra -Wall' |
|---|
| 1498 | CFLAGS_SQLITE3='' |
|---|
| 1499 | CFLAGS_WERROR='' |
|---|
| 1500 | CHOWN='/usr/sbin/chown' |
|---|
| 1501 | CP='/bin/cp' |
|---|
| 1502 | CPIO='/usr/bin/cpio' |
|---|
| 1503 | CPP='gcc -E' |
|---|
| 1504 | CPPFLAGS='' |
|---|
| 1505 | CURL_CONFIG='' |
|---|
| 1506 | CVS='/usr/bin/cvs' |
|---|
| 1507 | DEFAULTS='/usr/bin/defaults' |
|---|
| 1508 | DEFS='' |
|---|
| 1509 | DEVELOPER_DIR='/Applications/Xcode.app/Contents/Developer' |
|---|
| 1510 | DIFF='/usr/bin/diff' |
|---|
| 1511 | DSCL='/usr/bin/dscl' |
|---|
| 1512 | DSEDITGROUP='/usr/sbin/dseditgroup' |
|---|
| 1513 | DSTGRP='admin' |
|---|
| 1514 | DSTMODE='0755' |
|---|
| 1515 | DSTUSR='root' |
|---|
| 1516 | ECHO_C='\c' |
|---|
| 1517 | ECHO_N='' |
|---|
| 1518 | ECHO_T='' |
|---|
| 1519 | EGREP='/usr/bin/grep -E' |
|---|
| 1520 | EXEEXT='' |
|---|
| 1521 | EXTRA_PROGS=' daemondo' |
|---|
| 1522 | FILE='/usr/bin/file' |
|---|
| 1523 | FIND='/usr/bin/find' |
|---|
| 1524 | GIT='/usr/bin/git' |
|---|
| 1525 | GNUMAKE='/usr/bin/gnumake' |
|---|
| 1526 | GNUPATCH='/usr/bin/patch' |
|---|
| 1527 | GNUTAR='' |
|---|
| 1528 | GREP='/usr/bin/grep' |
|---|
| 1529 | GZIP='/usr/bin/gzip' |
|---|
| 1530 | HAVE_FRAMEWORK_COREFOUNDATION='' |
|---|
| 1531 | HAVE_FRAMEWORK_IOKIT='' |
|---|
| 1532 | HAVE_FRAMEWORK_SYSTEMCONFIGURATION='' |
|---|
| 1533 | HAVE_FUNCTION_CFNOTIFICATIONCENTERGETDARWINNOTIFYCENTER='' |
|---|
| 1534 | HAVE_LAUNCHD='yes' |
|---|
| 1535 | HDIUTIL='/usr/bin/hdiutil' |
|---|
| 1536 | HG='' |
|---|
| 1537 | INCLUDES='-I.. -I. ' |
|---|
| 1538 | INSTALL_DATA='${INSTALL} -m 644' |
|---|
| 1539 | INSTALL_PROGRAM='${INSTALL}' |
|---|
| 1540 | INSTALL_SCRIPT='${INSTALL}' |
|---|
| 1541 | LAUNCHCTL='/bin/launchctl' |
|---|
| 1542 | LDFLAGS='' |
|---|
| 1543 | LDFLAGS_LIBCURL='' |
|---|
| 1544 | LDFLAGS_SQLITE3='' |
|---|
| 1545 | LIBOBJS='' |
|---|
| 1546 | LIBS='' |
|---|
| 1547 | LIPO='/usr/bin/lipo' |
|---|
| 1548 | LN_S='ln -s' |
|---|
| 1549 | LSBOM='/usr/bin/lsbom' |
|---|
| 1550 | LTLIBOBJS='' |
|---|
| 1551 | LZMA='' |
|---|
| 1552 | MACPORTS_VERSION='2.2.99' |
|---|
| 1553 | MAKE='/usr/bin/make' |
|---|
| 1554 | MD5_LIBS='' |
|---|
| 1555 | MDFIND='/usr/bin/mdfind' |
|---|
| 1556 | MDLS='/usr/bin/mdls' |
|---|
| 1557 | MKBOM='/usr/bin/mkbom' |
|---|
| 1558 | MPAPPLICATIONSDIR='/Applications/MacPorts' |
|---|
| 1559 | MPCONFIGDIR='${sysconfdir}/macports' |
|---|
| 1560 | MPCONFIGDIR_EXPANDED='' |
|---|
| 1561 | MPFRAMEWORKSDIR='/opt/local/Library/Frameworks' |
|---|
| 1562 | MTREE='/usr/sbin/mtree' |
|---|
| 1563 | OBJC='gcc' |
|---|
| 1564 | OBJCFLAGS='-g -O2' |
|---|
| 1565 | OBJCPP='gcc -E' |
|---|
| 1566 | OBJC_FOUNDATION='Apple' |
|---|
| 1567 | OBJC_FOUNDATION_CPPFLAGS='' |
|---|
| 1568 | OBJC_FOUNDATION_LDFLAGS='' |
|---|
| 1569 | OBJC_FOUNDATION_LIBS='-framework Foundation' |
|---|
| 1570 | OBJC_LIBS='-lobjc' |
|---|
| 1571 | OBJC_PTHREAD_CFLAGS='-D_THREAD_SAFE ' |
|---|
| 1572 | OBJC_PTHREAD_LIBS='' |
|---|
| 1573 | OBJC_RUNTIME='APPLE_RUNTIME' |
|---|
| 1574 | OBJC_RUNTIME_FLAGS='-fnext-runtime' |
|---|
| 1575 | OBJEXT='o' |
|---|
| 1576 | OPEN='/usr/bin/open' |
|---|
| 1577 | OPENSSL='/usr/bin/openssl' |
|---|
| 1578 | OUR_INCLUDED_PACKAGES='' |
|---|
| 1579 | PACKAGE_BUGREPORT='macports-dev@lists.macosforge.org' |
|---|
| 1580 | PACKAGE_NAME='MacPorts' |
|---|
| 1581 | PACKAGE_STRING='MacPorts 2.2.99' |
|---|
| 1582 | PACKAGE_TARNAME='macports' |
|---|
| 1583 | PACKAGE_URL='' |
|---|
| 1584 | PACKAGE_VERSION='2.2.99' |
|---|
| 1585 | PATCH='/usr/bin/patch' |
|---|
| 1586 | PATH_CLEANED='/usr/bin:/bin:/usr/sbin:/sbin:/usr/local/bin' |
|---|
| 1587 | PATH_SEPARATOR=':' |
|---|
| 1588 | PAX='/bin/pax' |
|---|
| 1589 | PKG_CONFIG='' |
|---|
| 1590 | PORTSDIR='' |
|---|
| 1591 | PTHREAD_CFLAGS='-D_THREAD_SAFE ' |
|---|
| 1592 | PTHREAD_LIBS='' |
|---|
| 1593 | READLINE_LIBS='-lreadline' |
|---|
| 1594 | READLINK_IS_NOT_P1003_1A='' |
|---|
| 1595 | RMDIR='/bin/rmdir' |
|---|
| 1596 | RSYNC='/usr/bin/rsync' |
|---|
| 1597 | RUNUSR='macports' |
|---|
| 1598 | SANDBOX_EXEC='/usr/bin/sandbox-exec' |
|---|
| 1599 | SED='/usr/bin/sed' |
|---|
| 1600 | SED_EXT='-E' |
|---|
| 1601 | SET_MAKE='' |
|---|
| 1602 | SHELL='/bin/sh' |
|---|
| 1603 | SHLIB_CFLAGS='' |
|---|
| 1604 | SHLIB_LD='' |
|---|
| 1605 | SHLIB_LDFLAGS='' |
|---|
| 1606 | SHLIB_SUFFIX='' |
|---|
| 1607 | SQLITE3_TCL_DIR='' |
|---|
| 1608 | STLIB_LD='' |
|---|
| 1609 | SVN='/usr/bin/svn' |
|---|
| 1610 | SWIG='' |
|---|
| 1611 | SW_VERS='/usr/bin/sw_vers' |
|---|
| 1612 | TAR='/usr/bin/tar' |
|---|
| 1613 | TAR_CMD='/usr/bin/tar' |
|---|
| 1614 | TAR_Q='q' |
|---|
| 1615 | TCLSH='' |
|---|
| 1616 | TCL_BIN_DIR='# no Tcl configs found' |
|---|
| 1617 | TCL_CC='' |
|---|
| 1618 | TCL_DEFS='' |
|---|
| 1619 | TCL_INCLUDES='' |
|---|
| 1620 | TCL_LIB_FILE='' |
|---|
| 1621 | TCL_LIB_FLAG='' |
|---|
| 1622 | TCL_LIB_SPEC='' |
|---|
| 1623 | TCL_PACKAGE_DIR='' |
|---|
| 1624 | TCL_SRC_DIR='' |
|---|
| 1625 | TCL_STUB_LIB_FILE='' |
|---|
| 1626 | TCL_STUB_LIB_FLAG='' |
|---|
| 1627 | TCL_STUB_LIB_SPEC='' |
|---|
| 1628 | TCL_VERSION='' |
|---|
| 1629 | UNIVERSAL_ARCHS='x86_64 i386' |
|---|
| 1630 | UNZIP='/usr/bin/unzip' |
|---|
| 1631 | XAR='/usr/bin/xar' |
|---|
| 1632 | XCODEBUILD='/usr/bin/xcodebuild' |
|---|
| 1633 | XCODE_SELECT='/usr/bin/xcode-select' |
|---|
| 1634 | XCRUN='/usr/bin/xcrun' |
|---|
| 1635 | XZ='' |
|---|
| 1636 | ZIP='/usr/bin/zip' |
|---|
| 1637 | ac_ct_CC='gcc' |
|---|
| 1638 | ac_ct_OBJC='gcc' |
|---|
| 1639 | ac_cv_func_strlcat='yes' |
|---|
| 1640 | acx_pthread_config='' |
|---|
| 1641 | bindir='${exec_prefix}/bin' |
|---|
| 1642 | build='x86_64-apple-darwin13.0.0' |
|---|
| 1643 | build_alias='' |
|---|
| 1644 | build_cpu='x86_64' |
|---|
| 1645 | build_os='darwin13.0.0' |
|---|
| 1646 | build_vendor='apple' |
|---|
| 1647 | datadir='${datarootdir}' |
|---|
| 1648 | datarootdir='${prefix}/share' |
|---|
| 1649 | docdir='${datarootdir}/doc/${PACKAGE_TARNAME}' |
|---|
| 1650 | dvidir='${docdir}' |
|---|
| 1651 | exec_prefix='NONE' |
|---|
| 1652 | host='x86_64-apple-darwin13.0.0' |
|---|
| 1653 | host_alias='' |
|---|
| 1654 | host_cpu='x86_64' |
|---|
| 1655 | host_os='darwin13.0.0' |
|---|
| 1656 | host_vendor='apple' |
|---|
| 1657 | htmldir='${docdir}' |
|---|
| 1658 | includedir='${prefix}/include' |
|---|
| 1659 | infodir='${datarootdir}/info' |
|---|
| 1660 | libdir='${exec_prefix}/lib' |
|---|
| 1661 | libexecdir='${exec_prefix}/libexec' |
|---|
| 1662 | localedir='${datarootdir}/locale' |
|---|
| 1663 | localstatedir='${prefix}/var' |
|---|
| 1664 | localstatedir_expanded='' |
|---|
| 1665 | macports_tcl_dir='' |
|---|
| 1666 | mandir='${datarootdir}/man' |
|---|
| 1667 | oldincludedir='/usr/include' |
|---|
| 1668 | pdfdir='${docdir}' |
|---|
| 1669 | prefix='NONE' |
|---|
| 1670 | prefix_expanded='' |
|---|
| 1671 | program_transform_name='s,x,x,' |
|---|
| 1672 | psdir='${docdir}' |
|---|
| 1673 | sbindir='${exec_prefix}/sbin' |
|---|
| 1674 | sharedstatedir='${prefix}/com' |
|---|
| 1675 | subdirs='' |
|---|
| 1676 | sysconfdir='${prefix}/etc' |
|---|
| 1677 | target='x86_64-apple-darwin13.0.0' |
|---|
| 1678 | target_alias='' |
|---|
| 1679 | target_cpu='x86_64' |
|---|
| 1680 | target_os='darwin13.0.0' |
|---|
| 1681 | target_vendor='apple' |
|---|
| 1682 | |
|---|
| 1683 | ## ----------- ## |
|---|
| 1684 | ## confdefs.h. ## |
|---|
| 1685 | ## ----------- ## |
|---|
| 1686 | |
|---|
| 1687 | /* confdefs.h */ |
|---|
| 1688 | #define PACKAGE_NAME "MacPorts" |
|---|
| 1689 | #define PACKAGE_TARNAME "macports" |
|---|
| 1690 | #define PACKAGE_VERSION "2.2.99" |
|---|
| 1691 | #define PACKAGE_STRING "MacPorts 2.2.99" |
|---|
| 1692 | #define PACKAGE_BUGREPORT "macports-dev@lists.macosforge.org" |
|---|
| 1693 | #define PACKAGE_URL "" |
|---|
| 1694 | #define UNUSED __attribute__((unused)) |
|---|
| 1695 | #define MP_PRIVATE __attribute__((visibility("hidden"))) |
|---|
| 1696 | #define HAVE_PTHREAD 1 |
|---|
| 1697 | #define STDC_HEADERS 1 |
|---|
| 1698 | #define HAVE_SYS_TYPES_H 1 |
|---|
| 1699 | #define HAVE_SYS_STAT_H 1 |
|---|
| 1700 | #define HAVE_STDLIB_H 1 |
|---|
| 1701 | #define HAVE_STRING_H 1 |
|---|
| 1702 | #define HAVE_MEMORY_H 1 |
|---|
| 1703 | #define HAVE_STRINGS_H 1 |
|---|
| 1704 | #define HAVE_INTTYPES_H 1 |
|---|
| 1705 | #define HAVE_STDINT_H 1 |
|---|
| 1706 | #define HAVE_UNISTD_H 1 |
|---|
| 1707 | #define HAVE_OBJC_OBJC_H 1 |
|---|
| 1708 | #define APPLE_RUNTIME 1 |
|---|
| 1709 | #define APPLE_FOUNDATION 1 |
|---|
| 1710 | #define HAVE_FRAMEWORK_COREFOUNDATION /**/ |
|---|
| 1711 | #define HAVE_FRAMEWORK_SYSTEMCONFIGURATION /**/ |
|---|
| 1712 | #define HAVE_FRAMEWORK_IOKIT /**/ |
|---|
| 1713 | #define HAVE_FUNCTION_CFNOTIFICATIONCENTERGETDARWINNOTIFYCENTER /**/ |
|---|
| 1714 | #define STDC_HEADERS 1 |
|---|
| 1715 | #define HAVE_DIRENT_H 1 |
|---|
| 1716 | #define HAVE_SYS_WAIT_H 1 |
|---|
| 1717 | #define HAVE_LIMITS_H 1 |
|---|
| 1718 | #define HAVE_PATHS_H 1 |
|---|
| 1719 | #define HAVE_SYS_FILE_H 1 |
|---|
| 1720 | #define HAVE_CRT_EXTERNS_H 1 |
|---|
| 1721 | #define HAVE_FCNTL_H 1 |
|---|
| 1722 | #define HAVE_SYS_FCNTL_H 1 |
|---|
| 1723 | #define HAVE_SYS_CDEFS_H 1 |
|---|
| 1724 | #define HAVE_ERR_H 1 |
|---|
| 1725 | #define HAVE_SYS_SOCKET_H 1 |
|---|
| 1726 | #define HAVE_SYS_EVENT_H 1 |
|---|
| 1727 | #define HAVE_SYS_SYSCTL_H 1 |
|---|
| 1728 | #define HAVE_READLINE_READLINE_H 1 |
|---|
| 1729 | #define HAVE_READLINE_HISTORY_H 1 |
|---|
| 1730 | #define HAVE_PWD_H 1 |
|---|
| 1731 | #define HAVE_SYS_PATHS_H 1 |
|---|
| 1732 | #define HAVE_UTIME_H 1 |
|---|
| 1733 | #define HAVE_BZERO 1 |
|---|
| 1734 | #define HAVE_MEMSET 1 |
|---|
| 1735 | #define HAVE_FGETLN 1 |
|---|
| 1736 | #define HAVE_LOCKF 1 |
|---|
| 1737 | #define HAVE_FLOCK 1 |
|---|
| 1738 | #define HAVE_SETMODE 1 |
|---|
| 1739 | #define HAVE_STRCASECMP 1 |
|---|
| 1740 | #define HAVE_STRNCASECMP 1 |
|---|
| 1741 | #define HAVE_STRLCPY 1 |
|---|
| 1742 | #define HAVE_STRLCAT 1 |
|---|
| 1743 | #define HAVE_COPYFILE 1 |
|---|
| 1744 | #define HAVE_SYSCTLBYNAME 1 |
|---|
| 1745 | #define HAVE_KQUEUE 1 |
|---|
| 1746 | #define HAVE_COMMONCRYPTO_COMMONDIGEST_H 1 |
|---|
| 1747 | #define HAVE_LIBREADLINE 1 |
|---|
| 1748 | #define HAVE_DECL_RL_USERNAME_COMPLETION_FUNCTION 0 |
|---|
| 1749 | #define HAVE_DECL_RL_FILENAME_COMPLETION_FUNCTION 1 |
|---|
| 1750 | #define HAVE_DECL_RL_COMPLETION_MATCHES 1 |
|---|
| 1751 | #define HAVE_DECL_USERNAME_COMPLETION_FUNCTION 1 |
|---|
| 1752 | #define HAVE_DECL_FILENAME_COMPLETION_FUNCTION 1 |
|---|
| 1753 | #define HAVE_DECL_COMPLETION_MATCHES 1 |
|---|
| 1754 | #define MIN_USABLE_UID 500 |
|---|
| 1755 | #define MIN_USABLE_GID 500 |
|---|
| 1756 | |
|---|
| 1757 | configure: exit 1 |
|---|