Ticket #41003: gearmand.log

File gearmand.log, 67.2 KB (added by coditect (Nicholas Rawlings), 7 years ago)

Logfile

Line 
1version:1
2:debug:main epoch: in tree: 0 installed: 0
3:debug:main boost 1.54.0_0 exists in the ports tree
4:debug:main boost 1.54.0_0 +no_single+no_static+python27 is the latest installed
5:debug:main boost 1.54.0_0 +no_single+no_static+python27 is active
6:debug:main Merging existing variants '+no_single+no_static+python27' into variants
7:debug:main new fully merged portvariants: no_static + no_single + bash_completion + python27 +
8:debug:main Changing to port directory: /opt/local/var/macports/sources/rsync.macports.org/release/tarballs/ports/devel/boost
9:debug:main OS darwin/13.0.0 (Mac OS X 10.9) arch i386
10:debug:main compiler clang 500.2.79 not blacklisted because does not match {clang < 421}
11:debug:main Reading variant descriptions from /opt/local/var/macports/sources/rsync.macports.org/release/tarballs/ports/_resources/port1.0/variant_descriptions.conf
12:debug:main universal variant already exists, so not adding the default one
13:debug:main Requested variant +bash_completion is not provided by port boost.
14:debug:main Executing variant python27 provides python27
15:debug:main Executing variant no_static provides no_static
16:debug:main Executing variant no_single provides no_single
17:debug:main Running callback portconfigure::add_automatic_compiler_dependencies
18:debug:main Finished running callback portconfigure::add_automatic_compiler_dependencies
19:debug:main Running callback portbuild::add_automatic_buildsystem_dependencies
20:debug:main Finished running callback portbuild::add_automatic_buildsystem_dependencies
21:debug:main No need to upgrade! boost 1.54.0_0 >= boost 1.54.0_0
22:debug:main epoch: in tree: 0 installed: 0
23:debug:main zlib 1.2.8_0 exists in the ports tree
24:debug:main zlib 1.2.8_0  is the latest installed
25:debug:main zlib 1.2.8_0  is active
26:debug:main Merging existing variants '' into variants
27:debug:main new fully merged portvariants: bash_completion +
28:debug:main Changing to port directory: /opt/local/var/macports/sources/rsync.macports.org/release/tarballs/ports/archivers/zlib
29:debug:main OS darwin/13.0.0 (Mac OS X 10.9) arch i386
30:debug:main adding the default universal variant
31:debug:main Reading variant descriptions from /opt/local/var/macports/sources/rsync.macports.org/release/tarballs/ports/_resources/port1.0/variant_descriptions.conf
32:debug:main Requested variant +bash_completion is not provided by port zlib.
33:debug:main Running callback portconfigure::add_automatic_compiler_dependencies
34:debug:main Finished running callback portconfigure::add_automatic_compiler_dependencies
35:debug:main Running callback portbuild::add_automatic_buildsystem_dependencies
36:debug:main Finished running callback portbuild::add_automatic_buildsystem_dependencies
37:debug:main No need to upgrade! zlib 1.2.8_0 >= zlib 1.2.8_0
38:debug:main epoch: in tree: 0 installed: 0
39:debug:main expat 2.1.0_0 exists in the ports tree
40:debug:main expat 2.1.0_0  is the latest installed
41:debug:main expat 2.1.0_0  is active
42:debug:main Merging existing variants '' into variants
43:debug:main new fully merged portvariants: bash_completion +
44:debug:main Changing to port directory: /opt/local/var/macports/sources/rsync.macports.org/release/tarballs/ports/textproc/expat
45:debug:main OS darwin/13.0.0 (Mac OS X 10.9) arch i386
46:debug:main adding the default universal variant
47:debug:main Reading variant descriptions from /opt/local/var/macports/sources/rsync.macports.org/release/tarballs/ports/_resources/port1.0/variant_descriptions.conf
48:debug:main Requested variant +bash_completion is not provided by port expat.
49:debug:main Running callback portconfigure::add_automatic_compiler_dependencies
50:debug:main Finished running callback portconfigure::add_automatic_compiler_dependencies
51:debug:main Running callback portbuild::add_automatic_buildsystem_dependencies
52:debug:main Finished running callback portbuild::add_automatic_buildsystem_dependencies
53:debug:main No need to upgrade! expat 2.1.0_0 >= expat 2.1.0_0
54:debug:main epoch: in tree: 0 installed: 0
55:debug:main bzip2 1.0.6_0 exists in the ports tree
56:debug:main bzip2 1.0.6_0  is the latest installed
57:debug:main bzip2 1.0.6_0  is active
58:debug:main Merging existing variants '' into variants
59:debug:main new fully merged portvariants: bash_completion +
60:debug:main Changing to port directory: /opt/local/var/macports/sources/rsync.macports.org/release/tarballs/ports/archivers/bzip2
61:debug:main OS darwin/13.0.0 (Mac OS X 10.9) arch i386
62:debug:main Reading variant descriptions from /opt/local/var/macports/sources/rsync.macports.org/release/tarballs/ports/_resources/port1.0/variant_descriptions.conf
63:debug:main universal variant already exists, so not adding the default one
64:debug:main Requested variant +bash_completion is not provided by port bzip2.
65:debug:main Running callback portconfigure::add_automatic_compiler_dependencies
66:debug:main Finished running callback portconfigure::add_automatic_compiler_dependencies
67:debug:main Running callback portbuild::add_automatic_buildsystem_dependencies
68:debug:main Finished running callback portbuild::add_automatic_buildsystem_dependencies
69:debug:main No need to upgrade! bzip2 1.0.6_0 >= bzip2 1.0.6_0
70:debug:main epoch: in tree: 0 installed: 0
71:debug:main libiconv 1.14_0 exists in the ports tree
72:debug:main libiconv 1.14_0  is the latest installed
73:debug:main libiconv 1.14_0  is active
74:debug:main Merging existing variants '' into variants
75:debug:main new fully merged portvariants: bash_completion +
76:debug:main Changing to port directory: /opt/local/var/macports/sources/rsync.macports.org/release/tarballs/ports/textproc/libiconv
77:debug:main OS darwin/13.0.0 (Mac OS X 10.9) arch i386
78:debug:main Reading variant descriptions from /opt/local/var/macports/sources/rsync.macports.org/release/tarballs/ports/_resources/port1.0/variant_descriptions.conf
79:debug:main universal variant already exists, so not adding the default one
80:debug:main Requested variant +bash_completion is not provided by port libiconv.
81:debug:main Running callback portconfigure::add_automatic_compiler_dependencies
82:debug:main Finished running callback portconfigure::add_automatic_compiler_dependencies
83:debug:main Running callback portbuild::add_automatic_buildsystem_dependencies
84:debug:main Finished running callback portbuild::add_automatic_buildsystem_dependencies
85:debug:main No need to upgrade! libiconv 1.14_0 >= libiconv 1.14_0
86:debug:main epoch: in tree: 0 installed: 0
87:debug:main icu 51.2_1 exists in the ports tree
88:debug:main icu 51.2_1  is the latest installed
89:debug:main icu 51.2_1  is active
90:debug:main Merging existing variants '' into variants
91:debug:main new fully merged portvariants: bash_completion +
92:debug:main Changing to port directory: /opt/local/var/macports/sources/rsync.macports.org/release/tarballs/ports/devel/icu
93:debug:main OS darwin/13.0.0 (Mac OS X 10.9) arch i386
94:debug:main Reading variant descriptions from /opt/local/var/macports/sources/rsync.macports.org/release/tarballs/ports/_resources/port1.0/variant_descriptions.conf
95:debug:main universal variant already exists, so not adding the default one
96:debug:main Requested variant +bash_completion is not provided by port icu.
97:debug:main Running callback portconfigure::add_automatic_compiler_dependencies
98:debug:main Finished running callback portconfigure::add_automatic_compiler_dependencies
99:debug:main Running callback portbuild::add_automatic_buildsystem_dependencies
100:debug:main Finished running callback portbuild::add_automatic_buildsystem_dependencies
101:debug:main No need to upgrade! icu 51.2_1 >= icu 51.2_1
102:debug:main epoch: in tree: 2 installed: 2
103:debug:main python27 2.7.5_1 exists in the ports tree
104:debug:main python27 2.7.5_1  is the latest installed
105:debug:main python27 2.7.5_1  is active
106:debug:main Merging existing variants '' into variants
107:debug:main new fully merged portvariants: bash_completion +
108:debug:main Changing to port directory: /opt/local/var/macports/sources/rsync.macports.org/release/tarballs/ports/lang/python27
109:debug:main OS darwin/13.0.0 (Mac OS X 10.9) arch i386
110:debug:main Reading variant descriptions from /opt/local/var/macports/sources/rsync.macports.org/release/tarballs/ports/_resources/port1.0/variant_descriptions.conf
111:debug:main universal variant already exists, so not adding the default one
112:debug:main Requested variant +bash_completion is not provided by port python27.
113:debug:main Running callback portconfigure::add_automatic_compiler_dependencies
114:debug:main Finished running callback portconfigure::add_automatic_compiler_dependencies
115:debug:main Running callback portbuild::add_automatic_buildsystem_dependencies
116:debug:main Finished running callback portbuild::add_automatic_buildsystem_dependencies
117:debug:main No need to upgrade! python27 2.7.5_1 >= python27 2.7.5_1
118:debug:main epoch: in tree: 0 installed: 0
119:debug:main gettext 0.18.3.1_1 exists in the ports tree
120:debug:main gettext 0.18.3.1_1  is the latest installed
121:debug:main gettext 0.18.3.1_1  is active
122:debug:main Merging existing variants '' into variants
123:debug:main new fully merged portvariants: bash_completion +
124:debug:main Changing to port directory: /opt/local/var/macports/sources/rsync.macports.org/release/tarballs/ports/devel/gettext
125:debug:main OS darwin/13.0.0 (Mac OS X 10.9) arch i386
126:debug:main Reading variant descriptions from /opt/local/var/macports/sources/rsync.macports.org/release/tarballs/ports/_resources/port1.0/variant_descriptions.conf
127:debug:main compiler clang 500.2.79 not blacklisted because does not match {clang < 211.10.1}
128:debug:main universal variant already exists, so not adding the default one
129:debug:main Requested variant +bash_completion is not provided by port gettext.
130:debug:main Running callback portconfigure::add_automatic_compiler_dependencies
131:debug:main Finished running callback portconfigure::add_automatic_compiler_dependencies
132:debug:main Running callback portbuild::add_automatic_buildsystem_dependencies
133:debug:main Finished running callback portbuild::add_automatic_buildsystem_dependencies
134:debug:main No need to upgrade! gettext 0.18.3.1_1 >= gettext 0.18.3.1_1
135:debug:main epoch: in tree: 0 installed: 0
136:debug:main ncurses 5.9_2 exists in the ports tree
137:debug:main ncurses 5.9_2  is the latest installed
138:debug:main ncurses 5.9_2  is active
139:debug:main Merging existing variants '' into variants
140:debug:main new fully merged portvariants: bash_completion +
141:debug:main Changing to port directory: /opt/local/var/macports/sources/rsync.macports.org/release/tarballs/ports/devel/ncurses
142:debug:main OS darwin/13.0.0 (Mac OS X 10.9) arch i386
143:debug:main adding the default universal variant
144:debug:main Reading variant descriptions from /opt/local/var/macports/sources/rsync.macports.org/release/tarballs/ports/_resources/port1.0/variant_descriptions.conf
145:debug:main Requested variant +bash_completion is not provided by port ncurses.
146:debug:main Running callback portconfigure::add_automatic_compiler_dependencies
147:debug:main Finished running callback portconfigure::add_automatic_compiler_dependencies
148:debug:main Running callback portbuild::add_automatic_buildsystem_dependencies
149:debug:main Finished running callback portbuild::add_automatic_buildsystem_dependencies
150:debug:main No need to upgrade! ncurses 5.9_2 >= ncurses 5.9_2
151:debug:main epoch: in tree: 1 installed: 1
152:debug:main openssl 1.0.1e_1 exists in the ports tree
153:debug:main openssl 1.0.1e_1  is the latest installed
154:debug:main openssl 1.0.1e_1  is active
155:debug:main Merging existing variants '' into variants
156:debug:main new fully merged portvariants: bash_completion +
157:debug:main Changing to port directory: /opt/local/var/macports/sources/rsync.macports.org/release/tarballs/ports/devel/openssl
158:debug:main OS darwin/13.0.0 (Mac OS X 10.9) arch i386
159:debug:main Reading variant descriptions from /opt/local/var/macports/sources/rsync.macports.org/release/tarballs/ports/_resources/port1.0/variant_descriptions.conf
160:debug:main universal variant already exists, so not adding the default one
161:debug:main Requested variant +bash_completion is not provided by port openssl.
162:debug:main Running callback portconfigure::add_automatic_compiler_dependencies
163:debug:main Finished running callback portconfigure::add_automatic_compiler_dependencies
164:debug:main Running callback portbuild::add_automatic_buildsystem_dependencies
165:debug:main Finished running callback portbuild::add_automatic_buildsystem_dependencies
166:debug:main No need to upgrade! openssl 1.0.1e_1 >= openssl 1.0.1e_1
167:debug:main epoch: in tree: 0 installed: 0
168:debug:main sqlite3 3.8.0.2_0 exists in the ports tree
169:debug:main sqlite3 3.8.0.2_0  is the latest installed
170:debug:main sqlite3 3.8.0.2_0  is active
171:debug:main Merging existing variants '' into variants
172:debug:main new fully merged portvariants: bash_completion +
173:debug:main Changing to port directory: /opt/local/var/macports/sources/rsync.macports.org/release/tarballs/ports/databases/sqlite3
174:debug:main OS darwin/13.0.0 (Mac OS X 10.9) arch i386
175:debug:main adding the default universal variant
176:debug:main Reading variant descriptions from /opt/local/var/macports/sources/rsync.macports.org/release/tarballs/ports/_resources/port1.0/variant_descriptions.conf
177:debug:main Requested variant +bash_completion is not provided by port sqlite3.
178:debug:main Running callback portconfigure::add_automatic_compiler_dependencies
179:debug:main Finished running callback portconfigure::add_automatic_compiler_dependencies
180:debug:main Running callback portbuild::add_automatic_buildsystem_dependencies
181:debug:main Finished running callback portbuild::add_automatic_buildsystem_dependencies
182:debug:main No need to upgrade! sqlite3 3.8.0.2_0 >= sqlite3 3.8.0.2_0
183:debug:main epoch: in tree: 20090923 installed: 20090923
184:debug:main libedit 20121213-3.0_0 exists in the ports tree
185:debug:main libedit 20121213-3.0_0  is the latest installed
186:debug:main libedit 20121213-3.0_0  is active
187:debug:main Merging existing variants '' into variants
188:debug:main new fully merged portvariants: bash_completion +
189:debug:main Changing to port directory: /opt/local/var/macports/sources/rsync.macports.org/release/tarballs/ports/devel/libedit
190:debug:main OS darwin/13.0.0 (Mac OS X 10.9) arch i386
191:debug:main Reading variant descriptions from /opt/local/var/macports/sources/rsync.macports.org/release/tarballs/ports/_resources/port1.0/variant_descriptions.conf
192:debug:main universal variant already exists, so not adding the default one
193:debug:main Requested variant +bash_completion is not provided by port libedit.
194:debug:main Running callback portconfigure::add_automatic_compiler_dependencies
195:debug:main Finished running callback portconfigure::add_automatic_compiler_dependencies
196:debug:main Running callback portbuild::add_automatic_buildsystem_dependencies
197:debug:main Finished running callback portbuild::add_automatic_buildsystem_dependencies
198:debug:main No need to upgrade! libedit 20121213-3.0_0 >= libedit 20121213-3.0_0
199:debug:main epoch: in tree: 0 installed: 0
200:debug:main db46 4.6.21_8 exists in the ports tree
201:debug:main db46 4.6.21_8  is the latest installed
202:debug:main db46 4.6.21_8  is active
203:debug:main Merging existing variants '' into variants
204:debug:main new fully merged portvariants: bash_completion +
205:debug:main Changing to port directory: /opt/local/var/macports/sources/rsync.macports.org/release/tarballs/ports/databases/db46
206:debug:main OS darwin/13.0.0 (Mac OS X 10.9) arch i386
207:debug:main Reading variant descriptions from /opt/local/var/macports/sources/rsync.macports.org/release/tarballs/ports/_resources/port1.0/variant_descriptions.conf
208:debug:main universal variant already exists, so not adding the default one
209:debug:main Requested variant +bash_completion is not provided by port db46.
210:debug:main Running callback portconfigure::add_automatic_compiler_dependencies
211:debug:main Finished running callback portconfigure::add_automatic_compiler_dependencies
212:debug:main Running callback portbuild::add_automatic_buildsystem_dependencies
213:debug:main Finished running callback portbuild::add_automatic_buildsystem_dependencies
214:debug:main No need to upgrade! db46 4.6.21_8 >= db46 4.6.21_8
215:debug:main epoch: in tree: 0 installed: 0
216:debug:main db_select 0.1_2 exists in the ports tree
217:debug:main db_select 0.1_2  is the latest installed
218:debug:main db_select 0.1_2  is active
219:debug:main Merging existing variants '' into variants
220:debug:main new fully merged portvariants: bash_completion +
221:debug:main Changing to port directory: /opt/local/var/macports/sources/rsync.macports.org/release/tarballs/ports/sysutils/db_select
222:debug:main OS darwin/13.0.0 (Mac OS X 10.9) arch i386
223:debug:main universal_variant is false, so not adding the default universal variant
224:debug:main Requested variant +bash_completion is not provided by port db_select.
225:debug:main Running callback portconfigure::add_automatic_compiler_dependencies
226:debug:main Finished running callback portconfigure::add_automatic_compiler_dependencies
227:debug:main Running callback portbuild::add_automatic_buildsystem_dependencies
228:debug:main Finished running callback portbuild::add_automatic_buildsystem_dependencies
229:debug:main No need to upgrade! db_select 0.1_2 >= db_select 0.1_2
230:debug:main epoch: in tree: 0 installed: 0
231:debug:main python_select 0.3_2 exists in the ports tree
232:debug:main python_select 0.3_2  is the latest installed
233:debug:main python_select 0.3_2  is active
234:debug:main Merging existing variants '' into variants
235:debug:main new fully merged portvariants: bash_completion +
236:debug:main Changing to port directory: /opt/local/var/macports/sources/rsync.macports.org/release/tarballs/ports/sysutils/python_select
237:debug:main OS darwin/13.0.0 (Mac OS X 10.9) arch i386
238:debug:main universal_variant is false, so not adding the default universal variant
239:debug:main Requested variant +bash_completion is not provided by port python_select.
240:debug:main Running callback portconfigure::add_automatic_compiler_dependencies
241:debug:main Finished running callback portconfigure::add_automatic_compiler_dependencies
242:debug:main Running callback portbuild::add_automatic_buildsystem_dependencies
243:debug:main Finished running callback portbuild::add_automatic_buildsystem_dependencies
244:debug:main No need to upgrade! python_select 0.3_2 >= python_select 0.3_2
245:debug:main epoch: in tree: 0 installed: 0
246:debug:main libevent 2.0.21_0 exists in the ports tree
247:debug:main libevent 2.0.21_0  is the latest installed
248:debug:main libevent 2.0.21_0  is active
249:debug:main Merging existing variants '' into variants
250:debug:main new fully merged portvariants: bash_completion +
251:debug:main Changing to port directory: /opt/local/var/macports/sources/rsync.macports.org/release/tarballs/ports/devel/libevent
252:debug:main OS darwin/13.0.0 (Mac OS X 10.9) arch i386
253:debug:main adding the default universal variant
254:debug:main Reading variant descriptions from /opt/local/var/macports/sources/rsync.macports.org/release/tarballs/ports/_resources/port1.0/variant_descriptions.conf
255:debug:main Requested variant +bash_completion is not provided by port libevent.
256:debug:main Running callback portconfigure::add_automatic_compiler_dependencies
257:debug:main Finished running callback portconfigure::add_automatic_compiler_dependencies
258:debug:main Running callback portbuild::add_automatic_buildsystem_dependencies
259:debug:main Finished running callback portbuild::add_automatic_buildsystem_dependencies
260:debug:main No need to upgrade! libevent 2.0.21_0 >= libevent 2.0.21_0
261:msg:main --->  Computing dependencies for gearmand:info:main .:debug:main gearmand has no conflicts
262:debug:main Searching for dependency: boost
263:debug:main Found Dependency: receipt exists for boost
264:debug:main Searching for dependency: libevent
265:debug:main Found Dependency: receipt exists for libevent
266:debug:main Searching for dependency: sqlite3
267:debug:main Found Dependency: receipt exists for sqlite3
268:msg:main
269:debug:main Executing org.macports.main (gearmand)
270:debug:main changing euid/egid - current euid: 0 - current egid: 0
271:debug:main egid changed to: 501
272:debug:main euid changed to: 502
273:debug:archivefetch archivefetch phase started at Sun Oct 27 18:02:14 EDT 2013
274:msg:archivefetch --->  Fetching archive for gearmand
275:debug:archivefetch Executing org.macports.archivefetch (gearmand)
276:debug:archivefetch euid/egid changed to: 0/0
277:debug:archivefetch chowned /opt/local/var/macports/incoming to macports
278:debug:archivefetch euid/egid changed to: 502/501
279:info:archivefetch --->  gearmand-0.41_0+sqlite.darwin_13.x86_64.tbz2 doesn't seem to exist in /opt/local/var/macports/incoming/verified
280:msg:archivefetch --->  Attempting to fetch gearmand-0.41_0+sqlite.darwin_13.x86_64.tbz2 from http://packages.macports.org/gearmand
281:debug:archivefetch Fetching archive failed:: The requested URL returned error: 404 Not Found
282:msg:archivefetch --->  Attempting to fetch gearmand-0.41_0+sqlite.darwin_13.x86_64.tbz2 from http://mse.uk.packages.macports.org/sites/packages.macports.org/gearmand
283:debug:archivefetch Fetching archive failed:: The requested URL returned error: 404 Not Found
284:msg:archivefetch --->  Attempting to fetch gearmand-0.41_0+sqlite.darwin_13.x86_64.tbz2 from http://lil.fr.packages.macports.org/gearmand
285:debug:archivefetch Fetching archive failed:: The requested URL returned error: 404 Not Found
286:debug:archivefetch Privilege de-escalation not attempted as not running as root.
287:debug:fetch fetch phase started at Sun Oct 27 18:02:15 EDT 2013
288:notice:fetch --->  Fetching distfiles for gearmand
289:debug:fetch Executing org.macports.fetch (gearmand)
290:debug:fetch Privilege de-escalation not attempted as not running as root.
291:debug:checksum checksum phase started at Sun Oct 27 18:02:15 EDT 2013
292:notice:checksum --->  Verifying checksums for gearmand
293:debug:checksum Executing org.macports.checksum (gearmand)
294:info:checksum --->  Checksumming gearmand-0.41.tar.gz
295:debug:checksum Correct (rmd160) checksum for gearmand-0.41.tar.gz
296:debug:checksum Correct (sha256) checksum for gearmand-0.41.tar.gz
297:debug:checksum Privilege de-escalation not attempted as not running as root.
298:debug:extract extract phase started at Sun Oct 27 18:02:15 EDT 2013
299:notice:extract --->  Extracting gearmand
300:debug:extract Executing org.macports.extract (gearmand)
301:info:extract --->  Extracting gearmand-0.41.tar.gz
302:debug:extract setting option extract.args to '/opt/local/var/macports/distfiles/gearmand/gearmand-0.41.tar.gz'
303:debug:extract Environment: CPATH='/opt/local/include' CC_PRINT_OPTIONS_FILE='/opt/local/var/macports/build/_opt_local_var_macports_sources_rsync.macports.org_release_tarballs_ports_sysutils_gearmand/gearmand/work/.CC_PRINT_OPTIONS' LIBRARY_PATH='/opt/local/lib' CC_PRINT_OPTIONS='YES' MACOSX_DEPLOYMENT_TARGET='10.9'
304:debug:extract Assembled command: 'cd "/opt/local/var/macports/build/_opt_local_var_macports_sources_rsync.macports.org_release_tarballs_ports_sysutils_gearmand/gearmand/work" && /usr/bin/gzip -dc '/opt/local/var/macports/distfiles/gearmand/gearmand-0.41.tar.gz' | /usr/bin/tar -xf -'
305:debug:extract Executing command line:  cd "/opt/local/var/macports/build/_opt_local_var_macports_sources_rsync.macports.org_release_tarballs_ports_sysutils_gearmand/gearmand/work" && /usr/bin/gzip -dc '/opt/local/var/macports/distfiles/gearmand/gearmand-0.41.tar.gz' | /usr/bin/tar -xf -
306:debug:extract euid/egid changed to: 0/0
307:debug:extract chowned /opt/local/var/macports/build/_opt_local_var_macports_sources_rsync.macports.org_release_tarballs_ports_sysutils_gearmand/gearmand/work to macports
308:debug:extract euid/egid changed to: 502/501
309:debug:extract Privilege de-escalation not attempted as not running as root.
310:debug:patch patch phase started at Sun Oct 27 18:02:16 EDT 2013
311:debug:patch Executing org.macports.patch (gearmand)
312:debug:patch Privilege de-escalation not attempted as not running as root.
313:debug:configure configure phase started at Sun Oct 27 18:02:17 EDT 2013
314:notice:configure --->  Configuring gearmand
315:debug:configure Using compiler 'Xcode Clang'
316:debug:configure Executing org.macports.configure (gearmand)
317:debug:configure Environment: CPATH='/opt/local/include' CFLAGS='-pipe -Os -arch x86_64' CPPFLAGS='-I/opt/local/include' CXXFLAGS='-pipe -Os -arch x86_64' LIBRARY_PATH='/opt/local/lib' MACOSX_DEPLOYMENT_TARGET='10.9' CXX='/usr/bin/clang++  -arch x86_64' CC_PRINT_OPTIONS_FILE='/opt/local/var/macports/build/_opt_local_var_macports_sources_rsync.macports.org_release_tarballs_ports_sysutils_gearmand/gearmand/work/.CC_PRINT_OPTIONS' F90FLAGS='-pipe -Os -m64' LDFLAGS='-L/opt/local/lib -Wl,-headerpad_max_install_names -arch x86_64' FCFLAGS='-pipe -Os -m64' OBJC='/usr/bin/clang' OBJCXX='/usr/bin/clang++' INSTALL='/usr/bin/install -c' OBJCFLAGS='-pipe -Os -arch x86_64' OBJCXXFLAGS='-pipe -Os -arch x86_64' FFLAGS='-pipe -Os -m64' CC_PRINT_OPTIONS='YES' CC='/usr/bin/clang  -arch x86_64'
318:debug:configure Assembled command: 'cd "/opt/local/var/macports/build/_opt_local_var_macports_sources_rsync.macports.org_release_tarballs_ports_sysutils_gearmand/gearmand/work/gearmand-0.41" && ./configure --prefix=/opt/local --disable-silent-rules --disable-libdrizzle --disable-libpq --disable-libmemcached --disable-libtokyocabinet --enable-jobserver=4 --without-mysql'
319:debug:configure Executing command line:  cd "/opt/local/var/macports/build/_opt_local_var_macports_sources_rsync.macports.org_release_tarballs_ports_sysutils_gearmand/gearmand/work/gearmand-0.41" && ./configure --prefix=/opt/local --disable-silent-rules --disable-libdrizzle --disable-libpq --disable-libmemcached --disable-libtokyocabinet --enable-jobserver=4 --without-mysql
320:info:configure checking build system type... x86_64-apple-darwin13.0.0
321:info:configure checking host system type... x86_64-apple-darwin13.0.0
322:info:configure checking target system type... x86_64-apple-darwin13.0.0
323:info:configure checking for gcc... /usr/bin/clang  -arch x86_64
324:info:configure checking whether the C compiler works... yes
325:info:configure checking for C compiler default output file name... a.out
326:info:configure checking for suffix of executables...
327:info:configure checking whether we are cross compiling... no
328:info:configure checking for suffix of object files... o
329:info:configure checking whether we are using the GNU C compiler... yes
330:info:configure checking whether /usr/bin/clang  -arch x86_64 accepts -g... yes
331:info:configure checking for /usr/bin/clang  -arch x86_64 option to accept ISO C89... none needed
332:info:configure checking how to run the C preprocessor... /usr/bin/clang  -arch x86_64 -E
333:info:configure checking for grep that handles long lines and -e... /usr/bin/grep
334:info:configure checking for egrep... /usr/bin/grep -E
335:info:configure checking for ANSI C header files... yes
336:info:configure checking for sys/types.h... yes
337:info:configure checking for sys/stat.h... yes
338:info:configure checking for stdlib.h... yes
339:info:configure checking for string.h... yes
340:info:configure checking for memory.h... yes
341:info:configure checking for strings.h... yes
342:info:configure checking for inttypes.h... yes
343:info:configure checking for stdint.h... yes
344:info:configure checking for unistd.h... yes
345:info:configure checking minix/config.h usability... no
346:info:configure checking minix/config.h presence... no
347:info:configure checking for minix/config.h... no
348:info:configure checking whether it is safe to define __EXTENSIONS__... yes
349:info:configure checking for a BSD-compatible install... /usr/bin/install -c
350:info:configure checking whether build environment is sane... yes
351:info:configure checking for a thread-safe mkdir -p... build-aux/install-sh -c -d
352:info:configure checking for gawk... no
353:info:configure checking for mawk... no
354:info:configure checking for nawk... no
355:info:configure checking for awk... awk
356:info:configure checking whether make sets $(MAKE)... yes
357:info:configure checking for style of include used by make... GNU
358:info:configure checking how to create a ustar tar archive... gnutar
359:info:configure checking dependency style of /usr/bin/clang  -arch x86_64... gcc3
360:info:configure checking how to print strings... printf
361:info:configure checking for a sed that does not truncate output... /opt/local/bin/gsed
362:info:configure checking for fgrep... /usr/bin/grep -F
363:info:configure checking for ld used by /usr/bin/clang  -arch x86_64... /Applications/Xcode.app/Contents/Developer/Toolchains/XcodeDefault.xctoolchain/usr/bin/ld
364:info:configure checking if the linker (/Applications/Xcode.app/Contents/Developer/Toolchains/XcodeDefault.xctoolchain/usr/bin/ld) is GNU ld... no
365:info:configure checking for BSD- or MS-compatible name lister (nm)... /usr/bin/nm
366:info:configure checking the name lister (/usr/bin/nm) interface... BSD nm
367:info:configure checking whether ln -s works... yes
368:info:configure checking the maximum length of command line arguments... 196608
369:info:configure checking whether the shell understands some XSI constructs... yes
370:info:configure checking whether the shell understands "+="... yes
371:info:configure checking how to convert x86_64-apple-darwin13.0.0 file names to x86_64-apple-darwin13.0.0 format... func_convert_file_noop
372:info:configure checking how to convert x86_64-apple-darwin13.0.0 file names to toolchain format... func_convert_file_noop
373:info:configure checking for /Applications/Xcode.app/Contents/Developer/Toolchains/XcodeDefault.xctoolchain/usr/bin/ld option to reload object files... -r
374:info:configure checking for objdump... no
375:info:configure checking how to recognize dependent libraries... pass_all
376:info:configure checking for dlltool... no
377:info:configure checking how to associate runtime and link libraries... printf %s\n
378:info:configure checking for ar... ar
379:info:configure checking for archiver @FILE support... no
380:info:configure checking for strip... strip
381:info:configure checking for ranlib... ranlib
382:info:configure checking command to parse /usr/bin/nm output from /usr/bin/clang  -arch x86_64 object... ok
383:info:configure checking for sysroot... no
384:info:configure checking for mt... no
385:info:configure checking if : is a manifest tool... no
386:info:configure checking for dsymutil... dsymutil
387:info:configure checking for nmedit... nmedit
388:info:configure checking for lipo... lipo
389:info:configure checking for otool... otool
390:info:configure checking for otool64... no
391:info:configure checking for -single_module linker flag... yes
392:info:configure checking for -exported_symbols_list linker flag... yes
393:info:configure checking for -force_load linker flag... yes
394:info:configure checking for dlfcn.h... yes
395:info:configure checking for objdir... .libs
396:info:configure checking if /usr/bin/clang  -arch x86_64 supports -fno-rtti -fno-exceptions... yes
397:info:configure checking for /usr/bin/clang  -arch x86_64 option to produce PIC... -fno-common -DPIC
398:info:configure checking if /usr/bin/clang  -arch x86_64 PIC flag -fno-common -DPIC works... yes
399:info:configure checking if /usr/bin/clang  -arch x86_64 static flag -static works... no
400:info:configure checking if /usr/bin/clang  -arch x86_64 supports -c -o file.o... yes
401:info:configure checking if /usr/bin/clang  -arch x86_64 supports -c -o file.o... (cached) yes
402:info:configure checking whether the /usr/bin/clang  -arch x86_64 linker (/Applications/Xcode.app/Contents/Developer/Toolchains/XcodeDefault.xctoolchain/usr/bin/ld) supports shared libraries... yes
403:info:configure checking dynamic linker characteristics... darwin13.0.0 dyld
404:info:configure checking how to hardcode library paths into programs... immediate
405:info:configure checking whether stripping libraries is possible... yes
406:info:configure checking if libtool supports shared libraries... yes
407:info:configure checking whether to build shared libraries... yes
408:info:configure checking whether to build static libraries... no
409:info:configure checking whether we are using the GNU C++ compiler... yes
410:info:configure checking whether /usr/bin/clang++  -arch x86_64 accepts -g... yes
411:info:configure checking dependency style of /usr/bin/clang++  -arch x86_64... gcc3
412:info:configure checking how to run the C++ preprocessor... /usr/bin/clang++  -arch x86_64 -E
413:info:configure checking for ld used by /usr/bin/clang++  -arch x86_64... /Applications/Xcode.app/Contents/Developer/Toolchains/XcodeDefault.xctoolchain/usr/bin/ld
414:info:configure checking if the linker (/Applications/Xcode.app/Contents/Developer/Toolchains/XcodeDefault.xctoolchain/usr/bin/ld) is GNU ld... no
415:info:configure checking whether the /usr/bin/clang++  -arch x86_64 linker (/Applications/Xcode.app/Contents/Developer/Toolchains/XcodeDefault.xctoolchain/usr/bin/ld) supports shared libraries... yes
416:info:configure checking for /usr/bin/clang++  -arch x86_64 option to produce PIC... -fno-common -DPIC
417:info:configure checking if /usr/bin/clang++  -arch x86_64 PIC flag -fno-common -DPIC works... yes
418:info:configure checking if /usr/bin/clang++  -arch x86_64 static flag -static works... no
419:info:configure checking if /usr/bin/clang++  -arch x86_64 supports -c -o file.o... yes
420:info:configure checking if /usr/bin/clang++  -arch x86_64 supports -c -o file.o... (cached) yes
421:info:configure checking whether the /usr/bin/clang++  -arch x86_64 linker (/Applications/Xcode.app/Contents/Developer/Toolchains/XcodeDefault.xctoolchain/usr/bin/ld) supports shared libraries... yes
422:info:configure checking dynamic linker characteristics... darwin13.0.0 dyld
423:info:configure checking how to hardcode library paths into programs... immediate
424:info:configure checking whether the -Werror option is usable... yes
425:info:configure checking for simple visibility declarations... yes
426:info:configure checking whether __SUNPRO_C is declared... no
427:info:configure checking whether __ICC is declared... no
428:info:configure checking whether make supports nested variables... yes
429:info:configure checking for Boost headers version >= 1.39.0... yes
430:info:configure checking for Boost's header version... 1_54
431:info:configure checking for the toolset name used by Boost for /usr/bin/clang++  -arch x86_64... xgcc42 -xgcc
432:info:configure checking boost/program_options.hpp usability... yes
433:info:configure checking boost/program_options.hpp presence... yes
434:info:configure checking for boost/program_options.hpp... yes
435:info:configure checking for the Boost program_options library... yes
436:info:configure checking for the flags needed to use pthreads...
437:info:configure checking boost/system/error_code.hpp usability... yes
438:info:configure checking boost/system/error_code.hpp presence... yes
439:info:configure checking for boost/system/error_code.hpp... yes
440:info:configure checking for the Boost system library... yes
441:info:configure checking boost/thread.hpp usability... yes
442:info:configure checking boost/thread.hpp presence... yes
443:info:configure checking for boost/thread.hpp... yes
444:info:configure checking for the Boost thread library... yes
445:info:configure checking for location of cstdint... <cstdint>
446:info:configure <cstdint>
447:info:configure checking for location of cinttypes... <cinttypes>
448:info:configure <cinttypes>
449:info:configure checking for mysqld... /opt/local/bin/mysqld
450:info:configure checking libmemcached-1.0/memcached.h usability... no
451:info:configure checking libmemcached-1.0/memcached.h presence... no
452:info:configure checking for libmemcached-1.0/memcached.h... no
453:info:configure checking whether memcached executable path has been provided... no
454:info:configure checking for memcached... /usr/bin/memcached
455:info:configure checking whether memcached_sasl executable path has been provided... no
456:info:configure checking for memcached_sasl... no
457:info:configure checking for curl-config... /opt/local/bin/curl-config
458:info:configure checking for curl (7.33.0) >= 7.21.7... yes
459:info:configure checking curl/curl.h usability... yes
460:info:configure checking curl/curl.h presence... yes
461:info:configure checking for curl/curl.h... yes
462:info:configure checking whether drizzled executable path has been provided... no
463:info:configure checking for drizzled... no
464:info:configure checking for pkg-config... /opt/local/bin/pkg-config
465:info:configure checking pkg-config is at least version 0.9.0... yes
466:info:configure checking for SQLite3 library >= 3.0.0... yes
467:info:configure checking for pg_config... no
468:info:configure configure: WARNING:  does not exist or it is not an exectuable file
469:info:configure no
470:info:configure checking  usability... no
471:info:configure checking  presence... no
472:info:configure checking for ... no
473:info:configure checking whether strerror_r is declared... yes
474:info:configure checking for strerror_r... yes
475:info:configure checking whether strerror_r returns char *... no
476:info:configure checking for MSG_NOSIGNAL...
477:info:configure checking for MSG_DONTWAIT... yes
478:info:configure checking for MSG_MORE...
479:info:configure checking for O_CLOEXEC... yes
480:info:configure checking hiredis/hiredis.h usability... no
481:info:configure checking hiredis/hiredis.h presence... no
482:info:configure checking for hiredis/hiredis.h... no
483:info:configure checking for gawk... (cached) awk
484:info:configure checking whether ln -s works... yes
485:info:configure checking whether make sets $(MAKE)... (cached) yes
486:info:configure checking for valgrind... no
487:info:configure checking for perl... perl
488:info:configure checking for dpkg-gensymbols... no
489:info:configure checking for lcov... no
490:info:configure checking for genhtml... no
491:info:configure checking for sphinx-build... no
492:info:configure checking for ANSI C header files... (cached) yes
493:info:configure checking for sys/wait.h that is POSIX.1 compatible... yes
494:info:configure checking arpa/inet.h usability... yes
495:info:configure checking arpa/inet.h presence... yes
496:info:configure checking for arpa/inet.h... yes
497:info:configure checking cxxabi.h usability... no
498:info:configure checking cxxabi.h presence... yes
499:info:configure configure: WARNING: cxxabi.h: present but cannot be compiled
500:info:configure configure: WARNING: cxxabi.h:     check for missing prerequisite headers?
501:info:configure configure: WARNING: cxxabi.h: see the Autoconf documentation
502:info:configure configure: WARNING: cxxabi.h:     section "Present But Cannot Be Compiled"
503:info:configure configure: WARNING: cxxabi.h: proceeding with the compiler's result
504:info:configure configure: WARNING:     ## -------------------------------------------------- ##
505:info:configure configure: WARNING:     ## Report this to https://bugs.launchpad.net/gearmand ##
506:info:configure configure: WARNING:     ## -------------------------------------------------- ##
507:info:configure checking for cxxabi.h... no
508:info:configure checking errno.h usability... yes
509:info:configure checking errno.h presence... yes
510:info:configure checking for errno.h... yes
511:info:configure checking execinfo.h usability... yes
512:info:configure checking execinfo.h presence... yes
513:info:configure checking for execinfo.h... yes
514:info:configure checking fcntl.h usability... yes
515:info:configure checking fcntl.h presence... yes
516:info:configure checking for fcntl.h... yes
517:info:configure checking getopt.h usability... yes
518:info:configure checking getopt.h presence... yes
519:info:configure checking for getopt.h... yes
520:info:configure checking for inttypes.h... (cached) yes
521:info:configure checking limits.h usability... yes
522:info:configure checking limits.h presence... yes
523:info:configure checking for limits.h... yes
524:info:configure checking netdb.h usability... yes
525:info:configure checking netdb.h presence... yes
526:info:configure checking for netdb.h... yes
527:info:configure checking netinet/in.h usability... yes
528:info:configure checking netinet/in.h presence... yes
529:info:configure checking for netinet/in.h... yes
530:info:configure checking netinet/tcp.h usability... yes
531:info:configure checking netinet/tcp.h presence... yes
532:info:configure checking for netinet/tcp.h... yes
533:info:configure checking pwd.h usability... yes
534:info:configure checking pwd.h presence... yes
535:info:configure checking for pwd.h... yes
536:info:configure checking signal.h usability... yes
537:info:configure checking signal.h presence... yes
538:info:configure checking for signal.h... yes
539:info:configure checking stdarg.h usability... yes
540:info:configure checking stdarg.h presence... yes
541:info:configure checking for stdarg.h... yes
542:info:configure checking stddef.h usability... yes
543:info:configure checking stddef.h presence... yes
544:info:configure checking for stddef.h... yes
545:info:configure checking for stdint.h... (cached) yes
546:info:configure checking stdio.h usability... yes
547:info:configure checking stdio.h presence... yes
548:info:configure checking for stdio.h... yes
549:info:configure checking for stdlib.h... (cached) yes
550:info:configure checking for string.h... (cached) yes
551:info:configure checking for strings.h... (cached) yes
552:info:configure checking sys/resource.h usability... yes
553:info:configure checking sys/resource.h presence... yes
554:info:configure checking for sys/resource.h... yes
555:info:configure checking sys/socket.h usability... yes
556:info:configure checking sys/socket.h presence... yes
557:info:configure checking for sys/socket.h... yes
558:info:configure checking for sys/stat.h... (cached) yes
559:info:configure checking sys/time.h usability... yes
560:info:configure checking sys/time.h presence... yes
561:info:configure checking for sys/time.h... yes
562:info:configure checking for sys/types.h... (cached) yes
563:info:configure checking sys/utsname.h usability... yes
564:info:configure checking sys/utsname.h presence... yes
565:info:configure checking for sys/utsname.h... yes
566:info:configure checking for unistd.h... (cached) yes
567:info:configure checking for stdbool.h that conforms to C99... yes
568:info:configure checking for _Bool... yes
569:info:configure checking for an ANSI C-conforming const... yes
570:info:configure checking for inline... inline
571:info:configure checking for int32_t... yes
572:info:configure checking for pid_t... yes
573:info:configure checking for size_t... yes
574:info:configure checking for ssize_t... yes
575:info:configure checking whether time.h and sys/time.h may both be included... yes
576:info:configure checking for uid_t in sys/types.h... yes
577:info:configure checking for uint16_t... yes
578:info:configure checking for uint32_t... yes
579:info:configure checking for uint64_t... yes
580:info:configure checking for int64_t... yes
581:info:configure checking for uint8_t... yes
582:info:configure checking for working volatile... yes
583:info:configure checking for ptrdiff_t... yes
584:info:configure checking for error_at_line... no
585:info:configure checking vfork.h usability... no
586:info:configure checking vfork.h presence... no
587:info:configure checking for vfork.h... no
588:info:configure checking for fork... yes
589:info:configure checking for vfork... yes
590:info:configure checking for working fork... yes
591:info:configure checking for working vfork... (cached) yes
592:info:configure checking for stdlib.h... (cached) yes
593:info:configure checking for GNU libc compatible malloc... yes
594:info:configure checking for working memcmp... yes
595:info:configure checking for stdlib.h... (cached) yes
596:info:configure checking for GNU libc compatible realloc... yes
597:info:configure checking whether strerror_r is declared... (cached) yes
598:info:configure checking for strerror_r... (cached) yes
599:info:configure checking whether strerror_r returns char *... (cached) no
600:info:configure checking for vprintf... yes
601:info:configure checking for _doprnt... no
602:info:configure checking for working alloca.h... yes
603:info:configure checking for alloca... yes
604:info:configure checking for mbstate_t... yes
605:info:configure checking for working POSIX fnmatch... yes
606:info:configure checking for dup2... yes
607:info:configure checking for gettimeofday... yes
608:info:configure checking for memchr... yes
609:info:configure checking for memmove... yes
610:info:configure checking for memset... yes
611:info:configure checking for pipe2... no
612:info:configure checking for select... yes
613:info:configure checking for setenv... yes
614:info:configure checking for socket... yes
615:info:configure checking for strcasecmp... yes
616:info:configure checking for strdup... yes
617:info:configure checking for strerror... yes
618:info:configure checking for strncasecmp... yes
619:info:configure checking for strtol... yes
620:info:configure checking for strtoul... yes
621:info:configure checking for uname... yes
622:info:configure checking for dlopen in -ldl... yes
623:info:configure checking for clock_gettime in -lrt... no
624:info:configure checking for floor in -lm... yes
625:info:configure checking for setsockopt... yes
626:info:configure checking for bind... yes
627:info:configure checking event.h usability... yes
628:info:configure checking event.h presence... yes
629:info:configure checking for event.h... yes
630:info:configure checking for main in -levent... yes
631:info:configure checking uuid/uuid.h usability... yes
632:info:configure checking uuid/uuid.h presence... yes
633:info:configure checking for uuid/uuid.h... yes
634:info:configure checking check to see if -luuid is not needed... no
635:info:configure checking for uuid_generate_time_safe... no
636:info:configure checking the number of available CPUs... 4
637:info:configure configure: adding automake macro support
638:info:configure configure: creating aminclude.am
639:info:configure configure: added jobserver support to make for 4 jobs
640:info:configure checking whether pthreads work with -pthread... yes
641:info:configure checking for joinable pthread attribute... PTHREAD_CREATE_JOINABLE
642:info:configure checking if more special flags are required for pthreads... -D_THREAD_SAFE
643:info:configure checking for PTHREAD_PRIO_INHERIT... yes
644:info:configure checking check for pthread_timedjoin_np...
645:info:configure checking whether byte ordering is bigendian... no
646:info:configure checking generate HEX_VERSION... 0x00041000
647:info:configure checking for assert... no
648:info:configure checking for C compiler vendor... clang
649:info:configure checking "C Compiler version"... checking whether __GNUC_PATCHLEVEL__ is declared... yes
650:info:configure checking whether __SUNPRO_C is declared... (cached) no
651:info:configure checking whether __ICC is declared... (cached) no
652:info:configure checking whether __clang__ is declared... yes
653:info:configure "Apple LLVM version 5.0 (clang-500.2.79) (based on LLVM 3.3svn)"
654:info:configure checking "C++ Compiler version"... "Apple LLVM version 5.0 (clang-500.2.79) (based on LLVM 3.3svn)"
655:info:configure checking whether C compiler accepts ... yes
656:info:configure checking whether the linker accepts ... yes
657:info:configure checking for vcs checkout...
658:info:configure checking for debug... no
659:info:configure checking whether the linker accepts -z relro -z now... no
660:info:configure ./configure: line 25215: -Werror: command not found
661:info:configure checking whether the linker accepts -pie... yes
662:info:configure checking whether C compiler accepts -g... yes
663:info:configure checking whether C compiler accepts -O2... yes
664:info:configure checking whether C compiler accepts -Wno-pragmas... no
665:info:configure checking whether C compiler accepts -Wall... yes
666:info:configure checking whether C compiler accepts -Wextra... yes
667:info:configure checking whether C compiler accepts -Wunknown-pragmas... yes
668:info:configure checking whether C compiler accepts -Wthis-test-should-fail... no
669:info:configure checking whether C compiler accepts -std=c99... yes
670:info:configure checking whether C compiler accepts --param=ssp-buffer-size=1... yes
671:info:configure checking whether C compiler accepts -Waddress... yes
672:info:configure checking whether C compiler accepts -Warray-bounds... yes
673:info:configure checking whether C compiler accepts -Wbad-function-cast... yes
674:info:configure checking whether C compiler accepts -Wchar-subscripts... yes
675:info:configure checking whether C compiler accepts -Wcomment... yes
676:info:configure checking whether C compiler accepts -Wfloat-equal... yes
677:info:configure checking whether C compiler accepts -Wformat-security... yes
678:info:configure checking whether C compiler accepts -Wformat=2... yes
679:info:configure checking whether C compiler accepts -Wlogical-op... no
680:info:configure checking whether C compiler accepts -Wmaybe-uninitialized... no
681:info:configure checking whether C compiler accepts -Wmissing-field-initializers... yes
682:info:configure checking whether C compiler accepts -Wmissing-noreturn... yes
683:info:configure checking whether C compiler accepts -Wmissing-prototypes... yes
684:info:configure checking whether C compiler accepts -Wnested-externs... yes
685:info:configure checking whether C compiler accepts -Wnormalized=id... no
686:info:configure checking whether C compiler accepts -Wold-style-definition... yes
687:info:configure checking whether C compiler accepts -Woverride-init... no
688:info:configure checking whether C compiler accepts -Wpointer-arith... yes
689:info:configure checking whether C compiler accepts -Wpointer-sign... yes
690:info:configure checking whether C compiler accepts -Wredundant-decls... yes
691:info:configure checking whether C compiler accepts -Wshadow... yes
692:info:configure checking whether C compiler accepts -Wshorten-64-to-32... yes
693:info:configure checking whether C compiler accepts -Wsign-compare... yes
694:info:configure checking whether C compiler accepts -Wstrict-overflow=1... yes
695:info:configure checking whether C compiler accepts -Wstrict-prototypes... yes
696:info:configure checking whether C compiler accepts -Wswitch-enum... yes
697:info:configure checking whether C compiler accepts -Wundef... yes
698:info:configure checking whether C compiler accepts -Wunused-result... yes
699:info:configure checking whether C compiler accepts -Wunused-variable... yes
700:info:configure checking whether C compiler accepts -Wwrite-strings... yes
701:info:configure checking whether C compiler accepts -floop-parallelize-all... no
702:info:configure checking whether C compiler accepts -fwrapv... yes
703:info:configure checking whether C++ compiler accepts -g... yes
704:info:configure checking whether C++ compiler accepts -O2... yes
705:info:configure checking whether C++ compiler accepts -D_FORTIFY_SOURCE=2... yes
706:info:configure checking whether C++ compiler accepts -Wno-pragmas... no
707:info:configure checking whether C++ compiler accepts -Wall... yes
708:info:configure checking whether C++ compiler accepts -Wextra... yes
709:info:configure checking whether C++ compiler accepts -Wunknown-pragmas... yes
710:info:configure checking whether C++ compiler accepts -Wthis-test-should-fail... no
711:info:configure checking whether C++ compiler accepts --param=ssp-buffer-size=1... yes
712:info:configure checking whether C++ compiler accepts -Waddress... yes
713:info:configure checking whether C++ compiler accepts -Warray-bounds... yes
714:info:configure checking whether C++ compiler accepts -Wchar-subscripts... yes
715:info:configure checking whether C++ compiler accepts -Wcomment... yes
716:info:configure checking whether C++ compiler accepts -Wctor-dtor-privacy... yes
717:info:configure checking whether C++ compiler accepts -Wfloat-equal... yes
718:info:configure checking whether C++ compiler accepts -Wformat=2... yes
719:info:configure checking whether C++ compiler accepts -Wmaybe-uninitialized... no
720:info:configure checking whether C++ compiler accepts -Wmissing-field-initializers... yes
721:info:configure checking whether C++ compiler accepts -Wmissing-noreturn... yes
722:info:configure checking whether C++ compiler accepts -Wlogical-op... no
723:info:configure checking whether C++ compiler accepts -Wnon-virtual-dtor... yes
724:info:configure checking whether C++ compiler accepts -Wnormalized=id... no
725:info:configure checking whether C++ compiler accepts -Woverloaded-virtual... yes
726:info:configure checking whether C++ compiler accepts -Wpointer-arith... yes
727:info:configure checking whether C++ compiler accepts -Wredundant-decls... yes
728:info:configure checking whether C++ compiler accepts -Wshadow... yes
729:info:configure checking whether C++ compiler accepts -Wshorten-64-to-32... yes
730:info:configure checking whether C++ compiler accepts -Wsign-compare... yes
731:info:configure checking whether C++ compiler accepts -Wstrict-overflow=1... yes
732:info:configure checking whether C++ compiler accepts -Wswitch-enum... yes
733:info:configure checking whether C++ compiler accepts -Wundef... yes
734:info:configure checking whether C++ compiler accepts -Wc++11-compat... yes
735:info:configure checking whether C++ compiler accepts -Wunused-result... yes
736:info:configure checking whether C++ compiler accepts -Wunused-variable... yes
737:info:configure checking whether C++ compiler accepts -Wwrite-strings... yes
738:info:configure checking whether C++ compiler accepts -Wformat-security... yes
739:info:configure checking whether C++ compiler accepts -floop-parallelize-all... no
740:info:configure checking whether C++ compiler accepts -fwrapv... yes
741:info:configure configure: creating ./config.status
742:info:configure config.status: creating libtest/version.h
743:info:configure config.status: creating Makefile
744:info:configure config.status: creating docs/conf.py
745:info:configure config.status: creating libgearman-1.0/version.h
746:info:configure config.status: creating scripts/gearmand
747:info:configure config.status: creating scripts/gearmand-init
748:info:configure config.status: creating scripts/gearmand.xml
749:info:configure config.status: creating scripts/smf_install.sh
750:info:configure config.status: creating support/gearmand.pc
751:info:configure config.status: creating support/gearmand.spec
752:info:configure config.status: creating config.h
753:info:configure config.status: executing depfiles commands
754:info:configure config.status: executing libtool commands
755:info:configure ---
756:info:configure Configuration summary for gearmand version 0.41
757:info:configure
758:info:configure    * Installation prefix:       /opt/local
759:info:configure    * System type:               apple-darwin13.0.0
760:info:configure    * Host CPU:                  x86_64
761:info:configure    * C Compiler:                Apple LLVM version 5.0 (clang-500.2.79) (based on LLVM 3.3svn)
762:info:configure    * C Flags:                    -g -O2 -Wall -Wextra -Wunknown-pragmas -std=c99 --param=ssp-buffer-size=1 -Waddress -Warray-bounds -Wbad-function-cast -Wchar-subscripts -Wcomment -Wfloat-equal -Wformat-security -Wformat=2 -Wmissing-field-initializers -Wmissing-noreturn -Wmissing-prototypes -Wnested-externs -Wold-style-definition -Wpointer-arith -Wpointer-sign -Wredundant-decls -Wshadow -Wshorten-64-to-32 -Wsign-compare -Wstrict-overflow=1 -Wstrict-prototypes -Wswitch-enum -Wundef -Wunused-result -Wunused-variable -Wwrite-strings -fwrapv
763:info:configure    * C++ Compiler:              Apple LLVM version 5.0 (clang-500.2.79) (based on LLVM 3.3svn)
764:info:configure    * C++ Flags:                  -g -O2 -D_FORTIFY_SOURCE=2 -Wall -Wextra -Wunknown-pragmas --param=ssp-buffer-size=1 -Waddress -Warray-bounds -Wchar-subscripts -Wcomment -Wctor-dtor-privacy -Wfloat-equal -Wformat=2 -Wmissing-field-initializers -Wmissing-noreturn -Wnon-virtual-dtor -Woverloaded-virtual -Wpointer-arith -Wredundant-decls -Wshadow -Wshorten-64-to-32 -Wsign-compare -Wstrict-overflow=1 -Wswitch-enum -Wundef -Wc++11-compat -Wunused-result -Wunused-variable -Wwrite-strings -Wformat-security -fwrapv
765:info:configure    * CPP Flags:                 -I/opt/local/include
766:info:configure    * Assertions enabled:        no
767:info:configure    * Debug enabled:             no
768:info:configure    * Warnings as failure:       no
769:info:configure    * Building with libsqlite3   yes
770:info:configure    * Building with libdrizzle   no
771:info:configure    * Building with libmemcached no
772:info:configure    * Building with libpq        no
773:info:configure    * Building with tokyocabinet no
774:info:configure    * Building with libmysql     
775:info:configure    * make -j:                   4
776:info:configure
777:info:configure ---
778:debug:configure Privilege de-escalation not attempted as not running as root.
779:debug:build build phase started at Sun Oct 27 18:02:46 EDT 2013
780:notice:build --->  Building gearmand
781:debug:build Executing org.macports.build (gearmand)
782:debug:build port disallows a parallel build
783:debug:build Environment: CPATH='/opt/local/include' CC_PRINT_OPTIONS_FILE='/opt/local/var/macports/build/_opt_local_var_macports_sources_rsync.macports.org_release_tarballs_ports_sysutils_gearmand/gearmand/work/.CC_PRINT_OPTIONS' LIBRARY_PATH='/opt/local/lib' CC_PRINT_OPTIONS='YES' MACOSX_DEPLOYMENT_TARGET='10.9'
784:debug:build Assembled command: 'cd "/opt/local/var/macports/build/_opt_local_var_macports_sources_rsync.macports.org_release_tarballs_ports_sysutils_gearmand/gearmand/work/gearmand-0.41" && /usr/bin/make -w all'
785:debug:build Executing command line:  cd "/opt/local/var/macports/build/_opt_local_var_macports_sources_rsync.macports.org_release_tarballs_ports_sysutils_gearmand/gearmand/work/gearmand-0.41" && /usr/bin/make -w all
786:info:build make: Entering directory `/opt/local/var/macports/build/_opt_local_var_macports_sources_rsync.macports.org_release_tarballs_ports_sysutils_gearmand/gearmand/work/gearmand-0.41'
787:info:build /Applications/Xcode.app/Contents/Developer/usr/bin/make -j4  all-am
788:info:build make[1]: Entering directory `/opt/local/var/macports/build/_opt_local_var_macports_sources_rsync.macports.org_release_tarballs_ports_sysutils_gearmand/gearmand/work/gearmand-0.41'
789:info:build /bin/sh ./libtool  --tag=CXX   --mode=compile /usr/bin/clang++  -arch x86_64 -DHAVE_CONFIG_H -I.   -I/opt/local/include -DBUILDING_LIBGEARMAN -g -O2 -D_FORTIFY_SOURCE=2 -Wall -Wextra -Wunknown-pragmas --param=ssp-buffer-size=1 -Waddress -Warray-bounds -Wchar-subscripts -Wcomment -Wctor-dtor-privacy -Wfloat-equal -Wformat=2 -Wmissing-field-initializers -Wmissing-noreturn -Wnon-virtual-dtor -Woverloaded-virtual -Wpointer-arith -Wredundant-decls -Wshadow -Wshorten-64-to-32 -Wsign-compare -Wstrict-overflow=1 -Wswitch-enum -Wundef -Wc++11-compat -Wunused-result -Wunused-variable -Wwrite-strings -Wformat-security -fwrapv -MT libgearman/libgearman_libgearman_la-result.lo -MD -MP -MF libgearman/.deps/libgearman_libgearman_la-result.Tpo -c -o libgearman/libgearman_libgearman_la-result.lo `test -f 'libgearman/result.cc' || echo './'`libgearman/result.cc
790:info:build /bin/sh ./libtool  --tag=CXX   --mode=compile /usr/bin/clang++  -arch x86_64 -DHAVE_CONFIG_H -I.   -I/opt/local/include -DBUILDING_LIBGEARMAN -g -O2 -D_FORTIFY_SOURCE=2 -Wall -Wextra -Wunknown-pragmas --param=ssp-buffer-size=1 -Waddress -Warray-bounds -Wchar-subscripts -Wcomment -Wctor-dtor-privacy -Wfloat-equal -Wformat=2 -Wmissing-field-initializers -Wmissing-noreturn -Wnon-virtual-dtor -Woverloaded-virtual -Wpointer-arith -Wredundant-decls -Wshadow -Wshorten-64-to-32 -Wsign-compare -Wstrict-overflow=1 -Wswitch-enum -Wundef -Wc++11-compat -Wunused-result -Wunused-variable -Wwrite-strings -Wformat-security -fwrapv -MT libgearman/libgearman_libgearman_la-run.lo -MD -MP -MF libgearman/.deps/libgearman_libgearman_la-run.Tpo -c -o libgearman/libgearman_libgearman_la-run.lo `test -f 'libgearman/run.cc' || echo './'`libgearman/run.cc
791:info:build /bin/sh ./libtool  --tag=CXX   --mode=compile /usr/bin/clang++  -arch x86_64 -DHAVE_CONFIG_H -I.   -I/opt/local/include -DBUILDING_LIBGEARMAN -g -O2 -D_FORTIFY_SOURCE=2 -Wall -Wextra -Wunknown-pragmas --param=ssp-buffer-size=1 -Waddress -Warray-bounds -Wchar-subscripts -Wcomment -Wctor-dtor-privacy -Wfloat-equal -Wformat=2 -Wmissing-field-initializers -Wmissing-noreturn -Wnon-virtual-dtor -Woverloaded-virtual -Wpointer-arith -Wredundant-decls -Wshadow -Wshorten-64-to-32 -Wsign-compare -Wstrict-overflow=1 -Wswitch-enum -Wundef -Wc++11-compat -Wunused-result -Wunused-variable -Wwrite-strings -Wformat-security -fwrapv -MT libgearman/libgearman_libgearman_la-status.lo -MD -MP -MF libgearman/.deps/libgearman_libgearman_la-status.Tpo -c -o libgearman/libgearman_libgearman_la-status.lo `test -f 'libgearman/status.cc' || echo './'`libgearman/status.cc
792:info:build /bin/sh ./libtool  --tag=CXX   --mode=compile /usr/bin/clang++  -arch x86_64 -DHAVE_CONFIG_H -I.   -I/opt/local/include -DBUILDING_LIBGEARMAN -g -O2 -D_FORTIFY_SOURCE=2 -Wall -Wextra -Wunknown-pragmas --param=ssp-buffer-size=1 -Waddress -Warray-bounds -Wchar-subscripts -Wcomment -Wctor-dtor-privacy -Wfloat-equal -Wformat=2 -Wmissing-field-initializers -Wmissing-noreturn -Wnon-virtual-dtor -Woverloaded-virtual -Wpointer-arith -Wredundant-decls -Wshadow -Wshorten-64-to-32 -Wsign-compare -Wstrict-overflow=1 -Wswitch-enum -Wundef -Wc++11-compat -Wunused-result -Wunused-variable -Wwrite-strings -Wformat-security -fwrapv -MT libgearman/libgearman_libgearman_la-strcommand.lo -MD -MP -MF libgearman/.deps/libgearman_libgearman_la-strcommand.Tpo -c -o libgearman/libgearman_libgearman_la-strcommand.lo `test -f 'libgearman/strcommand.cc' || echo './'`libgearman/strcommand.cc
793:info:build libtool: compile:  /usr/bin/clang++ -arch x86_64 -DHAVE_CONFIG_H -I. -I/opt/local/include -DBUILDING_LIBGEARMAN -g -O2 -D_FORTIFY_SOURCE=2 -Wall -Wextra -Wunknown-pragmas --param=ssp-buffer-size=1 -Waddress -Warray-bounds -Wchar-subscripts -Wcomment -Wctor-dtor-privacy -Wfloat-equal -Wformat=2 -Wmissing-field-initializers -Wmissing-noreturn -Wnon-virtual-dtor -Woverloaded-virtual -Wpointer-arith -Wredundant-decls -Wshadow -Wshorten-64-to-32 -Wsign-compare -Wstrict-overflow=1 -Wswitch-enum -Wundef -Wc++11-compat -Wunused-result -Wunused-variable -Wwrite-strings -Wformat-security -fwrapv -MT libgearman/libgearman_libgearman_la-result.lo -MD -MP -MF libgearman/.deps/libgearman_libgearman_la-result.Tpo -c libgearman/result.cc  -fno-common -DPIC -o libgearman/.libs/libgearman_libgearman_la-result.o
794:info:build libtool: compile:  /usr/bin/clang++ -arch x86_64 -DHAVE_CONFIG_H -I. -I/opt/local/include -DBUILDING_LIBGEARMAN -g -O2 -D_FORTIFY_SOURCE=2 -Wall -Wextra -Wunknown-pragmas --param=ssp-buffer-size=1 -Waddress -Warray-bounds -Wchar-subscripts -Wcomment -Wctor-dtor-privacy -Wfloat-equal -Wformat=2 -Wmissing-field-initializers -Wmissing-noreturn -Wnon-virtual-dtor -Woverloaded-virtual -Wpointer-arith -Wredundant-decls -Wshadow -Wshorten-64-to-32 -Wsign-compare -Wstrict-overflow=1 -Wswitch-enum -Wundef -Wc++11-compat -Wunused-result -Wunused-variable -Wwrite-strings -Wformat-security -fwrapv -MT libgearman/libgearman_libgearman_la-run.lo -MD -MP -MF libgearman/.deps/libgearman_libgearman_la-run.Tpo -c libgearman/run.cc  -fno-common -DPIC -o libgearman/.libs/libgearman_libgearman_la-run.o
795:info:build libtool: compile:  /usr/bin/clang++ -arch x86_64 -DHAVE_CONFIG_H -I. -I/opt/local/include -DBUILDING_LIBGEARMAN -g -O2 -D_FORTIFY_SOURCE=2 -Wall -Wextra -Wunknown-pragmas --param=ssp-buffer-size=1 -Waddress -Warray-bounds -Wchar-subscripts -Wcomment -Wctor-dtor-privacy -Wfloat-equal -Wformat=2 -Wmissing-field-initializers -Wmissing-noreturn -Wnon-virtual-dtor -Woverloaded-virtual -Wpointer-arith -Wredundant-decls -Wshadow -Wshorten-64-to-32 -Wsign-compare -Wstrict-overflow=1 -Wswitch-enum -Wundef -Wc++11-compat -Wunused-result -Wunused-variable -Wwrite-strings -Wformat-security -fwrapv -MT libgearman/libgearman_libgearman_la-status.lo -MD -MP -MF libgearman/.deps/libgearman_libgearman_la-status.Tpo -c libgearman/status.cc  -fno-common -DPIC -o libgearman/.libs/libgearman_libgearman_la-status.o
796:info:build libtool: compile:  /usr/bin/clang++ -arch x86_64 -DHAVE_CONFIG_H -I. -I/opt/local/include -DBUILDING_LIBGEARMAN -g -O2 -D_FORTIFY_SOURCE=2 -Wall -Wextra -Wunknown-pragmas --param=ssp-buffer-size=1 -Waddress -Warray-bounds -Wchar-subscripts -Wcomment -Wctor-dtor-privacy -Wfloat-equal -Wformat=2 -Wmissing-field-initializers -Wmissing-noreturn -Wnon-virtual-dtor -Woverloaded-virtual -Wpointer-arith -Wredundant-decls -Wshadow -Wshorten-64-to-32 -Wsign-compare -Wstrict-overflow=1 -Wswitch-enum -Wundef -Wc++11-compat -Wunused-result -Wunused-variable -Wwrite-strings -Wformat-security -fwrapv -MT libgearman/libgearman_libgearman_la-strcommand.lo -MD -MP -MF libgearman/.deps/libgearman_libgearman_la-strcommand.Tpo -c libgearman/strcommand.cc  -fno-common -DPIC -o libgearman/.libs/libgearman_libgearman_la-strcommand.o
797:info:build In file included from libgearman/result.cc:39:
798:info:build In file included from In file included from libgearman/run.cc:40:
799:info:build In file included from ./libgearman/common.h:44:
800:info:build ./libgearman-1.0/gearman.h:53:12: fatal error: 'tr1/cinttypes' file not found
801:info:build ./libgearman/common.h:44:
802:info:build ./libgearman-1.0/gearman.h:53:12: fatal error: 'tr1/cinttypes' file not found
803:info:build #  include <tr1/cinttypes>
804:info:build            ^
805:info:build #  include <tr1/cinttypes>
806:info:build            ^
807:info:build In file included from libgearman/status.cc:40:
808:info:build In file included from ./libgearman/common.h:44:
809:info:build ./libgearman-1.0/gearman.h:53:12: fatal error: 'tr1/cinttypes' file not found
810:info:build #  include <tr1/cinttypes>
811:info:build            ^
812:info:build mv -f libgearman/.deps/libgearman_libgearman_la-strcommand.Tpo libgearman/.deps/libgearman_libgearman_la-strcommand.Plo
813:info:build /bin/sh ./libtool  --tag=CXX   --mode=compile /usr/bin/clang++  -arch x86_64 -DHAVE_CONFIG_H -I.   -I/opt/local/include -DBUILDING_LIBGEARMAN -g -O2 -D_FORTIFY_SOURCE=2 -Wall -Wextra -Wunknown-pragmas --param=ssp-buffer-size=1 -Waddress -Warray-bounds -Wchar-subscripts -Wcomment -Wctor-dtor-privacy -Wfloat-equal -Wformat=2 -Wmissing-field-initializers -Wmissing-noreturn -Wnon-virtual-dtor -Woverloaded-virtual -Wpointer-arith -Wredundant-decls -Wshadow -Wshorten-64-to-32 -Wsign-compare -Wstrict-overflow=1 -Wswitch-enum -Wundef -Wc++11-compat -Wunused-result -Wunused-variable -Wwrite-strings -Wformat-security -fwrapv -MT libgearman/libgearman_libgearman_la-strerror.lo -MD -MP -MF libgearman/.deps/libgearman_libgearman_la-strerror.Tpo -c -o libgearman/libgearman_libgearman_la-strerror.lo `test -f 'libgearman/strerror.cc' || echo './'`libgearman/strerror.cc
814:info:build 1 error generated.
815:info:build make[1]: *** [libgearman/libgearman_libgearman_la-status.lo] Error 1
816:info:build make[1]: *** Waiting for unfinished jobs....
817:info:build 1 error generated.
818:info:build make[1]: *** [libgearman/libgearman_libgearman_la-run.lo] Error 1
819:info:build libtool: compile:  /usr/bin/clang++ -arch x86_64 -DHAVE_CONFIG_H -I. -I/opt/local/include -DBUILDING_LIBGEARMAN -g -O2 -D_FORTIFY_SOURCE=2 -Wall -Wextra -Wunknown-pragmas --param=ssp-buffer-size=1 -Waddress -Warray-bounds -Wchar-subscripts -Wcomment -Wctor-dtor-privacy -Wfloat-equal -Wformat=2 -Wmissing-field-initializers -Wmissing-noreturn -Wnon-virtual-dtor -Woverloaded-virtual -Wpointer-arith -Wredundant-decls -Wshadow -Wshorten-64-to-32 -Wsign-compare -Wstrict-overflow=1 -Wswitch-enum -Wundef -Wc++11-compat -Wunused-result -Wunused-variable -Wwrite-strings -Wformat-security -fwrapv -MT libgearman/libgearman_libgearman_la-strerror.lo -MD -MP -MF libgearman/.deps/libgearman_libgearman_la-strerror.Tpo -c libgearman/strerror.cc  -fno-common -DPIC -o libgearman/.libs/libgearman_libgearman_la-strerror.o
820:info:build In file included from libgearman/strerror.cc:45:
821:info:build In file included from ./libgearman/common.h:44:
822:info:build ./libgearman-1.0/gearman.h:53:12: fatal error: 'tr1/cinttypes' file not found
823:info:build #  include <tr1/cinttypes>
824:info:build            ^
825:info:build 1 error generated.
826:info:build make[1]: *** [libgearman/libgearman_libgearman_la-result.lo] Error 1
827:info:build 1 error generated.
828:info:build make[1]: *** [libgearman/libgearman_libgearman_la-strerror.lo] Error 1
829:info:build make[1]: Leaving directory `/opt/local/var/macports/build/_opt_local_var_macports_sources_rsync.macports.org_release_tarballs_ports_sysutils_gearmand/gearmand/work/gearmand-0.41'
830:info:build make: *** [all] Error 2
831:info:build make: Leaving directory `/opt/local/var/macports/build/_opt_local_var_macports_sources_rsync.macports.org_release_tarballs_ports_sysutils_gearmand/gearmand/work/gearmand-0.41'
832:info:build Command failed:  cd "/opt/local/var/macports/build/_opt_local_var_macports_sources_rsync.macports.org_release_tarballs_ports_sysutils_gearmand/gearmand/work/gearmand-0.41" && /usr/bin/make -w all
833:info:build Exit code: 2
834:error:build org.macports.build for port gearmand returned: command execution failed
835:debug:build Error code: CHILDSTATUS 92270 2
836:debug:build Backtrace: command execution failed
837    while executing
838"system -nice 0 $fullcmdstring"
839    ("eval" body line 1)
840    invoked from within
841"eval system $notty $nice \$fullcmdstring"
842    invoked from within
843"command_exec build"
844    (procedure "portbuild::build_main" line 8)
845    invoked from within
846"$procedure $targetname"
847:info:build Warning: targets not executed for gearmand: org.macports.activate org.macports.build org.macports.destroot org.macports.install
848:notice:build Please see the log file for port gearmand for details:
849    /opt/local/var/macports/logs/_opt_local_var_macports_sources_rsync.macports.org_release_tarballs_ports_sysutils_gearmand/gearmand/main.log