| 1 | version:1 |
|---|
| 2 | :debug:main epoch: in tree: 1 installed: 1 |
|---|
| 3 | :debug:main bison 2.7.1_0 exists in the ports tree |
|---|
| 4 | :debug:main bison 2.7.1_0 is the latest installed |
|---|
| 5 | :debug:main bison 2.7.1_0 is active |
|---|
| 6 | :debug:main Merging existing variants '' into variants |
|---|
| 7 | :debug:main new fully merged portvariants: |
|---|
| 8 | :debug:main Changing to port directory: /opt/local/var/macports/sources/rsync.macports.org/release/tarballs/ports/devel/bison |
|---|
| 9 | :debug:main OS darwin/13.0.0 (Mac OS X 10.9) arch i386 |
|---|
| 10 | :debug:main adding the default universal variant |
|---|
| 11 | :debug:main Reading variant descriptions from /opt/local/var/macports/sources/rsync.macports.org/release/tarballs/ports/_resources/port1.0/variant_descriptions.conf |
|---|
| 12 | :debug:main Running callback portconfigure::add_automatic_compiler_dependencies |
|---|
| 13 | :debug:main Finished running callback portconfigure::add_automatic_compiler_dependencies |
|---|
| 14 | :debug:main Running callback portbuild::add_automatic_buildsystem_dependencies |
|---|
| 15 | :debug:main Finished running callback portbuild::add_automatic_buildsystem_dependencies |
|---|
| 16 | :debug:main No need to upgrade! bison 2.7.1_0 >= bison 2.7.1_0 |
|---|
| 17 | :debug:main epoch: in tree: 0 installed: 0 |
|---|
| 18 | :debug:main gettext 0.18.3.1_1 exists in the ports tree |
|---|
| 19 | :debug:main gettext 0.18.3.1_1 is the latest installed |
|---|
| 20 | :debug:main gettext 0.18.3.1_1 is active |
|---|
| 21 | :debug:main Merging existing variants '' into variants |
|---|
| 22 | :debug:main new fully merged portvariants: |
|---|
| 23 | :debug:main Changing to port directory: /opt/local/var/macports/sources/rsync.macports.org/release/tarballs/ports/devel/gettext |
|---|
| 24 | :debug:main OS darwin/13.0.0 (Mac OS X 10.9) arch i386 |
|---|
| 25 | :debug:main Reading variant descriptions from /opt/local/var/macports/sources/rsync.macports.org/release/tarballs/ports/_resources/port1.0/variant_descriptions.conf |
|---|
| 26 | :debug:main compiler clang 500.2.79 not blacklisted because it doesn't match {clang < 211.10.1} |
|---|
| 27 | :debug:main universal variant already exists, so not adding the default one |
|---|
| 28 | :debug:main Running callback portconfigure::add_automatic_compiler_dependencies |
|---|
| 29 | :debug:main Finished running callback portconfigure::add_automatic_compiler_dependencies |
|---|
| 30 | :debug:main Running callback portbuild::add_automatic_buildsystem_dependencies |
|---|
| 31 | :debug:main Finished running callback portbuild::add_automatic_buildsystem_dependencies |
|---|
| 32 | :debug:main No need to upgrade! gettext 0.18.3.1_1 >= gettext 0.18.3.1_1 |
|---|
| 33 | :debug:main epoch: in tree: 0 installed: 0 |
|---|
| 34 | :debug:main expat 2.1.0_0 exists in the ports tree |
|---|
| 35 | :debug:main expat 2.1.0_0 is the latest installed |
|---|
| 36 | :debug:main expat 2.1.0_0 is active |
|---|
| 37 | :debug:main Merging existing variants '' into variants |
|---|
| 38 | :debug:main new fully merged portvariants: |
|---|
| 39 | :debug:main Changing to port directory: /opt/local/var/macports/sources/rsync.macports.org/release/tarballs/ports/textproc/expat |
|---|
| 40 | :debug:main OS darwin/13.0.0 (Mac OS X 10.9) arch i386 |
|---|
| 41 | :debug:main adding the default universal variant |
|---|
| 42 | :debug:main Reading variant descriptions from /opt/local/var/macports/sources/rsync.macports.org/release/tarballs/ports/_resources/port1.0/variant_descriptions.conf |
|---|
| 43 | :debug:main Running callback portconfigure::add_automatic_compiler_dependencies |
|---|
| 44 | :debug:main Finished running callback portconfigure::add_automatic_compiler_dependencies |
|---|
| 45 | :debug:main Running callback portbuild::add_automatic_buildsystem_dependencies |
|---|
| 46 | :debug:main Finished running callback portbuild::add_automatic_buildsystem_dependencies |
|---|
| 47 | :debug:main No need to upgrade! expat 2.1.0_0 >= expat 2.1.0_0 |
|---|
| 48 | :debug:main epoch: in tree: 0 installed: 0 |
|---|
| 49 | :debug:main libiconv 1.14_0 exists in the ports tree |
|---|
| 50 | :debug:main libiconv 1.14_0 is the latest installed |
|---|
| 51 | :debug:main libiconv 1.14_0 is active |
|---|
| 52 | :debug:main Merging existing variants '' into variants |
|---|
| 53 | :debug:main new fully merged portvariants: |
|---|
| 54 | :debug:main Changing to port directory: /opt/local/var/macports/sources/rsync.macports.org/release/tarballs/ports/textproc/libiconv |
|---|
| 55 | :debug:main OS darwin/13.0.0 (Mac OS X 10.9) arch i386 |
|---|
| 56 | :debug:main Reading variant descriptions from /opt/local/var/macports/sources/rsync.macports.org/release/tarballs/ports/_resources/port1.0/variant_descriptions.conf |
|---|
| 57 | :debug:main universal variant already exists, so not adding the default one |
|---|
| 58 | :debug:main Running callback portconfigure::add_automatic_compiler_dependencies |
|---|
| 59 | :debug:main Finished running callback portconfigure::add_automatic_compiler_dependencies |
|---|
| 60 | :debug:main Running callback portbuild::add_automatic_buildsystem_dependencies |
|---|
| 61 | :debug:main Finished running callback portbuild::add_automatic_buildsystem_dependencies |
|---|
| 62 | :debug:main No need to upgrade! libiconv 1.14_0 >= libiconv 1.14_0 |
|---|
| 63 | :debug:main epoch: in tree: 0 installed: 0 |
|---|
| 64 | :debug:main ncurses 5.9_2 exists in the ports tree |
|---|
| 65 | :debug:main ncurses 5.9_2 is the latest installed |
|---|
| 66 | :debug:main ncurses 5.9_2 is active |
|---|
| 67 | :debug:main Merging existing variants '' into variants |
|---|
| 68 | :debug:main new fully merged portvariants: |
|---|
| 69 | :debug:main Changing to port directory: /opt/local/var/macports/sources/rsync.macports.org/release/tarballs/ports/devel/ncurses |
|---|
| 70 | :debug:main OS darwin/13.0.0 (Mac OS X 10.9) arch i386 |
|---|
| 71 | :debug:main adding the default universal variant |
|---|
| 72 | :debug:main Reading variant descriptions from /opt/local/var/macports/sources/rsync.macports.org/release/tarballs/ports/_resources/port1.0/variant_descriptions.conf |
|---|
| 73 | :debug:main Running callback portconfigure::add_automatic_compiler_dependencies |
|---|
| 74 | :debug:main Finished running callback portconfigure::add_automatic_compiler_dependencies |
|---|
| 75 | :debug:main Running callback portbuild::add_automatic_buildsystem_dependencies |
|---|
| 76 | :debug:main Finished running callback portbuild::add_automatic_buildsystem_dependencies |
|---|
| 77 | :debug:main No need to upgrade! ncurses 5.9_2 >= ncurses 5.9_2 |
|---|
| 78 | :debug:main epoch: in tree: 0 installed: 0 |
|---|
| 79 | :debug:main m4 1.4.16_0 exists in the ports tree |
|---|
| 80 | :debug:main m4 1.4.16_0 is the latest installed |
|---|
| 81 | :debug:main m4 1.4.16_0 is active |
|---|
| 82 | :debug:main Merging existing variants '' into variants |
|---|
| 83 | :debug:main new fully merged portvariants: |
|---|
| 84 | :debug:main Changing to port directory: /opt/local/var/macports/sources/rsync.macports.org/release/tarballs/ports/devel/m4 |
|---|
| 85 | :debug:main OS darwin/13.0.0 (Mac OS X 10.9) arch i386 |
|---|
| 86 | :debug:main adding the default universal variant |
|---|
| 87 | :debug:main Reading variant descriptions from /opt/local/var/macports/sources/rsync.macports.org/release/tarballs/ports/_resources/port1.0/variant_descriptions.conf |
|---|
| 88 | :debug:main Running callback portconfigure::add_automatic_compiler_dependencies |
|---|
| 89 | :debug:main Finished running callback portconfigure::add_automatic_compiler_dependencies |
|---|
| 90 | :debug:main Running callback portbuild::add_automatic_buildsystem_dependencies |
|---|
| 91 | :debug:main Finished running callback portbuild::add_automatic_buildsystem_dependencies |
|---|
| 92 | :debug:main No need to upgrade! m4 1.4.16_0 >= m4 1.4.16_0 |
|---|
| 93 | :msg:main ---> Computing dependencies for lparse:info:main .:debug:main lparse has no conflicts |
|---|
| 94 | :debug:main Searching for dependency: bison |
|---|
| 95 | :debug:main Found Dependency: receipt exists for bison |
|---|
| 96 | :msg:main |
|---|
| 97 | :debug:main Executing org.macports.main (lparse) |
|---|
| 98 | :debug:main changing euid/egid - current euid: 0 - current egid: 0 |
|---|
| 99 | :debug:main egid changed to: 501 |
|---|
| 100 | :debug:main euid changed to: 502 |
|---|
| 101 | :debug:main Skipping completed org.macports.archivefetch (lparse) |
|---|
| 102 | :debug:main Privilege de-escalation not attempted as not running as root. |
|---|
| 103 | :debug:main Skipping completed org.macports.fetch (lparse) |
|---|
| 104 | :debug:main Privilege de-escalation not attempted as not running as root. |
|---|
| 105 | :debug:main Skipping completed org.macports.checksum (lparse) |
|---|
| 106 | :debug:main Privilege de-escalation not attempted as not running as root. |
|---|
| 107 | :debug:main Skipping completed org.macports.extract (lparse) |
|---|
| 108 | :debug:main Privilege de-escalation not attempted as not running as root. |
|---|
| 109 | :debug:main Skipping completed org.macports.patch (lparse) |
|---|
| 110 | :debug:main Privilege de-escalation not attempted as not running as root. |
|---|
| 111 | :debug:main Skipping completed org.macports.configure (lparse) |
|---|
| 112 | :debug:main Privilege de-escalation not attempted as not running as root. |
|---|
| 113 | :debug:main Skipping completed org.macports.build (lparse) |
|---|
| 114 | :debug:main Privilege de-escalation not attempted as not running as root. |
|---|
| 115 | :debug:destroot destroot phase started at Sat Dec 21 19:36:28 CET 2013 |
|---|
| 116 | :notice:destroot ---> Staging lparse into destroot |
|---|
| 117 | :debug:destroot Can't run destroot under sudo without elevated privileges (due to mtree). |
|---|
| 118 | :debug:destroot Run destroot without sudo to avoid root privileges. |
|---|
| 119 | :debug:destroot Going to escalate privileges back to root. |
|---|
| 120 | :debug:destroot euid changed to: 0. egid changed to: 0. |
|---|
| 121 | :info:destroot . missing (directory not created: File exists) |
|---|
| 122 | :info:destroot ./Applications missing (directory not created: File exists) |
|---|
| 123 | :info:destroot ./Developer missing (directory not created: File exists) |
|---|
| 124 | :info:destroot ./Library missing (directory not created: File exists) |
|---|
| 125 | :debug:destroot Executing org.macports.destroot (lparse) |
|---|
| 126 | :debug:destroot Environment: CPATH='/opt/local/include' CC_PRINT_OPTIONS_FILE='/opt/local/var/macports/build/_opt_local_var_macports_sources_rsync.macports.org_release_tarballs_ports_science_lparse/lparse/work/.CC_PRINT_OPTIONS' LIBRARY_PATH='/opt/local/lib' CC_PRINT_OPTIONS='YES' MACOSX_DEPLOYMENT_TARGET='10.9' |
|---|
| 127 | :debug:destroot Assembled command: 'cd "/opt/local/var/macports/build/_opt_local_var_macports_sources_rsync.macports.org_release_tarballs_ports_science_lparse/lparse/work/lparse-1.1.2" && /usr/bin/make -w install DESTDIR=/opt/local/var/macports/build/_opt_local_var_macports_sources_rsync.macports.org_release_tarballs_ports_science_lparse/lparse/work/destroot' |
|---|
| 128 | :debug:destroot Executing command line: cd "/opt/local/var/macports/build/_opt_local_var_macports_sources_rsync.macports.org_release_tarballs_ports_science_lparse/lparse/work/lparse-1.1.2" && /usr/bin/make -w install DESTDIR=/opt/local/var/macports/build/_opt_local_var_macports_sources_rsync.macports.org_release_tarballs_ports_science_lparse/lparse/work/destroot |
|---|
| 129 | :info:destroot make: Entering directory `/opt/local/var/macports/build/_opt_local_var_macports_sources_rsync.macports.org_release_tarballs_ports_science_lparse/lparse/work/lparse-1.1.2' |
|---|
| 130 | :info:destroot cd src ; make ; cd .. |
|---|
| 131 | :info:destroot make[1]: Entering directory `/opt/local/var/macports/build/_opt_local_var_macports_sources_rsync.macports.org_release_tarballs_ports_science_lparse/lparse/work/lparse-1.1.2/src' |
|---|
| 132 | :info:destroot g++ -O3 -c instance.cc |
|---|
| 133 | :info:destroot instance.cc:365:10: error: reference to 'hash' is ambiguous |
|---|
| 134 | :info:destroot ind1 = hash((char *)key, arity*4, SEED_1) % mask; |
|---|
| 135 | :info:destroot ^ |
|---|
| 136 | :info:destroot instance.cc:308:15: note: candidate found by name lookup is 'hash' |
|---|
| 137 | :info:destroot unsigned long hash(const char *key, unsigned long length, |
|---|
| 138 | :info:destroot ^ |
|---|
| 139 | :info:destroot /Applications/Xcode.app/Contents/Developer/Toolchains/XcodeDefault.xctoolchain/usr/bin/../lib/c++/v1/memory:3081:29: note: candidate found by name lookup is 'std::__1::hash' |
|---|
| 140 | :info:destroot template <class _Tp> struct hash; |
|---|
| 141 | :info:destroot ^ |
|---|
| 142 | :info:destroot instance.cc:367:13: error: reference to 'hash' is ambiguous |
|---|
| 143 | :info:destroot ind2 = (hash((char *)key, arity*4, SEED_2) % mask) + 1; |
|---|
| 144 | :info:destroot ^ |
|---|
| 145 | :info:destroot instance.cc:308:15: note: candidate found by name lookup is 'hash' |
|---|
| 146 | :info:destroot unsigned long hash(const char *key, unsigned long length, |
|---|
| 147 | :info:destroot ^ |
|---|
| 148 | :info:destroot /Applications/Xcode.app/Contents/Developer/Toolchains/XcodeDefault.xctoolchain/usr/bin/../lib/c++/v1/memory:3081:29: note: candidate found by name lookup is 'std::__1::hash' |
|---|
| 149 | :info:destroot template <class _Tp> struct hash; |
|---|
| 150 | :info:destroot ^ |
|---|
| 151 | :info:destroot instance.cc:367:13: error: type name requires a specifier or qualifier |
|---|
| 152 | :info:destroot ind2 = (hash((char *)key, arity*4, SEED_2) % mask) + 1; |
|---|
| 153 | :info:destroot ^ |
|---|
| 154 | :info:destroot instance.cc:367:13: error: expected ')' |
|---|
| 155 | :info:destroot instance.cc:367:12: note: to match this '(' |
|---|
| 156 | :info:destroot ind2 = (hash((char *)key, arity*4, SEED_2) % mask) + 1; |
|---|
| 157 | :info:destroot ^ |
|---|
| 158 | :info:destroot 4 errors generated. |
|---|
| 159 | :info:destroot make[1]: *** [instance.o] Error 1 |
|---|
| 160 | :info:destroot make[1]: Leaving directory `/opt/local/var/macports/build/_opt_local_var_macports_sources_rsync.macports.org_release_tarballs_ports_science_lparse/lparse/work/lparse-1.1.2/src' |
|---|
| 161 | :info:destroot cp src/lparse /opt/local/var/macports/build/_opt_local_var_macports_sources_rsync.macports.org_release_tarballs_ports_science_lparse/lparse/work/destroot/opt/local/bin/ |
|---|
| 162 | :info:destroot cp: src/lparse: No such file or directory |
|---|
| 163 | :info:destroot make: *** [install] Error 1 |
|---|
| 164 | :info:destroot make: Leaving directory `/opt/local/var/macports/build/_opt_local_var_macports_sources_rsync.macports.org_release_tarballs_ports_science_lparse/lparse/work/lparse-1.1.2' |
|---|
| 165 | :info:destroot Command failed: cd "/opt/local/var/macports/build/_opt_local_var_macports_sources_rsync.macports.org_release_tarballs_ports_science_lparse/lparse/work/lparse-1.1.2" && /usr/bin/make -w install DESTDIR=/opt/local/var/macports/build/_opt_local_var_macports_sources_rsync.macports.org_release_tarballs_ports_science_lparse/lparse/work/destroot |
|---|
| 166 | :info:destroot Exit code: 2 |
|---|
| 167 | :error:destroot org.macports.destroot for port lparse returned: command execution failed |
|---|
| 168 | :debug:destroot Error code: CHILDSTATUS 826 2 |
|---|
| 169 | :debug:destroot Backtrace: command execution failed |
|---|
| 170 | while executing |
|---|
| 171 | "system -nice 0 $fullcmdstring" |
|---|
| 172 | ("eval" body line 1) |
|---|
| 173 | invoked from within |
|---|
| 174 | "eval system $notty $nice \$fullcmdstring" |
|---|
| 175 | invoked from within |
|---|
| 176 | "command_exec destroot" |
|---|
| 177 | (procedure "portdestroot::destroot_main" line 2) |
|---|
| 178 | invoked from within |
|---|
| 179 | "$procedure $targetname" |
|---|
| 180 | :info:destroot Warning: targets not executed for lparse: org.macports.activate org.macports.destroot org.macports.install |
|---|
| 181 | :notice:destroot Please see the log file for port lparse for details: |
|---|
| 182 | /opt/local/var/macports/logs/_opt_local_var_macports_sources_rsync.macports.org_release_tarballs_ports_science_lparse/lparse/main.log |
|---|