Ticket #42428: main.log

File main.log, 100.3 KB (added by mfuhrer@…, 9 years ago)
Line 
1version:1
2:debug:main aquaterm has no conflicts
3:debug:main Executing org.macports.main (aquaterm)
4:debug:main changing euid/egid - current euid: 0 - current egid: 0
5:debug:main egid changed to: 504
6:debug:main euid changed to: 502
7:debug:archivefetch archivefetch phase started at Mon Feb 10 01:08:48 MST 2014
8:debug:archivefetch Executing org.macports.archivefetch (aquaterm)
9:debug:archivefetch Privilege de-escalation not attempted as not running as root.
10:debug:fetch fetch phase started at Mon Feb 10 01:08:48 MST 2014
11:notice:fetch --->  Fetching distfiles for aquaterm
12:debug:fetch Executing org.macports.fetch (aquaterm)
13:debug:fetch Privilege de-escalation not attempted as not running as root.
14:debug:checksum checksum phase started at Mon Feb 10 01:08:48 MST 2014
15:notice:checksum --->  Verifying checksums for aquaterm
16:debug:checksum Executing org.macports.checksum (aquaterm)
17:info:checksum --->  Checksumming AquaTerm-1.1.1.tar.gz
18:debug:checksum Correct (rmd160) checksum for AquaTerm-1.1.1.tar.gz
19:debug:checksum Correct (sha256) checksum for AquaTerm-1.1.1.tar.gz
20:debug:checksum Privilege de-escalation not attempted as not running as root.
21:debug:extract extract phase started at Mon Feb 10 01:08:48 MST 2014
22:notice:extract --->  Extracting aquaterm
23:debug:extract Executing org.macports.extract (aquaterm)
24:info:extract --->  Extracting AquaTerm-1.1.1.tar.gz
25:debug:extract setting option extract.args to '/Volumes/UNIX/opt/local/var/macports/distfiles/aquaterm/AquaTerm-1.1.1.tar.gz'
26:debug:extract Environment: CPATH='/Volumes/UNIX/opt/local/include' CC_PRINT_OPTIONS_FILE='/Volumes/UNIX/opt/local/var/macports/build/_Volumes_UNIX_opt_local_var_macports_sources_rsync.macports.org_release_tarballs_ports_aqua_aquaterm/aquaterm/work/.CC_PRINT_OPTIONS' LIBRARY_PATH='/Volumes/UNIX/opt/local/lib' CC_PRINT_OPTIONS='YES' MACOSX_DEPLOYMENT_TARGET='10.9'
27:debug:extract Assembled command: 'cd "/Volumes/UNIX/opt/local/var/macports/build/_Volumes_UNIX_opt_local_var_macports_sources_rsync.macports.org_release_tarballs_ports_aqua_aquaterm/aquaterm/work" && /usr/bin/gzip -dc '/Volumes/UNIX/opt/local/var/macports/distfiles/aquaterm/AquaTerm-1.1.1.tar.gz' | /usr/bin/tar -xf -'
28:debug:extract Executing command line:  cd "/Volumes/UNIX/opt/local/var/macports/build/_Volumes_UNIX_opt_local_var_macports_sources_rsync.macports.org_release_tarballs_ports_aqua_aquaterm/aquaterm/work" && /usr/bin/gzip -dc '/Volumes/UNIX/opt/local/var/macports/distfiles/aquaterm/AquaTerm-1.1.1.tar.gz' | /usr/bin/tar -xf -
29:debug:extract euid/egid changed to: 0/0
30:debug:extract chowned /Volumes/UNIX/opt/local/var/macports/build/_Volumes_UNIX_opt_local_var_macports_sources_rsync.macports.org_release_tarballs_ports_aqua_aquaterm/aquaterm/work to macports
31:debug:extract euid/egid changed to: 502/504
32:debug:extract Executing proc-post-org.macports.extract-extract-0
33:debug:extract Privilege de-escalation not attempted as not running as root.
34:debug:patch patch phase started at Mon Feb 10 01:08:48 MST 2014
35:debug:patch Executing org.macports.patch (aquaterm)
36:notice:patch --->  Applying patches to aquaterm
37:info:patch --->  Applying no-NSMailDelivery.patch
38:debug:patch Environment: CPATH='/Volumes/UNIX/opt/local/include' CC_PRINT_OPTIONS_FILE='/Volumes/UNIX/opt/local/var/macports/build/_Volumes_UNIX_opt_local_var_macports_sources_rsync.macports.org_release_tarballs_ports_aqua_aquaterm/aquaterm/work/.CC_PRINT_OPTIONS' LIBRARY_PATH='/Volumes/UNIX/opt/local/lib' CC_PRINT_OPTIONS='YES' MACOSX_DEPLOYMENT_TARGET='10.9'
39:debug:patch Assembled command: 'cd "/Volumes/UNIX/opt/local/var/macports/build/_Volumes_UNIX_opt_local_var_macports_sources_rsync.macports.org_release_tarballs_ports_aqua_aquaterm/aquaterm/work/AquaTerm-1.1.1" && /usr/bin/patch -p0'
40:debug:patch Executing command line:  cd "/Volumes/UNIX/opt/local/var/macports/build/_Volumes_UNIX_opt_local_var_macports_sources_rsync.macports.org_release_tarballs_ports_aqua_aquaterm/aquaterm/work/AquaTerm-1.1.1" && /usr/bin/patch -p0 < '/Volumes/UNIX/opt/local/var/macports/sources/rsync.macports.org/release/tarballs/ports/aqua/aquaterm/files/no-NSMailDelivery.patch'
41:info:patch patching file aquaterm/AQTController.m
42:info:patch patching file aquaterm/AquaTerm.xcodeproj/project.pbxproj
43:debug:patch Executing proc-post-org.macports.patch-patch-0
44:debug:patch Executing reinplace: /usr/bin/sed s|/Applications/AquaTerm.app|/Volumes/UNIX/MacPorts/AquaTerm.app| < /Volumes/UNIX/opt/local/var/macports/build/_Volumes_UNIX_opt_local_var_macports_sources_rsync.macports.org_release_tarballs_ports_aqua_aquaterm/aquaterm/work/AquaTerm-1.1.1/aquaterm/AQTClientManager.m >@ file10
45:debug:patch euid/egid changed to: 0/0
46:debug:patch chowned /Volumes/UNIX/opt/local/var/macports/build/_Volumes_UNIX_opt_local_var_macports_sources_rsync.macports.org_release_tarballs_ports_aqua_aquaterm/aquaterm/work/AquaTerm-1.1.1/aquaterm/AQTClientManager.m to macports
47:debug:patch euid/egid changed to: 502/504
48:debug:patch euid/egid changed to: 0/0
49:debug:patch setting attributes on /Volumes/UNIX/opt/local/var/macports/build/_Volumes_UNIX_opt_local_var_macports_sources_rsync.macports.org_release_tarballs_ports_aqua_aquaterm/aquaterm/work/AquaTerm-1.1.1/aquaterm/AQTClientManager.m
50:debug:patch euid/egid changed to: 502/504
51:debug:patch Executing reinplace: /usr/bin/sed {s|# FRAMEWORKS_DIR.*|FRAMEWORKS_DIR = /Volumes/UNIX/opt/local/Library/Frameworks|} < /Volumes/UNIX/opt/local/var/macports/build/_Volumes_UNIX_opt_local_var_macports_sources_rsync.macports.org_release_tarballs_ports_aqua_aquaterm/aquaterm/work/AquaTerm-1.1.1/adapters/c/Makefile >@ file10
52:debug:patch euid/egid changed to: 0/0
53:debug:patch chowned /Volumes/UNIX/opt/local/var/macports/build/_Volumes_UNIX_opt_local_var_macports_sources_rsync.macports.org_release_tarballs_ports_aqua_aquaterm/aquaterm/work/AquaTerm-1.1.1/adapters/c/Makefile to macports
54:debug:patch euid/egid changed to: 502/504
55:debug:patch euid/egid changed to: 0/0
56:debug:patch setting attributes on /Volumes/UNIX/opt/local/var/macports/build/_Volumes_UNIX_opt_local_var_macports_sources_rsync.macports.org_release_tarballs_ports_aqua_aquaterm/aquaterm/work/AquaTerm-1.1.1/adapters/c/Makefile
57:debug:patch euid/egid changed to: 502/504
58:debug:patch Executing reinplace: /usr/bin/sed {s|# FRAMEWORKS_DIR.*|FRAMEWORKS_DIR = /Volumes/UNIX/opt/local/Library/Frameworks|} < /Volumes/UNIX/opt/local/var/macports/build/_Volumes_UNIX_opt_local_var_macports_sources_rsync.macports.org_release_tarballs_ports_aqua_aquaterm/aquaterm/work/AquaTerm-1.1.1/adapters/fortran/Makefile >@ file10
59:debug:patch euid/egid changed to: 0/0
60:debug:patch chowned /Volumes/UNIX/opt/local/var/macports/build/_Volumes_UNIX_opt_local_var_macports_sources_rsync.macports.org_release_tarballs_ports_aqua_aquaterm/aquaterm/work/AquaTerm-1.1.1/adapters/fortran/Makefile to macports
61:debug:patch euid/egid changed to: 502/504
62:debug:patch euid/egid changed to: 0/0
63:debug:patch setting attributes on /Volumes/UNIX/opt/local/var/macports/build/_Volumes_UNIX_opt_local_var_macports_sources_rsync.macports.org_release_tarballs_ports_aqua_aquaterm/aquaterm/work/AquaTerm-1.1.1/adapters/fortran/Makefile
64:debug:patch euid/egid changed to: 502/504
65:debug:patch Executing reinplace: /usr/bin/sed s|/usr/local|/Volumes/UNIX/opt/local|g < /Volumes/UNIX/opt/local/var/macports/build/_Volumes_UNIX_opt_local_var_macports_sources_rsync.macports.org_release_tarballs_ports_aqua_aquaterm/aquaterm/work/AquaTerm-1.1.1/adapters/pgplot/ChangeLog >@ file10
66:debug:patch euid/egid changed to: 0/0
67:debug:patch chowned /Volumes/UNIX/opt/local/var/macports/build/_Volumes_UNIX_opt_local_var_macports_sources_rsync.macports.org_release_tarballs_ports_aqua_aquaterm/aquaterm/work/AquaTerm-1.1.1/adapters/pgplot/ChangeLog to macports
68:debug:patch euid/egid changed to: 502/504
69:debug:patch euid/egid changed to: 0/0
70:debug:patch setting attributes on /Volumes/UNIX/opt/local/var/macports/build/_Volumes_UNIX_opt_local_var_macports_sources_rsync.macports.org_release_tarballs_ports_aqua_aquaterm/aquaterm/work/AquaTerm-1.1.1/adapters/pgplot/ChangeLog
71:debug:patch euid/egid changed to: 502/504
72:debug:patch Executing reinplace: /usr/bin/sed s|/usr/local|/Volumes/UNIX/opt/local|g < /Volumes/UNIX/opt/local/var/macports/build/_Volumes_UNIX_opt_local_var_macports_sources_rsync.macports.org_release_tarballs_ports_aqua_aquaterm/aquaterm/work/AquaTerm-1.1.1/adapters/pgplot/g77_gcc_AQT.conf >@ file10
73:debug:patch euid/egid changed to: 0/0
74:debug:patch chowned /Volumes/UNIX/opt/local/var/macports/build/_Volumes_UNIX_opt_local_var_macports_sources_rsync.macports.org_release_tarballs_ports_aqua_aquaterm/aquaterm/work/AquaTerm-1.1.1/adapters/pgplot/g77_gcc_AQT.conf to macports
75:debug:patch euid/egid changed to: 502/504
76:debug:patch euid/egid changed to: 0/0
77:debug:patch setting attributes on /Volumes/UNIX/opt/local/var/macports/build/_Volumes_UNIX_opt_local_var_macports_sources_rsync.macports.org_release_tarballs_ports_aqua_aquaterm/aquaterm/work/AquaTerm-1.1.1/adapters/pgplot/g77_gcc_AQT.conf
78:debug:patch euid/egid changed to: 502/504
79:debug:patch Executing reinplace: /usr/bin/sed s|/usr/local|/Volumes/UNIX/opt/local|g < /Volumes/UNIX/opt/local/var/macports/build/_Volumes_UNIX_opt_local_var_macports_sources_rsync.macports.org_release_tarballs_ports_aqua_aquaterm/aquaterm/work/AquaTerm-1.1.1/adapters/pgplot/xlf_gcc_AQT.conf >@ file10
80:debug:patch euid/egid changed to: 0/0
81:debug:patch chowned /Volumes/UNIX/opt/local/var/macports/build/_Volumes_UNIX_opt_local_var_macports_sources_rsync.macports.org_release_tarballs_ports_aqua_aquaterm/aquaterm/work/AquaTerm-1.1.1/adapters/pgplot/xlf_gcc_AQT.conf to macports
82:debug:patch euid/egid changed to: 502/504
83:debug:patch euid/egid changed to: 0/0
84:debug:patch setting attributes on /Volumes/UNIX/opt/local/var/macports/build/_Volumes_UNIX_opt_local_var_macports_sources_rsync.macports.org_release_tarballs_ports_aqua_aquaterm/aquaterm/work/AquaTerm-1.1.1/adapters/pgplot/xlf_gcc_AQT.conf
85:debug:patch euid/egid changed to: 502/504
86:debug:patch Executing reinplace: /usr/bin/sed s|/*<PREFIX>|/Volumes/UNIX/opt/local|g < /Volumes/UNIX/opt/local/var/macports/build/_Volumes_UNIX_opt_local_var_macports_sources_rsync.macports.org_release_tarballs_ports_aqua_aquaterm/aquaterm/work/AquaTerm-1.1.1/adapters/pgplot/g77_cc_AQT.conf >@ file10
87:debug:patch euid/egid changed to: 0/0
88:debug:patch chowned /Volumes/UNIX/opt/local/var/macports/build/_Volumes_UNIX_opt_local_var_macports_sources_rsync.macports.org_release_tarballs_ports_aqua_aquaterm/aquaterm/work/AquaTerm-1.1.1/adapters/pgplot/g77_cc_AQT.conf to macports
89:debug:patch euid/egid changed to: 502/504
90:debug:patch euid/egid changed to: 0/0
91:debug:patch setting attributes on /Volumes/UNIX/opt/local/var/macports/build/_Volumes_UNIX_opt_local_var_macports_sources_rsync.macports.org_release_tarballs_ports_aqua_aquaterm/aquaterm/work/AquaTerm-1.1.1/adapters/pgplot/g77_cc_AQT.conf
92:debug:patch euid/egid changed to: 502/504
93:debug:patch Executing reinplace: /usr/bin/sed s|/*<PREFIX>|/Volumes/UNIX/opt/local|g < /Volumes/UNIX/opt/local/var/macports/build/_Volumes_UNIX_opt_local_var_macports_sources_rsync.macports.org_release_tarballs_ports_aqua_aquaterm/aquaterm/work/AquaTerm-1.1.1/adapters/pgplot/g77_gcc_AQT.conf >@ file10
94:debug:patch euid/egid changed to: 0/0
95:debug:patch chowned /Volumes/UNIX/opt/local/var/macports/build/_Volumes_UNIX_opt_local_var_macports_sources_rsync.macports.org_release_tarballs_ports_aqua_aquaterm/aquaterm/work/AquaTerm-1.1.1/adapters/pgplot/g77_gcc_AQT.conf to macports
96:debug:patch euid/egid changed to: 502/504
97:debug:patch euid/egid changed to: 0/0
98:debug:patch setting attributes on /Volumes/UNIX/opt/local/var/macports/build/_Volumes_UNIX_opt_local_var_macports_sources_rsync.macports.org_release_tarballs_ports_aqua_aquaterm/aquaterm/work/AquaTerm-1.1.1/adapters/pgplot/g77_gcc_AQT.conf
99:debug:patch euid/egid changed to: 502/504
100:debug:patch Executing reinplace: /usr/bin/sed s|/*<PREFIX>|/Volumes/UNIX/opt/local|g < /Volumes/UNIX/opt/local/var/macports/build/_Volumes_UNIX_opt_local_var_macports_sources_rsync.macports.org_release_tarballs_ports_aqua_aquaterm/aquaterm/work/AquaTerm-1.1.1/adapters/pgplot/xlf_gcc_AQT.conf >@ file10
101:debug:patch euid/egid changed to: 0/0
102:debug:patch chowned /Volumes/UNIX/opt/local/var/macports/build/_Volumes_UNIX_opt_local_var_macports_sources_rsync.macports.org_release_tarballs_ports_aqua_aquaterm/aquaterm/work/AquaTerm-1.1.1/adapters/pgplot/xlf_gcc_AQT.conf to macports
103:debug:patch euid/egid changed to: 502/504
104:debug:patch euid/egid changed to: 0/0
105:debug:patch setting attributes on /Volumes/UNIX/opt/local/var/macports/build/_Volumes_UNIX_opt_local_var_macports_sources_rsync.macports.org_release_tarballs_ports_aqua_aquaterm/aquaterm/work/AquaTerm-1.1.1/adapters/pgplot/xlf_gcc_AQT.conf
106:debug:patch euid/egid changed to: 502/504
107:debug:patch Executing reinplace: /usr/bin/sed s|/sw|/Volumes/UNIX/opt/local|g < /Volumes/UNIX/opt/local/var/macports/build/_Volumes_UNIX_opt_local_var_macports_sources_rsync.macports.org_release_tarballs_ports_aqua_aquaterm/aquaterm/work/AquaTerm-1.1.1/adapters/pgplot/ReadMe >@ file10
108:debug:patch euid/egid changed to: 0/0
109:debug:patch chowned /Volumes/UNIX/opt/local/var/macports/build/_Volumes_UNIX_opt_local_var_macports_sources_rsync.macports.org_release_tarballs_ports_aqua_aquaterm/aquaterm/work/AquaTerm-1.1.1/adapters/pgplot/ReadMe to macports
110:debug:patch euid/egid changed to: 502/504
111:debug:patch euid/egid changed to: 0/0
112:debug:patch setting attributes on /Volumes/UNIX/opt/local/var/macports/build/_Volumes_UNIX_opt_local_var_macports_sources_rsync.macports.org_release_tarballs_ports_aqua_aquaterm/aquaterm/work/AquaTerm-1.1.1/adapters/pgplot/ReadMe
113:debug:patch euid/egid changed to: 502/504
114:debug:patch Privilege de-escalation not attempted as not running as root.
115:debug:configure configure phase started at Mon Feb 10 01:08:48 MST 2014
116:notice:configure --->  Configuring aquaterm
117:debug:configure Using compiler 'Xcode Clang'
118:debug:configure Executing org.macports.configure (aquaterm)
119:debug:configure Privilege de-escalation not attempted as not running as root.
120:debug:build build phase started at Mon Feb 10 01:08:48 MST 2014
121:notice:build --->  Building aquaterm
122:debug:build Executing org.macports.build (aquaterm)
123:debug:build Assembled command: 'cd "/Volumes/UNIX/opt/local/var/macports/build/_Volumes_UNIX_opt_local_var_macports_sources_rsync.macports.org_release_tarballs_ports_aqua_aquaterm/aquaterm/work/AquaTerm-1.1.1/aquaterm" && /usr/bin/xcodebuild  -target "AquaTerm" -configuration Default build OBJROOT=build/ SYMROOT=build/ MACOSX_DEPLOYMENT_TARGET=10.9 ARCHS=x86_64 SDKROOT="" GCC_VERSION=com.apple.compilers.llvm.clang.1_0 LOCAL_APPS_DIR=/Volumes/UNIX/MacPorts LOCAL_FRAMEWORKS_DIR=/Volumes/UNIX/opt/local/Library/Frameworks'
124:info:build Build settings from command line:
125:info:build     ARCHS = x86_64
126:info:build     GCC_VERSION = com.apple.compilers.llvm.clang.1_0
127:info:build     LOCAL_APPS_DIR = /Volumes/UNIX/MacPorts
128:info:build     LOCAL_FRAMEWORKS_DIR = /Volumes/UNIX/opt/local/Library/Frameworks
129:info:build     MACOSX_DEPLOYMENT_TARGET = 10.9
130:info:build     OBJROOT = build/
131:info:build     SDKROOT =
132:info:build     SYMROOT = build/
133:info:build
134:info:build === BUILD TARGET AQTFwk OF PROJECT AquaTerm WITH CONFIGURATION Default ===
135:info:build
136:info:build Check dependencies
137:info:build
138:info:build Create product structure
139:info:build /bin/mkdir -p /Volumes/UNIX/opt/local/var/macports/build/_Volumes_UNIX_opt_local_var_macports_sources_rsync.macports.org_release_tarballs_ports_aqua_aquaterm/aquaterm/work/AquaTerm-1.1.1/aquaterm/build/Default/AquaTerm.framework/Versions/A
140:info:build /bin/mkdir -p /Volumes/UNIX/opt/local/var/macports/build/_Volumes_UNIX_opt_local_var_macports_sources_rsync.macports.org_release_tarballs_ports_aqua_aquaterm/aquaterm/work/AquaTerm-1.1.1/aquaterm/build/Default/AquaTerm.framework/Versions/A/Headers
141:info:build /bin/mkdir -p /Volumes/UNIX/opt/local/var/macports/build/_Volumes_UNIX_opt_local_var_macports_sources_rsync.macports.org_release_tarballs_ports_aqua_aquaterm/aquaterm/work/AquaTerm-1.1.1/aquaterm/build/Default/AquaTerm.framework/Versions/A/Resources
142:info:build /bin/ln -s A /Volumes/UNIX/opt/local/var/macports/build/_Volumes_UNIX_opt_local_var_macports_sources_rsync.macports.org_release_tarballs_ports_aqua_aquaterm/aquaterm/work/AquaTerm-1.1.1/aquaterm/build/Default/AquaTerm.framework/Versions/Current
143:info:build /bin/ln -s Versions/Current/Resources /Volumes/UNIX/opt/local/var/macports/build/_Volumes_UNIX_opt_local_var_macports_sources_rsync.macports.org_release_tarballs_ports_aqua_aquaterm/aquaterm/work/AquaTerm-1.1.1/aquaterm/build/Default/AquaTerm.framework/Resources
144:info:build /bin/ln -s Versions/Current/Headers /Volumes/UNIX/opt/local/var/macports/build/_Volumes_UNIX_opt_local_var_macports_sources_rsync.macports.org_release_tarballs_ports_aqua_aquaterm/aquaterm/work/AquaTerm-1.1.1/aquaterm/build/Default/AquaTerm.framework/Headers
145:info:build /bin/ln -s Versions/Current/AquaTerm /Volumes/UNIX/opt/local/var/macports/build/_Volumes_UNIX_opt_local_var_macports_sources_rsync.macports.org_release_tarballs_ports_aqua_aquaterm/aquaterm/work/AquaTerm-1.1.1/aquaterm/build/Default/AquaTerm.framework/AquaTerm
146:info:build
147:info:build ProcessInfoPlistFile build/Default/AquaTerm.framework/Versions/A/Resources/Info.plist AquaTerm.framework-Info.plist
148:info:build     cd /Volumes/UNIX/opt/local/var/macports/build/_Volumes_UNIX_opt_local_var_macports_sources_rsync.macports.org_release_tarballs_ports_aqua_aquaterm/aquaterm/work/AquaTerm-1.1.1/aquaterm
149:info:build     builtin-infoPlistUtility /Volumes/UNIX/opt/local/var/macports/build/_Volumes_UNIX_opt_local_var_macports_sources_rsync.macports.org_release_tarballs_ports_aqua_aquaterm/aquaterm/work/AquaTerm-1.1.1/aquaterm/AquaTerm.framework-Info.plist -expandbuildsettings -platform macosx -o /Volumes/UNIX/opt/local/var/macports/build/_Volumes_UNIX_opt_local_var_macports_sources_rsync.macports.org_release_tarballs_ports_aqua_aquaterm/aquaterm/work/AquaTerm-1.1.1/aquaterm/build/Default/AquaTerm.framework/Versions/A/Resources/Info.plist
150:info:build
151:info:build CpHeader AQTAdapter.h build/Default/AquaTerm.framework/Versions/A/Headers/AQTAdapter.h
152:info:build     cd /Volumes/UNIX/opt/local/var/macports/build/_Volumes_UNIX_opt_local_var_macports_sources_rsync.macports.org_release_tarballs_ports_aqua_aquaterm/aquaterm/work/AquaTerm-1.1.1/aquaterm
153:info:build     builtin-copy -exclude .DS_Store -exclude CVS -exclude .svn -exclude .git -exclude .hg -resolve-src-symlinks /Volumes/UNIX/opt/local/var/macports/build/_Volumes_UNIX_opt_local_var_macports_sources_rsync.macports.org_release_tarballs_ports_aqua_aquaterm/aquaterm/work/AquaTerm-1.1.1/aquaterm/AQTAdapter.h /Volumes/UNIX/opt/local/var/macports/build/_Volumes_UNIX_opt_local_var_macports_sources_rsync.macports.org_release_tarballs_ports_aqua_aquaterm/aquaterm/work/AquaTerm-1.1.1/aquaterm/build/Default/AquaTerm.framework/Versions/A/Headers
154:info:build
155:info:build CpHeader aquaterm.h build/Default/AquaTerm.framework/Versions/A/Headers/aquaterm.h
156:info:build     cd /Volumes/UNIX/opt/local/var/macports/build/_Volumes_UNIX_opt_local_var_macports_sources_rsync.macports.org_release_tarballs_ports_aqua_aquaterm/aquaterm/work/AquaTerm-1.1.1/aquaterm
157:info:build     builtin-copy -exclude .DS_Store -exclude CVS -exclude .svn -exclude .git -exclude .hg -resolve-src-symlinks /Volumes/UNIX/opt/local/var/macports/build/_Volumes_UNIX_opt_local_var_macports_sources_rsync.macports.org_release_tarballs_ports_aqua_aquaterm/aquaterm/work/AquaTerm-1.1.1/aquaterm/aquaterm.h /Volumes/UNIX/opt/local/var/macports/build/_Volumes_UNIX_opt_local_var_macports_sources_rsync.macports.org_release_tarballs_ports_aqua_aquaterm/aquaterm/work/AquaTerm-1.1.1/aquaterm/build/Default/AquaTerm.framework/Versions/A/Headers
158:info:build
159:info:build CpResource AquaTerm.bridgesupport build/Default/AquaTerm.framework/Versions/A/Resources/AquaTerm.bridgesupport
160:info:build     cd /Volumes/UNIX/opt/local/var/macports/build/_Volumes_UNIX_opt_local_var_macports_sources_rsync.macports.org_release_tarballs_ports_aqua_aquaterm/aquaterm/work/AquaTerm-1.1.1/aquaterm
161:info:build     builtin-copy -exclude .DS_Store -exclude CVS -exclude .svn -exclude .git -exclude .hg -resolve-src-symlinks /Volumes/UNIX/opt/local/var/macports/build/_Volumes_UNIX_opt_local_var_macports_sources_rsync.macports.org_release_tarballs_ports_aqua_aquaterm/aquaterm/work/AquaTerm-1.1.1/aquaterm/AquaTerm.bridgesupport /Volumes/UNIX/opt/local/var/macports/build/_Volumes_UNIX_opt_local_var_macports_sources_rsync.macports.org_release_tarballs_ports_aqua_aquaterm/aquaterm/work/AquaTerm-1.1.1/aquaterm/build/Default/AquaTerm.framework/Versions/A/Resources
162:info:build
163:info:build CompileC build/AquaTerm.build/Default/AQTFwk.build/Objects-normal/x86_64/AQTAdapter.o AQTAdapter.m normal x86_64 objective-c com.apple.compilers.llvm.clang.1_0.compiler
164:info:build     cd /Volumes/UNIX/opt/local/var/macports/build/_Volumes_UNIX_opt_local_var_macports_sources_rsync.macports.org_release_tarballs_ports_aqua_aquaterm/aquaterm/work/AquaTerm-1.1.1/aquaterm
165:info:build     setenv LANG en_US.US-ASCII
166:info:build     /Applications/Xcode.app/Contents/Developer/Toolchains/XcodeDefault.xctoolchain/usr/bin/clang -x objective-c -arch x86_64 -fmessage-length=0 -fdiagnostics-show-note-include-stack -fmacro-backtrace-limit=0 -Wno-trigraphs -fpascal-strings -Os -Wno-missing-field-initializers -Wno-missing-prototypes -Wno-return-type -Wno-implicit-atomic-properties -Wno-receiver-is-weak -Wno-arc-repeated-use-of-weak -Wno-missing-braces -Wparentheses -Wswitch -Wno-unused-function -Wno-unused-label -Wno-unused-parameter -Wno-unused-variable -Wunused-value -Wno-empty-body -Wno-uninitialized -Wno-unknown-pragmas -Wno-shadow -Wno-four-char-constants -Wno-conversion -Wno-constant-conversion -Wno-int-conversion -Wno-bool-conversion -Wno-enum-conversion -Wno-shorten-64-to-32 -Wpointer-sign -Wno-newline-eof -Wno-selector -Wno-strict-selector-match -Wno-undeclared-selector -Wno-deprecated-implementations -isysroot /Applications/Xcode.app/Contents/Developer/Platforms/MacOSX.platform/Developer/SDKs/MacOSX10.9.sdk -fasm-blocks -fstrict-aliasing -Wprotocol -Wdeprecated-declarations -mmacosx-version-min=10.9 -g -Wno-sign-conversion -I/Volumes/UNIX/opt/local/var/macports/build/_Volumes_UNIX_opt_local_var_macports_sources_rsync.macports.org_release_tarballs_ports_aqua_aquaterm/aquaterm/work/AquaTerm-1.1.1/aquaterm/build/AquaTerm.build/Default/AQTFwk.build/AquaTerm.hmap -I/Volumes/UNIX/opt/local/var/macports/build/_Volumes_UNIX_opt_local_var_macports_sources_rsync.macports.org_release_tarballs_ports_aqua_aquaterm/aquaterm/work/AquaTerm-1.1.1/aquaterm/build/Default/include -I/Applications/Xcode.app/Contents/Developer/Toolchains/XcodeDefault.xctoolchain/usr/include -I/Volumes/UNIX/opt/local/var/macports/build/_Volumes_UNIX_opt_local_var_macports_sources_rsync.macports.org_release_tarballs_ports_aqua_aquaterm/aquaterm/work/AquaTerm-1.1.1/aquaterm/build/AquaTerm.build/Default/AQTFwk.build/DerivedSources/x86_64 -I/Volumes/UNIX/opt/local/var/macports/build/_Volumes_UNIX_opt_local_var_macports_sources_rsync.macports.org_release_tarballs_ports_aqua_aquaterm/aquaterm/work/AquaTerm-1.1.1/aquaterm/build/AquaTerm.build/Default/AQTFwk.build/DerivedSources -Wmost -Wno-four-char-constants -Wno-unknown-pragmas -F/Volumes/UNIX/opt/local/var/macports/build/_Volumes_UNIX_opt_local_var_macports_sources_rsync.macports.org_release_tarballs_ports_aqua_aquaterm/aquaterm/work/AquaTerm-1.1.1/aquaterm/build/Default -include /var/folders/h0/hrvn66895s3flzqq1dqngg_00000gp/C/com.apple.DeveloperTools/5.0.2-5A3005/Xcode/SharedPrecompiledHeaders/AppKit-ezwogvcyoswrskbhlwcvpzntmjsn/AppKit.h -MMD -MT dependencies -MF /Volumes/UNIX/opt/local/var/macports/build/_Volumes_UNIX_opt_local_var_macports_sources_rsync.macports.org_release_tarballs_ports_aqua_aquaterm/aquaterm/work/AquaTerm-1.1.1/aquaterm/build/AquaTerm.build/Default/AQTFwk.build/Objects-normal/x86_64/AQTAdapter.d --serialize-diagnostics /Volumes/UNIX/opt/local/var/macports/build/_Volumes_UNIX_opt_local_var_macports_sources_rsync.macports.org_release_tarballs_ports_aqua_aquaterm/aquaterm/work/AquaTerm-1.1.1/aquaterm/build/AquaTerm.build/Default/AQTFwk.build/Objects-normal/x86_64/AQTAdapter.dia -c /Volumes/UNIX/opt/local/var/macports/build/_Volumes_UNIX_opt_local_var_macports_sources_rsync.macports.org_release_tarballs_ports_aqua_aquaterm/aquaterm/work/AquaTerm-1.1.1/aquaterm/AQTAdapter.m -o /Volumes/UNIX/opt/local/var/macports/build/_Volumes_UNIX_opt_local_var_macports_sources_rsync.macports.org_release_tarballs_ports_aqua_aquaterm/aquaterm/work/AquaTerm-1.1.1/aquaterm/build/AquaTerm.build/Default/AQTFwk.build/Objects-normal/x86_64/AQTAdapter.o
167:info:build /Volumes/UNIX/opt/local/var/macports/build/_Volumes_UNIX_opt_local_var_macports_sources_rsync.macports.org_release_tarballs_ports_aqua_aquaterm/aquaterm/work/AquaTerm-1.1.1/aquaterm/AQTAdapter.m:79:78: warning: values of type 'NSUInteger' should not be used as format arguments; add an explicit cast to 'unsigned long' instead [-Wformat]
168:info:build    [_clientManager logMessage:[NSString stringWithFormat:@"adapter rc = %d", [self retainCount]] logLevel:3];
169:info:build                                                                         ~~   ^~~~~~~~~~~~~~~~~~
170:info:build                                                                         %lu  (unsigned long)
171:info:build /Volumes/UNIX/opt/local/var/macports/build/_Volumes_UNIX_opt_local_var_macports_sources_rsync.macports.org_release_tarballs_ports_aqua_aquaterm/aquaterm/work/AquaTerm-1.1.1/aquaterm/AQTAdapter.m:77:1: warning: conflicting distributed object modifiers on return type in implementation of 'release' [-Wdistributed-object-modifiers]
172:info:build - (void)release
173:info:build ^  ~~~~
174:info:build In file included from /Volumes/UNIX/opt/local/var/macports/build/_Volumes_UNIX_opt_local_var_macports_sources_rsync.macports.org_release_tarballs_ports_aqua_aquaterm/aquaterm/work/AquaTerm-1.1.1/aquaterm/AQTAdapter.m:1:
175:info:build In file included from /Applications/Xcode.app/Contents/Developer/Platforms/MacOSX.platform/Developer/SDKs/MacOSX10.9.sdk/System/Library/Frameworks/AppKit.framework/Headers/AppKit.h:10:
176:info:build In file included from /Applications/Xcode.app/Contents/Developer/Platforms/MacOSX.platform/Developer/SDKs/MacOSX10.9.sdk/System/Library/Frameworks/Foundation.framework/Headers/Foundation.h:6:
177:info:build In file included from /Applications/Xcode.app/Contents/Developer/Platforms/MacOSX.platform/Developer/SDKs/MacOSX10.9.sdk/System/Library/Frameworks/CoreFoundation.framework/Headers/CoreFoundation.h:55:
178:info:build In file included from /Applications/Xcode.app/Contents/Developer/Platforms/MacOSX.platform/Developer/SDKs/MacOSX10.9.sdk/System/Library/Frameworks/CoreFoundation.framework/Headers/CFPropertyList.h:13:
179:info:build In file included from /Applications/Xcode.app/Contents/Developer/Platforms/MacOSX.platform/Developer/SDKs/MacOSX10.9.sdk/System/Library/Frameworks/CoreFoundation.framework/Headers/CFStream.h:15:
180:info:build In file included from /Applications/Xcode.app/Contents/Developer/Platforms/MacOSX.platform/Developer/SDKs/MacOSX10.9.sdk/usr/include/dispatch/dispatch.h:48:
181:info:build In file included from /Applications/Xcode.app/Contents/Developer/Platforms/MacOSX.platform/Developer/SDKs/MacOSX10.9.sdk/usr/include/os/object.h:74:
182:info:build /Applications/Xcode.app/Contents/Developer/Platforms/MacOSX.platform/Developer/SDKs/MacOSX10.9.sdk/usr/include/objc/NSObject.h:36:1: note: previous declaration is here
183:info:build - (oneway void)release OBJC_ARC_UNAVAILABLE;
184:info:build ^         ~~~~
185:info:build 2 warnings generated.
186:info:build
187:info:build CompileC build/AquaTerm.build/Default/AQTFwk.build/Objects-normal/x86_64/AQTLabel.o AQTLabel.m normal x86_64 objective-c com.apple.compilers.llvm.clang.1_0.compiler
188:info:build     cd /Volumes/UNIX/opt/local/var/macports/build/_Volumes_UNIX_opt_local_var_macports_sources_rsync.macports.org_release_tarballs_ports_aqua_aquaterm/aquaterm/work/AquaTerm-1.1.1/aquaterm
189:info:build     setenv LANG en_US.US-ASCII
190:info:build     /Applications/Xcode.app/Contents/Developer/Toolchains/XcodeDefault.xctoolchain/usr/bin/clang -x objective-c -arch x86_64 -fmessage-length=0 -fdiagnostics-show-note-include-stack -fmacro-backtrace-limit=0 -Wno-trigraphs -fpascal-strings -Os -Wno-missing-field-initializers -Wno-missing-prototypes -Wno-return-type -Wno-implicit-atomic-properties -Wno-receiver-is-weak -Wno-arc-repeated-use-of-weak -Wno-missing-braces -Wparentheses -Wswitch -Wno-unused-function -Wno-unused-label -Wno-unused-parameter -Wno-unused-variable -Wunused-value -Wno-empty-body -Wno-uninitialized -Wno-unknown-pragmas -Wno-shadow -Wno-four-char-constants -Wno-conversion -Wno-constant-conversion -Wno-int-conversion -Wno-bool-conversion -Wno-enum-conversion -Wno-shorten-64-to-32 -Wpointer-sign -Wno-newline-eof -Wno-selector -Wno-strict-selector-match -Wno-undeclared-selector -Wno-deprecated-implementations -isysroot /Applications/Xcode.app/Contents/Developer/Platforms/MacOSX.platform/Developer/SDKs/MacOSX10.9.sdk -fasm-blocks -fstrict-aliasing -Wprotocol -Wdeprecated-declarations -mmacosx-version-min=10.9 -g -Wno-sign-conversion -I/Volumes/UNIX/opt/local/var/macports/build/_Volumes_UNIX_opt_local_var_macports_sources_rsync.macports.org_release_tarballs_ports_aqua_aquaterm/aquaterm/work/AquaTerm-1.1.1/aquaterm/build/AquaTerm.build/Default/AQTFwk.build/AquaTerm.hmap -I/Volumes/UNIX/opt/local/var/macports/build/_Volumes_UNIX_opt_local_var_macports_sources_rsync.macports.org_release_tarballs_ports_aqua_aquaterm/aquaterm/work/AquaTerm-1.1.1/aquaterm/build/Default/include -I/Applications/Xcode.app/Contents/Developer/Toolchains/XcodeDefault.xctoolchain/usr/include -I/Volumes/UNIX/opt/local/var/macports/build/_Volumes_UNIX_opt_local_var_macports_sources_rsync.macports.org_release_tarballs_ports_aqua_aquaterm/aquaterm/work/AquaTerm-1.1.1/aquaterm/build/AquaTerm.build/Default/AQTFwk.build/DerivedSources/x86_64 -I/Volumes/UNIX/opt/local/var/macports/build/_Volumes_UNIX_opt_local_var_macports_sources_rsync.macports.org_release_tarballs_ports_aqua_aquaterm/aquaterm/work/AquaTerm-1.1.1/aquaterm/build/AquaTerm.build/Default/AQTFwk.build/DerivedSources -Wmost -Wno-four-char-constants -Wno-unknown-pragmas -F/Volumes/UNIX/opt/local/var/macports/build/_Volumes_UNIX_opt_local_var_macports_sources_rsync.macports.org_release_tarballs_ports_aqua_aquaterm/aquaterm/work/AquaTerm-1.1.1/aquaterm/build/Default -include /var/folders/h0/hrvn66895s3flzqq1dqngg_00000gp/C/com.apple.DeveloperTools/5.0.2-5A3005/Xcode/SharedPrecompiledHeaders/AppKit-ezwogvcyoswrskbhlwcvpzntmjsn/AppKit.h -MMD -MT dependencies -MF /Volumes/UNIX/opt/local/var/macports/build/_Volumes_UNIX_opt_local_var_macports_sources_rsync.macports.org_release_tarballs_ports_aqua_aquaterm/aquaterm/work/AquaTerm-1.1.1/aquaterm/build/AquaTerm.build/Default/AQTFwk.build/Objects-normal/x86_64/AQTLabel.d --serialize-diagnostics /Volumes/UNIX/opt/local/var/macports/build/_Volumes_UNIX_opt_local_var_macports_sources_rsync.macports.org_release_tarballs_ports_aqua_aquaterm/aquaterm/work/AquaTerm-1.1.1/aquaterm/build/AquaTerm.build/Default/AQTFwk.build/Objects-normal/x86_64/AQTLabel.dia -c /Volumes/UNIX/opt/local/var/macports/build/_Volumes_UNIX_opt_local_var_macports_sources_rsync.macports.org_release_tarballs_ports_aqua_aquaterm/aquaterm/work/AquaTerm-1.1.1/aquaterm/AQTLabel.m -o /Volumes/UNIX/opt/local/var/macports/build/_Volumes_UNIX_opt_local_var_macports_sources_rsync.macports.org_release_tarballs_ports_aqua_aquaterm/aquaterm/work/AquaTerm-1.1.1/aquaterm/build/AquaTerm.build/Default/AQTFwk.build/Objects-normal/x86_64/AQTLabel.o
191:info:build
192:info:build CompileC build/AquaTerm.build/Default/AQTFwk.build/Objects-normal/x86_64/AQTImage.o AQTImage.m normal x86_64 objective-c com.apple.compilers.llvm.clang.1_0.compiler
193:info:build     cd /Volumes/UNIX/opt/local/var/macports/build/_Volumes_UNIX_opt_local_var_macports_sources_rsync.macports.org_release_tarballs_ports_aqua_aquaterm/aquaterm/work/AquaTerm-1.1.1/aquaterm
194:info:build     setenv LANG en_US.US-ASCII
195:info:build     /Applications/Xcode.app/Contents/Developer/Toolchains/XcodeDefault.xctoolchain/usr/bin/clang -x objective-c -arch x86_64 -fmessage-length=0 -fdiagnostics-show-note-include-stack -fmacro-backtrace-limit=0 -Wno-trigraphs -fpascal-strings -Os -Wno-missing-field-initializers -Wno-missing-prototypes -Wno-return-type -Wno-implicit-atomic-properties -Wno-receiver-is-weak -Wno-arc-repeated-use-of-weak -Wno-missing-braces -Wparentheses -Wswitch -Wno-unused-function -Wno-unused-label -Wno-unused-parameter -Wno-unused-variable -Wunused-value -Wno-empty-body -Wno-uninitialized -Wno-unknown-pragmas -Wno-shadow -Wno-four-char-constants -Wno-conversion -Wno-constant-conversion -Wno-int-conversion -Wno-bool-conversion -Wno-enum-conversion -Wno-shorten-64-to-32 -Wpointer-sign -Wno-newline-eof -Wno-selector -Wno-strict-selector-match -Wno-undeclared-selector -Wno-deprecated-implementations -isysroot /Applications/Xcode.app/Contents/Developer/Platforms/MacOSX.platform/Developer/SDKs/MacOSX10.9.sdk -fasm-blocks -fstrict-aliasing -Wprotocol -Wdeprecated-declarations -mmacosx-version-min=10.9 -g -Wno-sign-conversion -I/Volumes/UNIX/opt/local/var/macports/build/_Volumes_UNIX_opt_local_var_macports_sources_rsync.macports.org_release_tarballs_ports_aqua_aquaterm/aquaterm/work/AquaTerm-1.1.1/aquaterm/build/AquaTerm.build/Default/AQTFwk.build/AquaTerm.hmap -I/Volumes/UNIX/opt/local/var/macports/build/_Volumes_UNIX_opt_local_var_macports_sources_rsync.macports.org_release_tarballs_ports_aqua_aquaterm/aquaterm/work/AquaTerm-1.1.1/aquaterm/build/Default/include -I/Applications/Xcode.app/Contents/Developer/Toolchains/XcodeDefault.xctoolchain/usr/include -I/Volumes/UNIX/opt/local/var/macports/build/_Volumes_UNIX_opt_local_var_macports_sources_rsync.macports.org_release_tarballs_ports_aqua_aquaterm/aquaterm/work/AquaTerm-1.1.1/aquaterm/build/AquaTerm.build/Default/AQTFwk.build/DerivedSources/x86_64 -I/Volumes/UNIX/opt/local/var/macports/build/_Volumes_UNIX_opt_local_var_macports_sources_rsync.macports.org_release_tarballs_ports_aqua_aquaterm/aquaterm/work/AquaTerm-1.1.1/aquaterm/build/AquaTerm.build/Default/AQTFwk.build/DerivedSources -Wmost -Wno-four-char-constants -Wno-unknown-pragmas -F/Volumes/UNIX/opt/local/var/macports/build/_Volumes_UNIX_opt_local_var_macports_sources_rsync.macports.org_release_tarballs_ports_aqua_aquaterm/aquaterm/work/AquaTerm-1.1.1/aquaterm/build/Default -include /var/folders/h0/hrvn66895s3flzqq1dqngg_00000gp/C/com.apple.DeveloperTools/5.0.2-5A3005/Xcode/SharedPrecompiledHeaders/AppKit-ezwogvcyoswrskbhlwcvpzntmjsn/AppKit.h -MMD -MT dependencies -MF /Volumes/UNIX/opt/local/var/macports/build/_Volumes_UNIX_opt_local_var_macports_sources_rsync.macports.org_release_tarballs_ports_aqua_aquaterm/aquaterm/work/AquaTerm-1.1.1/aquaterm/build/AquaTerm.build/Default/AQTFwk.build/Objects-normal/x86_64/AQTImage.d --serialize-diagnostics /Volumes/UNIX/opt/local/var/macports/build/_Volumes_UNIX_opt_local_var_macports_sources_rsync.macports.org_release_tarballs_ports_aqua_aquaterm/aquaterm/work/AquaTerm-1.1.1/aquaterm/build/AquaTerm.build/Default/AQTFwk.build/Objects-normal/x86_64/AQTImage.dia -c /Volumes/UNIX/opt/local/var/macports/build/_Volumes_UNIX_opt_local_var_macports_sources_rsync.macports.org_release_tarballs_ports_aqua_aquaterm/aquaterm/work/AquaTerm-1.1.1/aquaterm/AQTImage.m -o /Volumes/UNIX/opt/local/var/macports/build/_Volumes_UNIX_opt_local_var_macports_sources_rsync.macports.org_release_tarballs_ports_aqua_aquaterm/aquaterm/work/AquaTerm-1.1.1/aquaterm/build/AquaTerm.build/Default/AQTFwk.build/Objects-normal/x86_64/AQTImage.o
196:info:build
197:info:build CompileC build/AquaTerm.build/Default/AQTFwk.build/Objects-normal/x86_64/AQTGraphic.o AQTGraphic.m normal x86_64 objective-c com.apple.compilers.llvm.clang.1_0.compiler
198:info:build     cd /Volumes/UNIX/opt/local/var/macports/build/_Volumes_UNIX_opt_local_var_macports_sources_rsync.macports.org_release_tarballs_ports_aqua_aquaterm/aquaterm/work/AquaTerm-1.1.1/aquaterm
199:info:build     setenv LANG en_US.US-ASCII
200:info:build     /Applications/Xcode.app/Contents/Developer/Toolchains/XcodeDefault.xctoolchain/usr/bin/clang -x objective-c -arch x86_64 -fmessage-length=0 -fdiagnostics-show-note-include-stack -fmacro-backtrace-limit=0 -Wno-trigraphs -fpascal-strings -Os -Wno-missing-field-initializers -Wno-missing-prototypes -Wno-return-type -Wno-implicit-atomic-properties -Wno-receiver-is-weak -Wno-arc-repeated-use-of-weak -Wno-missing-braces -Wparentheses -Wswitch -Wno-unused-function -Wno-unused-label -Wno-unused-parameter -Wno-unused-variable -Wunused-value -Wno-empty-body -Wno-uninitialized -Wno-unknown-pragmas -Wno-shadow -Wno-four-char-constants -Wno-conversion -Wno-constant-conversion -Wno-int-conversion -Wno-bool-conversion -Wno-enum-conversion -Wno-shorten-64-to-32 -Wpointer-sign -Wno-newline-eof -Wno-selector -Wno-strict-selector-match -Wno-undeclared-selector -Wno-deprecated-implementations -isysroot /Applications/Xcode.app/Contents/Developer/Platforms/MacOSX.platform/Developer/SDKs/MacOSX10.9.sdk -fasm-blocks -fstrict-aliasing -Wprotocol -Wdeprecated-declarations -mmacosx-version-min=10.9 -g -Wno-sign-conversion -I/Volumes/UNIX/opt/local/var/macports/build/_Volumes_UNIX_opt_local_var_macports_sources_rsync.macports.org_release_tarballs_ports_aqua_aquaterm/aquaterm/work/AquaTerm-1.1.1/aquaterm/build/AquaTerm.build/Default/AQTFwk.build/AquaTerm.hmap -I/Volumes/UNIX/opt/local/var/macports/build/_Volumes_UNIX_opt_local_var_macports_sources_rsync.macports.org_release_tarballs_ports_aqua_aquaterm/aquaterm/work/AquaTerm-1.1.1/aquaterm/build/Default/include -I/Applications/Xcode.app/Contents/Developer/Toolchains/XcodeDefault.xctoolchain/usr/include -I/Volumes/UNIX/opt/local/var/macports/build/_Volumes_UNIX_opt_local_var_macports_sources_rsync.macports.org_release_tarballs_ports_aqua_aquaterm/aquaterm/work/AquaTerm-1.1.1/aquaterm/build/AquaTerm.build/Default/AQTFwk.build/DerivedSources/x86_64 -I/Volumes/UNIX/opt/local/var/macports/build/_Volumes_UNIX_opt_local_var_macports_sources_rsync.macports.org_release_tarballs_ports_aqua_aquaterm/aquaterm/work/AquaTerm-1.1.1/aquaterm/build/AquaTerm.build/Default/AQTFwk.build/DerivedSources -Wmost -Wno-four-char-constants -Wno-unknown-pragmas -F/Volumes/UNIX/opt/local/var/macports/build/_Volumes_UNIX_opt_local_var_macports_sources_rsync.macports.org_release_tarballs_ports_aqua_aquaterm/aquaterm/work/AquaTerm-1.1.1/aquaterm/build/Default -include /var/folders/h0/hrvn66895s3flzqq1dqngg_00000gp/C/com.apple.DeveloperTools/5.0.2-5A3005/Xcode/SharedPrecompiledHeaders/AppKit-ezwogvcyoswrskbhlwcvpzntmjsn/AppKit.h -MMD -MT dependencies -MF /Volumes/UNIX/opt/local/var/macports/build/_Volumes_UNIX_opt_local_var_macports_sources_rsync.macports.org_release_tarballs_ports_aqua_aquaterm/aquaterm/work/AquaTerm-1.1.1/aquaterm/build/AquaTerm.build/Default/AQTFwk.build/Objects-normal/x86_64/AQTGraphic.d --serialize-diagnostics /Volumes/UNIX/opt/local/var/macports/build/_Volumes_UNIX_opt_local_var_macports_sources_rsync.macports.org_release_tarballs_ports_aqua_aquaterm/aquaterm/work/AquaTerm-1.1.1/aquaterm/build/AquaTerm.build/Default/AQTFwk.build/Objects-normal/x86_64/AQTGraphic.dia -c /Volumes/UNIX/opt/local/var/macports/build/_Volumes_UNIX_opt_local_var_macports_sources_rsync.macports.org_release_tarballs_ports_aqua_aquaterm/aquaterm/work/AquaTerm-1.1.1/aquaterm/AQTGraphic.m -o /Volumes/UNIX/opt/local/var/macports/build/_Volumes_UNIX_opt_local_var_macports_sources_rsync.macports.org_release_tarballs_ports_aqua_aquaterm/aquaterm/work/AquaTerm-1.1.1/aquaterm/build/AquaTerm.build/Default/AQTFwk.build/Objects-normal/x86_64/AQTGraphic.o
201:info:build
202:info:build CompileC build/AquaTerm.build/Default/AQTFwk.build/Objects-normal/x86_64/AQTColorMap.o AQTColorMap.m normal x86_64 objective-c com.apple.compilers.llvm.clang.1_0.compiler
203:info:build     cd /Volumes/UNIX/opt/local/var/macports/build/_Volumes_UNIX_opt_local_var_macports_sources_rsync.macports.org_release_tarballs_ports_aqua_aquaterm/aquaterm/work/AquaTerm-1.1.1/aquaterm
204:info:build     setenv LANG en_US.US-ASCII
205:info:build     /Applications/Xcode.app/Contents/Developer/Toolchains/XcodeDefault.xctoolchain/usr/bin/clang -x objective-c -arch x86_64 -fmessage-length=0 -fdiagnostics-show-note-include-stack -fmacro-backtrace-limit=0 -Wno-trigraphs -fpascal-strings -Os -Wno-missing-field-initializers -Wno-missing-prototypes -Wno-return-type -Wno-implicit-atomic-properties -Wno-receiver-is-weak -Wno-arc-repeated-use-of-weak -Wno-missing-braces -Wparentheses -Wswitch -Wno-unused-function -Wno-unused-label -Wno-unused-parameter -Wno-unused-variable -Wunused-value -Wno-empty-body -Wno-uninitialized -Wno-unknown-pragmas -Wno-shadow -Wno-four-char-constants -Wno-conversion -Wno-constant-conversion -Wno-int-conversion -Wno-bool-conversion -Wno-enum-conversion -Wno-shorten-64-to-32 -Wpointer-sign -Wno-newline-eof -Wno-selector -Wno-strict-selector-match -Wno-undeclared-selector -Wno-deprecated-implementations -isysroot /Applications/Xcode.app/Contents/Developer/Platforms/MacOSX.platform/Developer/SDKs/MacOSX10.9.sdk -fasm-blocks -fstrict-aliasing -Wprotocol -Wdeprecated-declarations -mmacosx-version-min=10.9 -g -Wno-sign-conversion -I/Volumes/UNIX/opt/local/var/macports/build/_Volumes_UNIX_opt_local_var_macports_sources_rsync.macports.org_release_tarballs_ports_aqua_aquaterm/aquaterm/work/AquaTerm-1.1.1/aquaterm/build/AquaTerm.build/Default/AQTFwk.build/AquaTerm.hmap -I/Volumes/UNIX/opt/local/var/macports/build/_Volumes_UNIX_opt_local_var_macports_sources_rsync.macports.org_release_tarballs_ports_aqua_aquaterm/aquaterm/work/AquaTerm-1.1.1/aquaterm/build/Default/include -I/Applications/Xcode.app/Contents/Developer/Toolchains/XcodeDefault.xctoolchain/usr/include -I/Volumes/UNIX/opt/local/var/macports/build/_Volumes_UNIX_opt_local_var_macports_sources_rsync.macports.org_release_tarballs_ports_aqua_aquaterm/aquaterm/work/AquaTerm-1.1.1/aquaterm/build/AquaTerm.build/Default/AQTFwk.build/DerivedSources/x86_64 -I/Volumes/UNIX/opt/local/var/macports/build/_Volumes_UNIX_opt_local_var_macports_sources_rsync.macports.org_release_tarballs_ports_aqua_aquaterm/aquaterm/work/AquaTerm-1.1.1/aquaterm/build/AquaTerm.build/Default/AQTFwk.build/DerivedSources -Wmost -Wno-four-char-constants -Wno-unknown-pragmas -F/Volumes/UNIX/opt/local/var/macports/build/_Volumes_UNIX_opt_local_var_macports_sources_rsync.macports.org_release_tarballs_ports_aqua_aquaterm/aquaterm/work/AquaTerm-1.1.1/aquaterm/build/Default -include /var/folders/h0/hrvn66895s3flzqq1dqngg_00000gp/C/com.apple.DeveloperTools/5.0.2-5A3005/Xcode/SharedPrecompiledHeaders/AppKit-ezwogvcyoswrskbhlwcvpzntmjsn/AppKit.h -MMD -MT dependencies -MF /Volumes/UNIX/opt/local/var/macports/build/_Volumes_UNIX_opt_local_var_macports_sources_rsync.macports.org_release_tarballs_ports_aqua_aquaterm/aquaterm/work/AquaTerm-1.1.1/aquaterm/build/AquaTerm.build/Default/AQTFwk.build/Objects-normal/x86_64/AQTColorMap.d --serialize-diagnostics /Volumes/UNIX/opt/local/var/macports/build/_Volumes_UNIX_opt_local_var_macports_sources_rsync.macports.org_release_tarballs_ports_aqua_aquaterm/aquaterm/work/AquaTerm-1.1.1/aquaterm/build/AquaTerm.build/Default/AQTFwk.build/Objects-normal/x86_64/AQTColorMap.dia -c /Volumes/UNIX/opt/local/var/macports/build/_Volumes_UNIX_opt_local_var_macports_sources_rsync.macports.org_release_tarballs_ports_aqua_aquaterm/aquaterm/work/AquaTerm-1.1.1/aquaterm/AQTColorMap.m -o /Volumes/UNIX/opt/local/var/macports/build/_Volumes_UNIX_opt_local_var_macports_sources_rsync.macports.org_release_tarballs_ports_aqua_aquaterm/aquaterm/work/AquaTerm-1.1.1/aquaterm/build/AquaTerm.build/Default/AQTFwk.build/Objects-normal/x86_64/AQTColorMap.o
206:info:build
207:info:build CompileC build/AquaTerm.build/Default/AQTFwk.build/Objects-normal/x86_64/AQTPlotBuilder.o AQTPlotBuilder.m normal x86_64 objective-c com.apple.compilers.llvm.clang.1_0.compiler
208:info:build     cd /Volumes/UNIX/opt/local/var/macports/build/_Volumes_UNIX_opt_local_var_macports_sources_rsync.macports.org_release_tarballs_ports_aqua_aquaterm/aquaterm/work/AquaTerm-1.1.1/aquaterm
209:info:build     setenv LANG en_US.US-ASCII
210:info:build     /Applications/Xcode.app/Contents/Developer/Toolchains/XcodeDefault.xctoolchain/usr/bin/clang -x objective-c -arch x86_64 -fmessage-length=0 -fdiagnostics-show-note-include-stack -fmacro-backtrace-limit=0 -Wno-trigraphs -fpascal-strings -Os -Wno-missing-field-initializers -Wno-missing-prototypes -Wno-return-type -Wno-implicit-atomic-properties -Wno-receiver-is-weak -Wno-arc-repeated-use-of-weak -Wno-missing-braces -Wparentheses -Wswitch -Wno-unused-function -Wno-unused-label -Wno-unused-parameter -Wno-unused-variable -Wunused-value -Wno-empty-body -Wno-uninitialized -Wno-unknown-pragmas -Wno-shadow -Wno-four-char-constants -Wno-conversion -Wno-constant-conversion -Wno-int-conversion -Wno-bool-conversion -Wno-enum-conversion -Wno-shorten-64-to-32 -Wpointer-sign -Wno-newline-eof -Wno-selector -Wno-strict-selector-match -Wno-undeclared-selector -Wno-deprecated-implementations -isysroot /Applications/Xcode.app/Contents/Developer/Platforms/MacOSX.platform/Developer/SDKs/MacOSX10.9.sdk -fasm-blocks -fstrict-aliasing -Wprotocol -Wdeprecated-declarations -mmacosx-version-min=10.9 -g -Wno-sign-conversion -I/Volumes/UNIX/opt/local/var/macports/build/_Volumes_UNIX_opt_local_var_macports_sources_rsync.macports.org_release_tarballs_ports_aqua_aquaterm/aquaterm/work/AquaTerm-1.1.1/aquaterm/build/AquaTerm.build/Default/AQTFwk.build/AquaTerm.hmap -I/Volumes/UNIX/opt/local/var/macports/build/_Volumes_UNIX_opt_local_var_macports_sources_rsync.macports.org_release_tarballs_ports_aqua_aquaterm/aquaterm/work/AquaTerm-1.1.1/aquaterm/build/Default/include -I/Applications/Xcode.app/Contents/Developer/Toolchains/XcodeDefault.xctoolchain/usr/include -I/Volumes/UNIX/opt/local/var/macports/build/_Volumes_UNIX_opt_local_var_macports_sources_rsync.macports.org_release_tarballs_ports_aqua_aquaterm/aquaterm/work/AquaTerm-1.1.1/aquaterm/build/AquaTerm.build/Default/AQTFwk.build/DerivedSources/x86_64 -I/Volumes/UNIX/opt/local/var/macports/build/_Volumes_UNIX_opt_local_var_macports_sources_rsync.macports.org_release_tarballs_ports_aqua_aquaterm/aquaterm/work/AquaTerm-1.1.1/aquaterm/build/AquaTerm.build/Default/AQTFwk.build/DerivedSources -Wmost -Wno-four-char-constants -Wno-unknown-pragmas -F/Volumes/UNIX/opt/local/var/macports/build/_Volumes_UNIX_opt_local_var_macports_sources_rsync.macports.org_release_tarballs_ports_aqua_aquaterm/aquaterm/work/AquaTerm-1.1.1/aquaterm/build/Default -include /var/folders/h0/hrvn66895s3flzqq1dqngg_00000gp/C/com.apple.DeveloperTools/5.0.2-5A3005/Xcode/SharedPrecompiledHeaders/AppKit-ezwogvcyoswrskbhlwcvpzntmjsn/AppKit.h -MMD -MT dependencies -MF /Volumes/UNIX/opt/local/var/macports/build/_Volumes_UNIX_opt_local_var_macports_sources_rsync.macports.org_release_tarballs_ports_aqua_aquaterm/aquaterm/work/AquaTerm-1.1.1/aquaterm/build/AquaTerm.build/Default/AQTFwk.build/Objects-normal/x86_64/AQTPlotBuilder.d --serialize-diagnostics /Volumes/UNIX/opt/local/var/macports/build/_Volumes_UNIX_opt_local_var_macports_sources_rsync.macports.org_release_tarballs_ports_aqua_aquaterm/aquaterm/work/AquaTerm-1.1.1/aquaterm/build/AquaTerm.build/Default/AQTFwk.build/Objects-normal/x86_64/AQTPlotBuilder.dia -c /Volumes/UNIX/opt/local/var/macports/build/_Volumes_UNIX_opt_local_var_macports_sources_rsync.macports.org_release_tarballs_ports_aqua_aquaterm/aquaterm/work/AquaTerm-1.1.1/aquaterm/AQTPlotBuilder.m -o /Volumes/UNIX/opt/local/var/macports/build/_Volumes_UNIX_opt_local_var_macports_sources_rsync.macports.org_release_tarballs_ports_aqua_aquaterm/aquaterm/work/AquaTerm-1.1.1/aquaterm/build/AquaTerm.build/Default/AQTFwk.build/Objects-normal/x86_64/AQTPlotBuilder.o
211:info:build
212:info:build CompileC build/AquaTerm.build/Default/AQTFwk.build/Objects-normal/x86_64/aquaterm.o aquaterm.m normal x86_64 objective-c com.apple.compilers.llvm.clang.1_0.compiler
213:info:build     cd /Volumes/UNIX/opt/local/var/macports/build/_Volumes_UNIX_opt_local_var_macports_sources_rsync.macports.org_release_tarballs_ports_aqua_aquaterm/aquaterm/work/AquaTerm-1.1.1/aquaterm
214:info:build     setenv LANG en_US.US-ASCII
215:info:build     /Applications/Xcode.app/Contents/Developer/Toolchains/XcodeDefault.xctoolchain/usr/bin/clang -x objective-c -arch x86_64 -fmessage-length=0 -fdiagnostics-show-note-include-stack -fmacro-backtrace-limit=0 -Wno-trigraphs -fpascal-strings -Os -Wno-missing-field-initializers -Wno-missing-prototypes -Wno-return-type -Wno-implicit-atomic-properties -Wno-receiver-is-weak -Wno-arc-repeated-use-of-weak -Wno-missing-braces -Wparentheses -Wswitch -Wno-unused-function -Wno-unused-label -Wno-unused-parameter -Wno-unused-variable -Wunused-value -Wno-empty-body -Wno-uninitialized -Wno-unknown-pragmas -Wno-shadow -Wno-four-char-constants -Wno-conversion -Wno-constant-conversion -Wno-int-conversion -Wno-bool-conversion -Wno-enum-conversion -Wno-shorten-64-to-32 -Wpointer-sign -Wno-newline-eof -Wno-selector -Wno-strict-selector-match -Wno-undeclared-selector -Wno-deprecated-implementations -isysroot /Applications/Xcode.app/Contents/Developer/Platforms/MacOSX.platform/Developer/SDKs/MacOSX10.9.sdk -fasm-blocks -fstrict-aliasing -Wprotocol -Wdeprecated-declarations -mmacosx-version-min=10.9 -g -Wno-sign-conversion -I/Volumes/UNIX/opt/local/var/macports/build/_Volumes_UNIX_opt_local_var_macports_sources_rsync.macports.org_release_tarballs_ports_aqua_aquaterm/aquaterm/work/AquaTerm-1.1.1/aquaterm/build/AquaTerm.build/Default/AQTFwk.build/AquaTerm.hmap -I/Volumes/UNIX/opt/local/var/macports/build/_Volumes_UNIX_opt_local_var_macports_sources_rsync.macports.org_release_tarballs_ports_aqua_aquaterm/aquaterm/work/AquaTerm-1.1.1/aquaterm/build/Default/include -I/Applications/Xcode.app/Contents/Developer/Toolchains/XcodeDefault.xctoolchain/usr/include -I/Volumes/UNIX/opt/local/var/macports/build/_Volumes_UNIX_opt_local_var_macports_sources_rsync.macports.org_release_tarballs_ports_aqua_aquaterm/aquaterm/work/AquaTerm-1.1.1/aquaterm/build/AquaTerm.build/Default/AQTFwk.build/DerivedSources/x86_64 -I/Volumes/UNIX/opt/local/var/macports/build/_Volumes_UNIX_opt_local_var_macports_sources_rsync.macports.org_release_tarballs_ports_aqua_aquaterm/aquaterm/work/AquaTerm-1.1.1/aquaterm/build/AquaTerm.build/Default/AQTFwk.build/DerivedSources -Wmost -Wno-four-char-constants -Wno-unknown-pragmas -F/Volumes/UNIX/opt/local/var/macports/build/_Volumes_UNIX_opt_local_var_macports_sources_rsync.macports.org_release_tarballs_ports_aqua_aquaterm/aquaterm/work/AquaTerm-1.1.1/aquaterm/build/Default -include /var/folders/h0/hrvn66895s3flzqq1dqngg_00000gp/C/com.apple.DeveloperTools/5.0.2-5A3005/Xcode/SharedPrecompiledHeaders/AppKit-ezwogvcyoswrskbhlwcvpzntmjsn/AppKit.h -MMD -MT dependencies -MF /Volumes/UNIX/opt/local/var/macports/build/_Volumes_UNIX_opt_local_var_macports_sources_rsync.macports.org_release_tarballs_ports_aqua_aquaterm/aquaterm/work/AquaTerm-1.1.1/aquaterm/build/AquaTerm.build/Default/AQTFwk.build/Objects-normal/x86_64/aquaterm.d --serialize-diagnostics /Volumes/UNIX/opt/local/var/macports/build/_Volumes_UNIX_opt_local_var_macports_sources_rsync.macports.org_release_tarballs_ports_aqua_aquaterm/aquaterm/work/AquaTerm-1.1.1/aquaterm/build/AquaTerm.build/Default/AQTFwk.build/Objects-normal/x86_64/aquaterm.dia -c /Volumes/UNIX/opt/local/var/macports/build/_Volumes_UNIX_opt_local_var_macports_sources_rsync.macports.org_release_tarballs_ports_aqua_aquaterm/aquaterm/work/AquaTerm-1.1.1/aquaterm/aquaterm.m -o /Volumes/UNIX/opt/local/var/macports/build/_Volumes_UNIX_opt_local_var_macports_sources_rsync.macports.org_release_tarballs_ports_aqua_aquaterm/aquaterm/work/AquaTerm-1.1.1/aquaterm/build/AquaTerm.build/Default/AQTFwk.build/Objects-normal/x86_64/aquaterm.o
216:info:build
217:info:build CompileC build/AquaTerm.build/Default/AQTFwk.build/Objects-normal/x86_64/AQTClientManager.o AQTClientManager.m normal x86_64 objective-c com.apple.compilers.llvm.clang.1_0.compiler
218:info:build     cd /Volumes/UNIX/opt/local/var/macports/build/_Volumes_UNIX_opt_local_var_macports_sources_rsync.macports.org_release_tarballs_ports_aqua_aquaterm/aquaterm/work/AquaTerm-1.1.1/aquaterm
219:info:build     setenv LANG en_US.US-ASCII
220:info:build     /Applications/Xcode.app/Contents/Developer/Toolchains/XcodeDefault.xctoolchain/usr/bin/clang -x objective-c -arch x86_64 -fmessage-length=0 -fdiagnostics-show-note-include-stack -fmacro-backtrace-limit=0 -Wno-trigraphs -fpascal-strings -Os -Wno-missing-field-initializers -Wno-missing-prototypes -Wno-return-type -Wno-implicit-atomic-properties -Wno-receiver-is-weak -Wno-arc-repeated-use-of-weak -Wno-missing-braces -Wparentheses -Wswitch -Wno-unused-function -Wno-unused-label -Wno-unused-parameter -Wno-unused-variable -Wunused-value -Wno-empty-body -Wno-uninitialized -Wno-unknown-pragmas -Wno-shadow -Wno-four-char-constants -Wno-conversion -Wno-constant-conversion -Wno-int-conversion -Wno-bool-conversion -Wno-enum-conversion -Wno-shorten-64-to-32 -Wpointer-sign -Wno-newline-eof -Wno-selector -Wno-strict-selector-match -Wno-undeclared-selector -Wno-deprecated-implementations -isysroot /Applications/Xcode.app/Contents/Developer/Platforms/MacOSX.platform/Developer/SDKs/MacOSX10.9.sdk -fasm-blocks -fstrict-aliasing -Wprotocol -Wdeprecated-declarations -mmacosx-version-min=10.9 -g -Wno-sign-conversion -I/Volumes/UNIX/opt/local/var/macports/build/_Volumes_UNIX_opt_local_var_macports_sources_rsync.macports.org_release_tarballs_ports_aqua_aquaterm/aquaterm/work/AquaTerm-1.1.1/aquaterm/build/AquaTerm.build/Default/AQTFwk.build/AquaTerm.hmap -I/Volumes/UNIX/opt/local/var/macports/build/_Volumes_UNIX_opt_local_var_macports_sources_rsync.macports.org_release_tarballs_ports_aqua_aquaterm/aquaterm/work/AquaTerm-1.1.1/aquaterm/build/Default/include -I/Applications/Xcode.app/Contents/Developer/Toolchains/XcodeDefault.xctoolchain/usr/include -I/Volumes/UNIX/opt/local/var/macports/build/_Volumes_UNIX_opt_local_var_macports_sources_rsync.macports.org_release_tarballs_ports_aqua_aquaterm/aquaterm/work/AquaTerm-1.1.1/aquaterm/build/AquaTerm.build/Default/AQTFwk.build/DerivedSources/x86_64 -I/Volumes/UNIX/opt/local/var/macports/build/_Volumes_UNIX_opt_local_var_macports_sources_rsync.macports.org_release_tarballs_ports_aqua_aquaterm/aquaterm/work/AquaTerm-1.1.1/aquaterm/build/AquaTerm.build/Default/AQTFwk.build/DerivedSources -Wmost -Wno-four-char-constants -Wno-unknown-pragmas -F/Volumes/UNIX/opt/local/var/macports/build/_Volumes_UNIX_opt_local_var_macports_sources_rsync.macports.org_release_tarballs_ports_aqua_aquaterm/aquaterm/work/AquaTerm-1.1.1/aquaterm/build/Default -include /var/folders/h0/hrvn66895s3flzqq1dqngg_00000gp/C/com.apple.DeveloperTools/5.0.2-5A3005/Xcode/SharedPrecompiledHeaders/AppKit-ezwogvcyoswrskbhlwcvpzntmjsn/AppKit.h -MMD -MT dependencies -MF /Volumes/UNIX/opt/local/var/macports/build/_Volumes_UNIX_opt_local_var_macports_sources_rsync.macports.org_release_tarballs_ports_aqua_aquaterm/aquaterm/work/AquaTerm-1.1.1/aquaterm/build/AquaTerm.build/Default/AQTFwk.build/Objects-normal/x86_64/AQTClientManager.d --serialize-diagnostics /Volumes/UNIX/opt/local/var/macports/build/_Volumes_UNIX_opt_local_var_macports_sources_rsync.macports.org_release_tarballs_ports_aqua_aquaterm/aquaterm/work/AquaTerm-1.1.1/aquaterm/build/AquaTerm.build/Default/AQTFwk.build/Objects-normal/x86_64/AQTClientManager.dia -c /Volumes/UNIX/opt/local/var/macports/build/_Volumes_UNIX_opt_local_var_macports_sources_rsync.macports.org_release_tarballs_ports_aqua_aquaterm/aquaterm/work/AquaTerm-1.1.1/aquaterm/AQTClientManager.m -o /Volumes/UNIX/opt/local/var/macports/build/_Volumes_UNIX_opt_local_var_macports_sources_rsync.macports.org_release_tarballs_ports_aqua_aquaterm/aquaterm/work/AquaTerm-1.1.1/aquaterm/build/AquaTerm.build/Default/AQTFwk.build/Objects-normal/x86_64/AQTClientManager.o
221:info:build /Volumes/UNIX/opt/local/var/macports/build/_Volumes_UNIX_opt_local_var_macports_sources_rsync.macports.org_release_tarballs_ports_aqua_aquaterm/aquaterm/work/AquaTerm-1.1.1/aquaterm/AQTClientManager.m:190:83: warning: values of type 'NSInteger' should not be used as format arguments; add an explicit cast to 'long' instead [-Wformat]
222:info:build    [self logMessage:_activePlotKey?[NSString stringWithFormat:@"Active plot: %d", [_activePlotKey integerValue]]:@"**** plot invalid ****"
223:info:build                                                                              ~~   ^~~~~~~~~~~~~~~~~~~~~~~~~~~~~
224:info:build                                                                              %ld  (long)
225:info:build /Volumes/UNIX/opt/local/var/macports/build/_Volumes_UNIX_opt_local_var_macports_sources_rsync.macports.org_release_tarballs_ports_aqua_aquaterm/aquaterm/work/AquaTerm-1.1.1/aquaterm/AQTClientManager.m:407:1: warning: conflicting distributed object modifiers on return type in implementation of 'processEvent:sender:' [-Wdistributed-object-modifiers]
226:info:build - (void)processEvent:(NSString *)event sender:(id)sender
227:info:build ^  ~~~~
228:info:build In file included from /Volumes/UNIX/opt/local/var/macports/build/_Volumes_UNIX_opt_local_var_macports_sources_rsync.macports.org_release_tarballs_ports_aqua_aquaterm/aquaterm/work/AquaTerm-1.1.1/aquaterm/AQTClientManager.m:9:
229:info:build In file included from /Volumes/UNIX/opt/local/var/macports/build/_Volumes_UNIX_opt_local_var_macports_sources_rsync.macports.org_release_tarballs_ports_aqua_aquaterm/aquaterm/work/AquaTerm-1.1.1/aquaterm/AQTClientManager.h:11:
230:info:build /Volumes/UNIX/opt/local/var/macports/build/_Volumes_UNIX_opt_local_var_macports_sources_rsync.macports.org_release_tarballs_ports_aqua_aquaterm/aquaterm/work/AquaTerm-1.1.1/aquaterm/AQTEventProtocol.h:2:1: note: previous declaration is here
231:info:build - (oneway void)processEvent:(bycopy NSString *)event sender:(id)sender;
232:info:build ^         ~~~~
233:info:build /Volumes/UNIX/opt/local/var/macports/build/_Volumes_UNIX_opt_local_var_macports_sources_rsync.macports.org_release_tarballs_ports_aqua_aquaterm/aquaterm/work/AquaTerm-1.1.1/aquaterm/AQTClientManager.m:407:34: warning: conflicting distributed object modifiers on parameter type in implementation of 'processEvent:sender:' [-Wdistributed-object-modifiers]
234:info:build - (void)processEvent:(NSString *)event sender:(id)sender
235:info:build                       ~~~~~~~~~~ ^
236:info:build In file included from /Volumes/UNIX/opt/local/var/macports/build/_Volumes_UNIX_opt_local_var_macports_sources_rsync.macports.org_release_tarballs_ports_aqua_aquaterm/aquaterm/work/AquaTerm-1.1.1/aquaterm/AQTClientManager.m:9:
237:info:build In file included from /Volumes/UNIX/opt/local/var/macports/build/_Volumes_UNIX_opt_local_var_macports_sources_rsync.macports.org_release_tarballs_ports_aqua_aquaterm/aquaterm/work/AquaTerm-1.1.1/aquaterm/AQTClientManager.h:11:
238:info:build /Volumes/UNIX/opt/local/var/macports/build/_Volumes_UNIX_opt_local_var_macports_sources_rsync.macports.org_release_tarballs_ports_aqua_aquaterm/aquaterm/work/AquaTerm-1.1.1/aquaterm/AQTEventProtocol.h:2:48: note: previous declaration is here
239:info:build - (oneway void)processEvent:(bycopy NSString *)event sender:(id)sender;
240:info:build                                     ~~~~~~~~~~ ^
241:info:build /Volumes/UNIX/opt/local/var/macports/build/_Volumes_UNIX_opt_local_var_macports_sources_rsync.macports.org_release_tarballs_ports_aqua_aquaterm/aquaterm/work/AquaTerm-1.1.1/aquaterm/AQTClientManager.m:402:1: warning: conflicting distributed object modifiers on return type in implementation of 'ping' [-Wdistributed-object-modifiers]
242:info:build - (void)ping
243:info:build ^  ~~~~
244:info:build In file included from /Volumes/UNIX/opt/local/var/macports/build/_Volumes_UNIX_opt_local_var_macports_sources_rsync.macports.org_release_tarballs_ports_aqua_aquaterm/aquaterm/work/AquaTerm-1.1.1/aquaterm/AQTClientManager.m:9:
245:info:build In file included from /Volumes/UNIX/opt/local/var/macports/build/_Volumes_UNIX_opt_local_var_macports_sources_rsync.macports.org_release_tarballs_ports_aqua_aquaterm/aquaterm/work/AquaTerm-1.1.1/aquaterm/AQTClientManager.h:11:
246:info:build /Volumes/UNIX/opt/local/var/macports/build/_Volumes_UNIX_opt_local_var_macports_sources_rsync.macports.org_release_tarballs_ports_aqua_aquaterm/aquaterm/work/AquaTerm-1.1.1/aquaterm/AQTEventProtocol.h:3:1: note: previous declaration is here
247:info:build - (oneway void)ping;
248:info:build ^         ~~~~
249:info:build 4 warnings generated.
250:info:build
251:info:build CompileC build/AquaTerm.build/Default/AQTFwk.build/Objects-normal/x86_64/AQTModel.o AQTModel.m normal x86_64 objective-c com.apple.compilers.llvm.clang.1_0.compiler
252:info:build     cd /Volumes/UNIX/opt/local/var/macports/build/_Volumes_UNIX_opt_local_var_macports_sources_rsync.macports.org_release_tarballs_ports_aqua_aquaterm/aquaterm/work/AquaTerm-1.1.1/aquaterm
253:info:build     setenv LANG en_US.US-ASCII
254:info:build     /Applications/Xcode.app/Contents/Developer/Toolchains/XcodeDefault.xctoolchain/usr/bin/clang -x objective-c -arch x86_64 -fmessage-length=0 -fdiagnostics-show-note-include-stack -fmacro-backtrace-limit=0 -Wno-trigraphs -fpascal-strings -Os -Wno-missing-field-initializers -Wno-missing-prototypes -Wno-return-type -Wno-implicit-atomic-properties -Wno-receiver-is-weak -Wno-arc-repeated-use-of-weak -Wno-missing-braces -Wparentheses -Wswitch -Wno-unused-function -Wno-unused-label -Wno-unused-parameter -Wno-unused-variable -Wunused-value -Wno-empty-body -Wno-uninitialized -Wno-unknown-pragmas -Wno-shadow -Wno-four-char-constants -Wno-conversion -Wno-constant-conversion -Wno-int-conversion -Wno-bool-conversion -Wno-enum-conversion -Wno-shorten-64-to-32 -Wpointer-sign -Wno-newline-eof -Wno-selector -Wno-strict-selector-match -Wno-undeclared-selector -Wno-deprecated-implementations -isysroot /Applications/Xcode.app/Contents/Developer/Platforms/MacOSX.platform/Developer/SDKs/MacOSX10.9.sdk -fasm-blocks -fstrict-aliasing -Wprotocol -Wdeprecated-declarations -mmacosx-version-min=10.9 -g -Wno-sign-conversion -I/Volumes/UNIX/opt/local/var/macports/build/_Volumes_UNIX_opt_local_var_macports_sources_rsync.macports.org_release_tarballs_ports_aqua_aquaterm/aquaterm/work/AquaTerm-1.1.1/aquaterm/build/AquaTerm.build/Default/AQTFwk.build/AquaTerm.hmap -I/Volumes/UNIX/opt/local/var/macports/build/_Volumes_UNIX_opt_local_var_macports_sources_rsync.macports.org_release_tarballs_ports_aqua_aquaterm/aquaterm/work/AquaTerm-1.1.1/aquaterm/build/Default/include -I/Applications/Xcode.app/Contents/Developer/Toolchains/XcodeDefault.xctoolchain/usr/include -I/Volumes/UNIX/opt/local/var/macports/build/_Volumes_UNIX_opt_local_var_macports_sources_rsync.macports.org_release_tarballs_ports_aqua_aquaterm/aquaterm/work/AquaTerm-1.1.1/aquaterm/build/AquaTerm.build/Default/AQTFwk.build/DerivedSources/x86_64 -I/Volumes/UNIX/opt/local/var/macports/build/_Volumes_UNIX_opt_local_var_macports_sources_rsync.macports.org_release_tarballs_ports_aqua_aquaterm/aquaterm/work/AquaTerm-1.1.1/aquaterm/build/AquaTerm.build/Default/AQTFwk.build/DerivedSources -Wmost -Wno-four-char-constants -Wno-unknown-pragmas -F/Volumes/UNIX/opt/local/var/macports/build/_Volumes_UNIX_opt_local_var_macports_sources_rsync.macports.org_release_tarballs_ports_aqua_aquaterm/aquaterm/work/AquaTerm-1.1.1/aquaterm/build/Default -include /var/folders/h0/hrvn66895s3flzqq1dqngg_00000gp/C/com.apple.DeveloperTools/5.0.2-5A3005/Xcode/SharedPrecompiledHeaders/AppKit-ezwogvcyoswrskbhlwcvpzntmjsn/AppKit.h -MMD -MT dependencies -MF /Volumes/UNIX/opt/local/var/macports/build/_Volumes_UNIX_opt_local_var_macports_sources_rsync.macports.org_release_tarballs_ports_aqua_aquaterm/aquaterm/work/AquaTerm-1.1.1/aquaterm/build/AquaTerm.build/Default/AQTFwk.build/Objects-normal/x86_64/AQTModel.d --serialize-diagnostics /Volumes/UNIX/opt/local/var/macports/build/_Volumes_UNIX_opt_local_var_macports_sources_rsync.macports.org_release_tarballs_ports_aqua_aquaterm/aquaterm/work/AquaTerm-1.1.1/aquaterm/build/AquaTerm.build/Default/AQTFwk.build/Objects-normal/x86_64/AQTModel.dia -c /Volumes/UNIX/opt/local/var/macports/build/_Volumes_UNIX_opt_local_var_macports_sources_rsync.macports.org_release_tarballs_ports_aqua_aquaterm/aquaterm/work/AquaTerm-1.1.1/aquaterm/AQTModel.m -o /Volumes/UNIX/opt/local/var/macports/build/_Volumes_UNIX_opt_local_var_macports_sources_rsync.macports.org_release_tarballs_ports_aqua_aquaterm/aquaterm/work/AquaTerm-1.1.1/aquaterm/build/AquaTerm.build/Default/AQTFwk.build/Objects-normal/x86_64/AQTModel.o
255:info:build /Volumes/UNIX/opt/local/var/macports/build/_Volumes_UNIX_opt_local_var_macports_sources_rsync.macports.org_release_tarballs_ports_aqua_aquaterm/aquaterm/work/AquaTerm-1.1.1/aquaterm/AQTModel.m:80:150: warning: values of type 'NSUInteger' should not be used as format arguments; add an explicit cast to 'unsigned long' instead [-Wformat]
256:info:build    return [NSString stringWithFormat:@"[AQTModel description] =\nTitle %@\nCanvasSize %@\nCount %d\nBounds %@", title, NSStringFromSize(canvasSize), [modelObjects count],  NSStringFromRect(_bounds)];
257:info:build                                                                                                 ~~                                                   ^~~~~~~~~~~~~~~~~~~~
258:info:build                                                                                                 %lu                                                  (unsigned long)
259:info:build 1 warning generated.
260:info:build
261:info:build CompileC build/AquaTerm.build/Default/AQTFwk.build/Objects-normal/x86_64/AQTPath.o AQTPath.m normal x86_64 objective-c com.apple.compilers.llvm.clang.1_0.compiler
262:info:build     cd /Volumes/UNIX/opt/local/var/macports/build/_Volumes_UNIX_opt_local_var_macports_sources_rsync.macports.org_release_tarballs_ports_aqua_aquaterm/aquaterm/work/AquaTerm-1.1.1/aquaterm
263:info:build     setenv LANG en_US.US-ASCII
264:info:build     /Applications/Xcode.app/Contents/Developer/Toolchains/XcodeDefault.xctoolchain/usr/bin/clang -x objective-c -arch x86_64 -fmessage-length=0 -fdiagnostics-show-note-include-stack -fmacro-backtrace-limit=0 -Wno-trigraphs -fpascal-strings -Os -Wno-missing-field-initializers -Wno-missing-prototypes -Wno-return-type -Wno-implicit-atomic-properties -Wno-receiver-is-weak -Wno-arc-repeated-use-of-weak -Wno-missing-braces -Wparentheses -Wswitch -Wno-unused-function -Wno-unused-label -Wno-unused-parameter -Wno-unused-variable -Wunused-value -Wno-empty-body -Wno-uninitialized -Wno-unknown-pragmas -Wno-shadow -Wno-four-char-constants -Wno-conversion -Wno-constant-conversion -Wno-int-conversion -Wno-bool-conversion -Wno-enum-conversion -Wno-shorten-64-to-32 -Wpointer-sign -Wno-newline-eof -Wno-selector -Wno-strict-selector-match -Wno-undeclared-selector -Wno-deprecated-implementations -isysroot /Applications/Xcode.app/Contents/Developer/Platforms/MacOSX.platform/Developer/SDKs/MacOSX10.9.sdk -fasm-blocks -fstrict-aliasing -Wprotocol -Wdeprecated-declarations -mmacosx-version-min=10.9 -g -Wno-sign-conversion -I/Volumes/UNIX/opt/local/var/macports/build/_Volumes_UNIX_opt_local_var_macports_sources_rsync.macports.org_release_tarballs_ports_aqua_aquaterm/aquaterm/work/AquaTerm-1.1.1/aquaterm/build/AquaTerm.build/Default/AQTFwk.build/AquaTerm.hmap -I/Volumes/UNIX/opt/local/var/macports/build/_Volumes_UNIX_opt_local_var_macports_sources_rsync.macports.org_release_tarballs_ports_aqua_aquaterm/aquaterm/work/AquaTerm-1.1.1/aquaterm/build/Default/include -I/Applications/Xcode.app/Contents/Developer/Toolchains/XcodeDefault.xctoolchain/usr/include -I/Volumes/UNIX/opt/local/var/macports/build/_Volumes_UNIX_opt_local_var_macports_sources_rsync.macports.org_release_tarballs_ports_aqua_aquaterm/aquaterm/work/AquaTerm-1.1.1/aquaterm/build/AquaTerm.build/Default/AQTFwk.build/DerivedSources/x86_64 -I/Volumes/UNIX/opt/local/var/macports/build/_Volumes_UNIX_opt_local_var_macports_sources_rsync.macports.org_release_tarballs_ports_aqua_aquaterm/aquaterm/work/AquaTerm-1.1.1/aquaterm/build/AquaTerm.build/Default/AQTFwk.build/DerivedSources -Wmost -Wno-four-char-constants -Wno-unknown-pragmas -F/Volumes/UNIX/opt/local/var/macports/build/_Volumes_UNIX_opt_local_var_macports_sources_rsync.macports.org_release_tarballs_ports_aqua_aquaterm/aquaterm/work/AquaTerm-1.1.1/aquaterm/build/Default -include /var/folders/h0/hrvn66895s3flzqq1dqngg_00000gp/C/com.apple.DeveloperTools/5.0.2-5A3005/Xcode/SharedPrecompiledHeaders/AppKit-ezwogvcyoswrskbhlwcvpzntmjsn/AppKit.h -MMD -MT dependencies -MF /Volumes/UNIX/opt/local/var/macports/build/_Volumes_UNIX_opt_local_var_macports_sources_rsync.macports.org_release_tarballs_ports_aqua_aquaterm/aquaterm/work/AquaTerm-1.1.1/aquaterm/build/AquaTerm.build/Default/AQTFwk.build/Objects-normal/x86_64/AQTPath.d --serialize-diagnostics /Volumes/UNIX/opt/local/var/macports/build/_Volumes_UNIX_opt_local_var_macports_sources_rsync.macports.org_release_tarballs_ports_aqua_aquaterm/aquaterm/work/AquaTerm-1.1.1/aquaterm/build/AquaTerm.build/Default/AQTFwk.build/Objects-normal/x86_64/AQTPath.dia -c /Volumes/UNIX/opt/local/var/macports/build/_Volumes_UNIX_opt_local_var_macports_sources_rsync.macports.org_release_tarballs_ports_aqua_aquaterm/aquaterm/work/AquaTerm-1.1.1/aquaterm/AQTPath.m -o /Volumes/UNIX/opt/local/var/macports/build/_Volumes_UNIX_opt_local_var_macports_sources_rsync.macports.org_release_tarballs_ports_aqua_aquaterm/aquaterm/work/AquaTerm-1.1.1/aquaterm/build/AquaTerm.build/Default/AQTFwk.build/Objects-normal/x86_64/AQTPath.o
265:info:build /Volumes/UNIX/opt/local/var/macports/build/_Volumes_UNIX_opt_local_var_macports_sources_rsync.macports.org_release_tarballs_ports_aqua_aquaterm/aquaterm/work/AquaTerm-1.1.1/aquaterm/AQTPath.m:21:27: warning: using the result of an assignment as a condition without parentheses [-Wparentheses]
266:info:build       if(dynamicPathStore = malloc(pc * sizeof(NSPoint)))
267:info:build          ~~~~~~~~~~~~~~~~~^~~~~~~~~~~~~~~~~~~~~~~~~~~~~~
268:info:build /Volumes/UNIX/opt/local/var/macports/build/_Volumes_UNIX_opt_local_var_macports_sources_rsync.macports.org_release_tarballs_ports_aqua_aquaterm/aquaterm/work/AquaTerm-1.1.1/aquaterm/AQTPath.m:21:27: note: place parentheses around the assignment to silence this warning
269:info:build       if(dynamicPathStore = malloc(pc * sizeof(NSPoint)))
270:info:build                           ^
271:info:build          (                                              )
272:info:build /Volumes/UNIX/opt/local/var/macports/build/_Volumes_UNIX_opt_local_var_macports_sources_rsync.macports.org_release_tarballs_ports_aqua_aquaterm/aquaterm/work/AquaTerm-1.1.1/aquaterm/AQTPath.m:21:27: note: use '==' to turn this assignment into an equality comparison
273:info:build       if(dynamicPathStore = malloc(pc * sizeof(NSPoint)))
274:info:build                           ^
275:info:build                           ==
276:info:build 1 warning generated.
277:info:build
278:info:build CompileC build/AquaTerm.build/Default/AQTFwk.build/Objects-normal/x86_64/AQTConstants.o AQTConstants.m normal x86_64 objective-c com.apple.compilers.llvm.clang.1_0.compiler
279:info:build     cd /Volumes/UNIX/opt/local/var/macports/build/_Volumes_UNIX_opt_local_var_macports_sources_rsync.macports.org_release_tarballs_ports_aqua_aquaterm/aquaterm/work/AquaTerm-1.1.1/aquaterm
280:info:build     setenv LANG en_US.US-ASCII
281:info:build     /Applications/Xcode.app/Contents/Developer/Toolchains/XcodeDefault.xctoolchain/usr/bin/clang -x objective-c -arch x86_64 -fmessage-length=0 -fdiagnostics-show-note-include-stack -fmacro-backtrace-limit=0 -Wno-trigraphs -fpascal-strings -Os -Wno-missing-field-initializers -Wno-missing-prototypes -Wno-return-type -Wno-implicit-atomic-properties -Wno-receiver-is-weak -Wno-arc-repeated-use-of-weak -Wno-missing-braces -Wparentheses -Wswitch -Wno-unused-function -Wno-unused-label -Wno-unused-parameter -Wno-unused-variable -Wunused-value -Wno-empty-body -Wno-uninitialized -Wno-unknown-pragmas -Wno-shadow -Wno-four-char-constants -Wno-conversion -Wno-constant-conversion -Wno-int-conversion -Wno-bool-conversion -Wno-enum-conversion -Wno-shorten-64-to-32 -Wpointer-sign -Wno-newline-eof -Wno-selector -Wno-strict-selector-match -Wno-undeclared-selector -Wno-deprecated-implementations -isysroot /Applications/Xcode.app/Contents/Developer/Platforms/MacOSX.platform/Developer/SDKs/MacOSX10.9.sdk -fasm-blocks -fstrict-aliasing -Wprotocol -Wdeprecated-declarations -mmacosx-version-min=10.9 -g -Wno-sign-conversion -I/Volumes/UNIX/opt/local/var/macports/build/_Volumes_UNIX_opt_local_var_macports_sources_rsync.macports.org_release_tarballs_ports_aqua_aquaterm/aquaterm/work/AquaTerm-1.1.1/aquaterm/build/AquaTerm.build/Default/AQTFwk.build/AquaTerm.hmap -I/Volumes/UNIX/opt/local/var/macports/build/_Volumes_UNIX_opt_local_var_macports_sources_rsync.macports.org_release_tarballs_ports_aqua_aquaterm/aquaterm/work/AquaTerm-1.1.1/aquaterm/build/Default/include -I/Applications/Xcode.app/Contents/Developer/Toolchains/XcodeDefault.xctoolchain/usr/include -I/Volumes/UNIX/opt/local/var/macports/build/_Volumes_UNIX_opt_local_var_macports_sources_rsync.macports.org_release_tarballs_ports_aqua_aquaterm/aquaterm/work/AquaTerm-1.1.1/aquaterm/build/AquaTerm.build/Default/AQTFwk.build/DerivedSources/x86_64 -I/Volumes/UNIX/opt/local/var/macports/build/_Volumes_UNIX_opt_local_var_macports_sources_rsync.macports.org_release_tarballs_ports_aqua_aquaterm/aquaterm/work/AquaTerm-1.1.1/aquaterm/build/AquaTerm.build/Default/AQTFwk.build/DerivedSources -Wmost -Wno-four-char-constants -Wno-unknown-pragmas -F/Volumes/UNIX/opt/local/var/macports/build/_Volumes_UNIX_opt_local_var_macports_sources_rsync.macports.org_release_tarballs_ports_aqua_aquaterm/aquaterm/work/AquaTerm-1.1.1/aquaterm/build/Default -include /var/folders/h0/hrvn66895s3flzqq1dqngg_00000gp/C/com.apple.DeveloperTools/5.0.2-5A3005/Xcode/SharedPrecompiledHeaders/AppKit-ezwogvcyoswrskbhlwcvpzntmjsn/AppKit.h -MMD -MT dependencies -MF /Volumes/UNIX/opt/local/var/macports/build/_Volumes_UNIX_opt_local_var_macports_sources_rsync.macports.org_release_tarballs_ports_aqua_aquaterm/aquaterm/work/AquaTerm-1.1.1/aquaterm/build/AquaTerm.build/Default/AQTFwk.build/Objects-normal/x86_64/AQTConstants.d --serialize-diagnostics /Volumes/UNIX/opt/local/var/macports/build/_Volumes_UNIX_opt_local_var_macports_sources_rsync.macports.org_release_tarballs_ports_aqua_aquaterm/aquaterm/work/AquaTerm-1.1.1/aquaterm/build/AquaTerm.build/Default/AQTFwk.build/Objects-normal/x86_64/AQTConstants.dia -c /Volumes/UNIX/opt/local/var/macports/build/_Volumes_UNIX_opt_local_var_macports_sources_rsync.macports.org_release_tarballs_ports_aqua_aquaterm/aquaterm/work/AquaTerm-1.1.1/aquaterm/AQTConstants.m -o /Volumes/UNIX/opt/local/var/macports/build/_Volumes_UNIX_opt_local_var_macports_sources_rsync.macports.org_release_tarballs_ports_aqua_aquaterm/aquaterm/work/AquaTerm-1.1.1/aquaterm/build/AquaTerm.build/Default/AQTFwk.build/Objects-normal/x86_64/AQTConstants.o
282:info:build
283:info:build CompileC build/AquaTerm.build/Default/AQTFwk.build/Objects-normal/x86_64/AQTFunctions.o AQTFunctions.m normal x86_64 objective-c com.apple.compilers.llvm.clang.1_0.compiler
284:info:build     cd /Volumes/UNIX/opt/local/var/macports/build/_Volumes_UNIX_opt_local_var_macports_sources_rsync.macports.org_release_tarballs_ports_aqua_aquaterm/aquaterm/work/AquaTerm-1.1.1/aquaterm
285:info:build     setenv LANG en_US.US-ASCII
286:info:build     /Applications/Xcode.app/Contents/Developer/Toolchains/XcodeDefault.xctoolchain/usr/bin/clang -x objective-c -arch x86_64 -fmessage-length=0 -fdiagnostics-show-note-include-stack -fmacro-backtrace-limit=0 -Wno-trigraphs -fpascal-strings -Os -Wno-missing-field-initializers -Wno-missing-prototypes -Wno-return-type -Wno-implicit-atomic-properties -Wno-receiver-is-weak -Wno-arc-repeated-use-of-weak -Wno-missing-braces -Wparentheses -Wswitch -Wno-unused-function -Wno-unused-label -Wno-unused-parameter -Wno-unused-variable -Wunused-value -Wno-empty-body -Wno-uninitialized -Wno-unknown-pragmas -Wno-shadow -Wno-four-char-constants -Wno-conversion -Wno-constant-conversion -Wno-int-conversion -Wno-bool-conversion -Wno-enum-conversion -Wno-shorten-64-to-32 -Wpointer-sign -Wno-newline-eof -Wno-selector -Wno-strict-selector-match -Wno-undeclared-selector -Wno-deprecated-implementations -isysroot /Applications/Xcode.app/Contents/Developer/Platforms/MacOSX.platform/Developer/SDKs/MacOSX10.9.sdk -fasm-blocks -fstrict-aliasing -Wprotocol -Wdeprecated-declarations -mmacosx-version-min=10.9 -g -Wno-sign-conversion -I/Volumes/UNIX/opt/local/var/macports/build/_Volumes_UNIX_opt_local_var_macports_sources_rsync.macports.org_release_tarballs_ports_aqua_aquaterm/aquaterm/work/AquaTerm-1.1.1/aquaterm/build/AquaTerm.build/Default/AQTFwk.build/AquaTerm.hmap -I/Volumes/UNIX/opt/local/var/macports/build/_Volumes_UNIX_opt_local_var_macports_sources_rsync.macports.org_release_tarballs_ports_aqua_aquaterm/aquaterm/work/AquaTerm-1.1.1/aquaterm/build/Default/include -I/Applications/Xcode.app/Contents/Developer/Toolchains/XcodeDefault.xctoolchain/usr/include -I/Volumes/UNIX/opt/local/var/macports/build/_Volumes_UNIX_opt_local_var_macports_sources_rsync.macports.org_release_tarballs_ports_aqua_aquaterm/aquaterm/work/AquaTerm-1.1.1/aquaterm/build/AquaTerm.build/Default/AQTFwk.build/DerivedSources/x86_64 -I/Volumes/UNIX/opt/local/var/macports/build/_Volumes_UNIX_opt_local_var_macports_sources_rsync.macports.org_release_tarballs_ports_aqua_aquaterm/aquaterm/work/AquaTerm-1.1.1/aquaterm/build/AquaTerm.build/Default/AQTFwk.build/DerivedSources -Wmost -Wno-four-char-constants -Wno-unknown-pragmas -F/Volumes/UNIX/opt/local/var/macports/build/_Volumes_UNIX_opt_local_var_macports_sources_rsync.macports.org_release_tarballs_ports_aqua_aquaterm/aquaterm/work/AquaTerm-1.1.1/aquaterm/build/Default -include /var/folders/h0/hrvn66895s3flzqq1dqngg_00000gp/C/com.apple.DeveloperTools/5.0.2-5A3005/Xcode/SharedPrecompiledHeaders/AppKit-ezwogvcyoswrskbhlwcvpzntmjsn/AppKit.h -MMD -MT dependencies -MF /Volumes/UNIX/opt/local/var/macports/build/_Volumes_UNIX_opt_local_var_macports_sources_rsync.macports.org_release_tarballs_ports_aqua_aquaterm/aquaterm/work/AquaTerm-1.1.1/aquaterm/build/AquaTerm.build/Default/AQTFwk.build/Objects-normal/x86_64/AQTFunctions.d --serialize-diagnostics /Volumes/UNIX/opt/local/var/macports/build/_Volumes_UNIX_opt_local_var_macports_sources_rsync.macports.org_release_tarballs_ports_aqua_aquaterm/aquaterm/work/AquaTerm-1.1.1/aquaterm/build/AquaTerm.build/Default/AQTFwk.build/Objects-normal/x86_64/AQTFunctions.dia -c /Volumes/UNIX/opt/local/var/macports/build/_Volumes_UNIX_opt_local_var_macports_sources_rsync.macports.org_release_tarballs_ports_aqua_aquaterm/aquaterm/work/AquaTerm-1.1.1/aquaterm/AQTFunctions.m -o /Volumes/UNIX/opt/local/var/macports/build/_Volumes_UNIX_opt_local_var_macports_sources_rsync.macports.org_release_tarballs_ports_aqua_aquaterm/aquaterm/work/AquaTerm-1.1.1/aquaterm/build/AquaTerm.build/Default/AQTFwk.build/Objects-normal/x86_64/AQTFunctions.o
287:info:build
288:info:build Ld build/Default/AquaTerm.framework/Versions/A/AquaTerm normal x86_64
289:info:build     cd /Volumes/UNIX/opt/local/var/macports/build/_Volumes_UNIX_opt_local_var_macports_sources_rsync.macports.org_release_tarballs_ports_aqua_aquaterm/aquaterm/work/AquaTerm-1.1.1/aquaterm
290:info:build     setenv MACOSX_DEPLOYMENT_TARGET 10.9
291:info:build     /Applications/Xcode.app/Contents/Developer/Toolchains/XcodeDefault.xctoolchain/usr/bin/clang -arch x86_64 -dynamiclib -isysroot /Applications/Xcode.app/Contents/Developer/Platforms/MacOSX.platform/Developer/SDKs/MacOSX10.9.sdk -L/Volumes/UNIX/opt/local/var/macports/build/_Volumes_UNIX_opt_local_var_macports_sources_rsync.macports.org_release_tarballs_ports_aqua_aquaterm/aquaterm/work/AquaTerm-1.1.1/aquaterm/build/Default -F/Volumes/UNIX/opt/local/var/macports/build/_Volumes_UNIX_opt_local_var_macports_sources_rsync.macports.org_release_tarballs_ports_aqua_aquaterm/aquaterm/work/AquaTerm-1.1.1/aquaterm/build/Default -filelist /Volumes/UNIX/opt/local/var/macports/build/_Volumes_UNIX_opt_local_var_macports_sources_rsync.macports.org_release_tarballs_ports_aqua_aquaterm/aquaterm/work/AquaTerm-1.1.1/aquaterm/build/AquaTerm.build/Default/AQTFwk.build/Objects-normal/x86_64/AquaTerm.LinkFileList -install_name /Volumes/UNIX/opt/local/Library/Frameworks/AquaTerm.framework/Versions/A/AquaTerm -mmacosx-version-min=10.9 -framework Foundation -framework AppKit -fobjc-link-runtime -single_module -compatibility_version 1 -current_version 1 -Xlinker -dependency_info -Xlinker /Volumes/UNIX/opt/local/var/macports/build/_Volumes_UNIX_opt_local_var_macports_sources_rsync.macports.org_release_tarballs_ports_aqua_aquaterm/aquaterm/work/AquaTerm-1.1.1/aquaterm/build/AquaTerm.build/Default/AQTFwk.build/Objects-normal/x86_64/AquaTerm_dependency_info.dat -o /Volumes/UNIX/opt/local/var/macports/build/_Volumes_UNIX_opt_local_var_macports_sources_rsync.macports.org_release_tarballs_ports_aqua_aquaterm/aquaterm/work/AquaTerm-1.1.1/aquaterm/build/Default/AquaTerm.framework/Versions/A/AquaTerm
292:info:build
293:info:build Touch build/Default/AquaTerm.framework
294:info:build     cd /Volumes/UNIX/opt/local/var/macports/build/_Volumes_UNIX_opt_local_var_macports_sources_rsync.macports.org_release_tarballs_ports_aqua_aquaterm/aquaterm/work/AquaTerm-1.1.1/aquaterm
295:info:build     /usr/bin/touch -c /Volumes/UNIX/opt/local/var/macports/build/_Volumes_UNIX_opt_local_var_macports_sources_rsync.macports.org_release_tarballs_ports_aqua_aquaterm/aquaterm/work/AquaTerm-1.1.1/aquaterm/build/Default/AquaTerm.framework
296:info:build
297:info:build === BUILD TARGET AquaTerm OF PROJECT AquaTerm WITH CONFIGURATION Default ===
298:info:build
299:info:build Check dependencies
300:info:build Warning: Multiple build commands for output file /Volumes/UNIX/opt/local/var/macports/build/_Volumes_UNIX_opt_local_var_macports_sources_rsync.macports.org_release_tarballs_ports_aqua_aquaterm/aquaterm/work/AquaTerm-1.1.1/aquaterm/build/Default/AquaTerm.app/Contents/Resources/help.html
301:info:build
302:info:build Create product structure
303:info:build /bin/mkdir -p /Volumes/UNIX/opt/local/var/macports/build/_Volumes_UNIX_opt_local_var_macports_sources_rsync.macports.org_release_tarballs_ports_aqua_aquaterm/aquaterm/work/AquaTerm-1.1.1/aquaterm/build/Default/AquaTerm.app/Contents
304:info:build /bin/mkdir -p /Volumes/UNIX/opt/local/var/macports/build/_Volumes_UNIX_opt_local_var_macports_sources_rsync.macports.org_release_tarballs_ports_aqua_aquaterm/aquaterm/work/AquaTerm-1.1.1/aquaterm/build/Default/AquaTerm.app/Contents/MacOS
305:info:build /bin/mkdir -p /Volumes/UNIX/opt/local/var/macports/build/_Volumes_UNIX_opt_local_var_macports_sources_rsync.macports.org_release_tarballs_ports_aqua_aquaterm/aquaterm/work/AquaTerm-1.1.1/aquaterm/build/Default/AquaTerm.app/Contents/Resources
306:info:build
307:info:build ProcessInfoPlistFile build/Default/AquaTerm.app/Contents/Info.plist AquaTerm.app-Info.plist
308:info:build     cd /Volumes/UNIX/opt/local/var/macports/build/_Volumes_UNIX_opt_local_var_macports_sources_rsync.macports.org_release_tarballs_ports_aqua_aquaterm/aquaterm/work/AquaTerm-1.1.1/aquaterm
309:info:build     builtin-infoPlistUtility /Volumes/UNIX/opt/local/var/macports/build/_Volumes_UNIX_opt_local_var_macports_sources_rsync.macports.org_release_tarballs_ports_aqua_aquaterm/aquaterm/work/AquaTerm-1.1.1/aquaterm/AquaTerm.app-Info.plist -genpkginfo /Volumes/UNIX/opt/local/var/macports/build/_Volumes_UNIX_opt_local_var_macports_sources_rsync.macports.org_release_tarballs_ports_aqua_aquaterm/aquaterm/work/AquaTerm-1.1.1/aquaterm/build/Default/AquaTerm.app/Contents/PkgInfo -expandbuildsettings -platform macosx -o /Volumes/UNIX/opt/local/var/macports/build/_Volumes_UNIX_opt_local_var_macports_sources_rsync.macports.org_release_tarballs_ports_aqua_aquaterm/aquaterm/work/AquaTerm-1.1.1/aquaterm/build/Default/AquaTerm.app/Contents/Info.plist
310:info:build
311:info:build CpResource English.lproj/Credits.rtf build/Default/AquaTerm.app/Contents/Resources/English.lproj/Credits.rtf
312:info:build     cd /Volumes/UNIX/opt/local/var/macports/build/_Volumes_UNIX_opt_local_var_macports_sources_rsync.macports.org_release_tarballs_ports_aqua_aquaterm/aquaterm/work/AquaTerm-1.1.1/aquaterm
313:info:build     builtin-copy -exclude .DS_Store -exclude CVS -exclude .svn -exclude .git -exclude .hg -resolve-src-symlinks /Volumes/UNIX/opt/local/var/macports/build/_Volumes_UNIX_opt_local_var_macports_sources_rsync.macports.org_release_tarballs_ports_aqua_aquaterm/aquaterm/work/AquaTerm-1.1.1/aquaterm/English.lproj/Credits.rtf /Volumes/UNIX/opt/local/var/macports/build/_Volumes_UNIX_opt_local_var_macports_sources_rsync.macports.org_release_tarballs_ports_aqua_aquaterm/aquaterm/work/AquaTerm-1.1.1/aquaterm/build/Default/AquaTerm.app/Contents/Resources/English.lproj
314:info:build
315:info:build StripNIB English.lproj/MainMenu1.nib
316:info:build     cd /Volumes/UNIX/opt/local/var/macports/build/_Volumes_UNIX_opt_local_var_macports_sources_rsync.macports.org_release_tarballs_ports_aqua_aquaterm/aquaterm/work/AquaTerm-1.1.1/aquaterm
317:info:build     setenv XCODE_DEVELOPER_USR_PATH /Applications/Xcode.app/Contents/Developer/usr/bin/..
318:info:build     /Applications/Xcode.app/Contents/Developer/usr/bin/ibtool --strip /Volumes/UNIX/opt/local/var/macports/build/_Volumes_UNIX_opt_local_var_macports_sources_rsync.macports.org_release_tarballs_ports_aqua_aquaterm/aquaterm/work/AquaTerm-1.1.1/aquaterm/build/Default/AquaTerm.app/Contents/Resources/English.lproj/MainMenu1.nib --output-format human-readable-text /Volumes/UNIX/opt/local/var/macports/build/_Volumes_UNIX_opt_local_var_macports_sources_rsync.macports.org_release_tarballs_ports_aqua_aquaterm/aquaterm/work/AquaTerm-1.1.1/aquaterm/English.lproj/MainMenu1.nib
319:info:build /* com.apple.ibtool.errors */
320:info:build /Volumes/UNIX/opt/local/var/macports/build/_Volumes_UNIX_opt_local_var_macports_sources_rsync.macports.org_release_tarballs_ports_aqua_aquaterm/aquaterm/work/AquaTerm-1.1.1/aquaterm/English.lproj/MainMenu1.nib: error: ibtool could not strip "MainMenu1.nib" because it could not write to the path "/Volumes/UNIX/opt/local/var/macports/build/_Volumes_UNIX_opt_local_var_macports_sources_rsync.macports.org_release_tarballs_ports_aqua_aquaterm/aquaterm/work/AquaTerm-1.1.1/aquaterm/build/Default/AquaTerm.app/Contents/Resources/English.lproj/MainMenu1.nib".
321:info:build
322:info:build StripNIB English.lproj/ColorInspector.nib
323:info:build     cd /Volumes/UNIX/opt/local/var/macports/build/_Volumes_UNIX_opt_local_var_macports_sources_rsync.macports.org_release_tarballs_ports_aqua_aquaterm/aquaterm/work/AquaTerm-1.1.1/aquaterm
324:info:build     setenv XCODE_DEVELOPER_USR_PATH /Applications/Xcode.app/Contents/Developer/usr/bin/..
325:info:build     /Applications/Xcode.app/Contents/Developer/usr/bin/ibtool --strip /Volumes/UNIX/opt/local/var/macports/build/_Volumes_UNIX_opt_local_var_macports_sources_rsync.macports.org_release_tarballs_ports_aqua_aquaterm/aquaterm/work/AquaTerm-1.1.1/aquaterm/build/Default/AquaTerm.app/Contents/Resources/ColorInspector.nib --output-format human-readable-text /Volumes/UNIX/opt/local/var/macports/build/_Volumes_UNIX_opt_local_var_macports_sources_rsync.macports.org_release_tarballs_ports_aqua_aquaterm/aquaterm/work/AquaTerm-1.1.1/aquaterm/English.lproj/ColorInspector.nib
326:info:build /* com.apple.ibtool.errors */
327:info:build /Volumes/UNIX/opt/local/var/macports/build/_Volumes_UNIX_opt_local_var_macports_sources_rsync.macports.org_release_tarballs_ports_aqua_aquaterm/aquaterm/work/AquaTerm-1.1.1/aquaterm/English.lproj/ColorInspector.nib: error: ibtool could not strip "ColorInspector.nib" because it could not write to the path "/Volumes/UNIX/opt/local/var/macports/build/_Volumes_UNIX_opt_local_var_macports_sources_rsync.macports.org_release_tarballs_ports_aqua_aquaterm/aquaterm/work/AquaTerm-1.1.1/aquaterm/build/Default/AquaTerm.app/Contents/Resources/ColorInspector.nib".
328:info:build
329:info:build StripNIB English.lproj/ExtendSavePanel.nib
330:info:build     cd /Volumes/UNIX/opt/local/var/macports/build/_Volumes_UNIX_opt_local_var_macports_sources_rsync.macports.org_release_tarballs_ports_aqua_aquaterm/aquaterm/work/AquaTerm-1.1.1/aquaterm
331:info:build     setenv XCODE_DEVELOPER_USR_PATH /Applications/Xcode.app/Contents/Developer/usr/bin/..
332:info:build     /Applications/Xcode.app/Contents/Developer/usr/bin/ibtool --strip /Volumes/UNIX/opt/local/var/macports/build/_Volumes_UNIX_opt_local_var_macports_sources_rsync.macports.org_release_tarballs_ports_aqua_aquaterm/aquaterm/work/AquaTerm-1.1.1/aquaterm/build/Default/AquaTerm.app/Contents/Resources/ExtendSavePanel.nib --output-format human-readable-text /Volumes/UNIX/opt/local/var/macports/build/_Volumes_UNIX_opt_local_var_macports_sources_rsync.macports.org_release_tarballs_ports_aqua_aquaterm/aquaterm/work/AquaTerm-1.1.1/aquaterm/English.lproj/ExtendSavePanel.nib
333:info:build /* com.apple.ibtool.errors */
334:info:build /Volumes/UNIX/opt/local/var/macports/build/_Volumes_UNIX_opt_local_var_macports_sources_rsync.macports.org_release_tarballs_ports_aqua_aquaterm/aquaterm/work/AquaTerm-1.1.1/aquaterm/English.lproj/ExtendSavePanel.nib: error: ibtool could not strip "ExtendSavePanel.nib" because it could not write to the path "/Volumes/UNIX/opt/local/var/macports/build/_Volumes_UNIX_opt_local_var_macports_sources_rsync.macports.org_release_tarballs_ports_aqua_aquaterm/aquaterm/work/AquaTerm-1.1.1/aquaterm/build/Default/AquaTerm.app/Contents/Resources/ExtendSavePanel.nib".
335:info:build
336:info:build CpResource English.lproj/AquaTerm.icns build/Default/AquaTerm.app/Contents/Resources/English.lproj/AquaTerm.icns
337:info:build     cd /Volumes/UNIX/opt/local/var/macports/build/_Volumes_UNIX_opt_local_var_macports_sources_rsync.macports.org_release_tarballs_ports_aqua_aquaterm/aquaterm/work/AquaTerm-1.1.1/aquaterm
338:info:build     builtin-copy -exclude .DS_Store -exclude CVS -exclude .svn -exclude .git -exclude .hg -resolve-src-symlinks /Volumes/UNIX/opt/local/var/macports/build/_Volumes_UNIX_opt_local_var_macports_sources_rsync.macports.org_release_tarballs_ports_aqua_aquaterm/aquaterm/work/AquaTerm-1.1.1/aquaterm/English.lproj/AquaTerm.icns /Volumes/UNIX/opt/local/var/macports/build/_Volumes_UNIX_opt_local_var_macports_sources_rsync.macports.org_release_tarballs_ports_aqua_aquaterm/aquaterm/work/AquaTerm-1.1.1/aquaterm/build/Default/AquaTerm.app/Contents/Resources/English.lproj
339:info:build
340:info:build StripNIB English.lproj/AQTWindow.nib
341:info:build     cd /Volumes/UNIX/opt/local/var/macports/build/_Volumes_UNIX_opt_local_var_macports_sources_rsync.macports.org_release_tarballs_ports_aqua_aquaterm/aquaterm/work/AquaTerm-1.1.1/aquaterm
342:info:build     setenv XCODE_DEVELOPER_USR_PATH /Applications/Xcode.app/Contents/Developer/usr/bin/..
343:info:build     /Applications/Xcode.app/Contents/Developer/usr/bin/ibtool --strip /Volumes/UNIX/opt/local/var/macports/build/_Volumes_UNIX_opt_local_var_macports_sources_rsync.macports.org_release_tarballs_ports_aqua_aquaterm/aquaterm/work/AquaTerm-1.1.1/aquaterm/build/Default/AquaTerm.app/Contents/Resources/English.lproj/AQTWindow.nib --output-format human-readable-text /Volumes/UNIX/opt/local/var/macports/build/_Volumes_UNIX_opt_local_var_macports_sources_rsync.macports.org_release_tarballs_ports_aqua_aquaterm/aquaterm/work/AquaTerm-1.1.1/aquaterm/English.lproj/AQTWindow.nib
344:info:build /* com.apple.ibtool.errors */
345:info:build /Volumes/UNIX/opt/local/var/macports/build/_Volumes_UNIX_opt_local_var_macports_sources_rsync.macports.org_release_tarballs_ports_aqua_aquaterm/aquaterm/work/AquaTerm-1.1.1/aquaterm/English.lproj/AQTWindow.nib: error: ibtool could not strip "AQTWindow.nib" because it could not write to the path "/Volumes/UNIX/opt/local/var/macports/build/_Volumes_UNIX_opt_local_var_macports_sources_rsync.macports.org_release_tarballs_ports_aqua_aquaterm/aquaterm/work/AquaTerm-1.1.1/aquaterm/build/Default/AquaTerm.app/Contents/Resources/English.lproj/AQTWindow.nib".
346:info:build
347:info:build CpResource ReleaseNotes build/Default/AquaTerm.app/Contents/Resources/ReleaseNotes
348:info:build     cd /Volumes/UNIX/opt/local/var/macports/build/_Volumes_UNIX_opt_local_var_macports_sources_rsync.macports.org_release_tarballs_ports_aqua_aquaterm/aquaterm/work/AquaTerm-1.1.1/aquaterm
349:info:build     builtin-copy -exclude .DS_Store -exclude CVS -exclude .svn -exclude .git -exclude .hg -resolve-src-symlinks /Volumes/UNIX/opt/local/var/macports/build/_Volumes_UNIX_opt_local_var_macports_sources_rsync.macports.org_release_tarballs_ports_aqua_aquaterm/aquaterm/work/AquaTerm-1.1.1/aquaterm/ReleaseNotes /Volumes/UNIX/opt/local/var/macports/build/_Volumes_UNIX_opt_local_var_macports_sources_rsync.macports.org_release_tarballs_ports_aqua_aquaterm/aquaterm/work/AquaTerm-1.1.1/aquaterm/build/Default/AquaTerm.app/Contents/Resources
350:info:build
351:info:build CpResource Help/AQTAdapter.html build/Default/AquaTerm.app/Contents/Resources/AQTAdapter.html
352:info:build     cd /Volumes/UNIX/opt/local/var/macports/build/_Volumes_UNIX_opt_local_var_macports_sources_rsync.macports.org_release_tarballs_ports_aqua_aquaterm/aquaterm/work/AquaTerm-1.1.1/aquaterm
353:info:build     builtin-copy -exclude .DS_Store -exclude CVS -exclude .svn -exclude .git -exclude .hg -resolve-src-symlinks /Volumes/UNIX/opt/local/var/macports/build/_Volumes_UNIX_opt_local_var_macports_sources_rsync.macports.org_release_tarballs_ports_aqua_aquaterm/aquaterm/work/AquaTerm-1.1.1/aquaterm/Help/AQTAdapter.html /Volumes/UNIX/opt/local/var/macports/build/_Volumes_UNIX_opt_local_var_macports_sources_rsync.macports.org_release_tarballs_ports_aqua_aquaterm/aquaterm/work/AquaTerm-1.1.1/aquaterm/build/Default/AquaTerm.app/Contents/Resources
354:info:build
355:info:build StripNIB English.lproj/Preferences.nib
356:info:build     cd /Volumes/UNIX/opt/local/var/macports/build/_Volumes_UNIX_opt_local_var_macports_sources_rsync.macports.org_release_tarballs_ports_aqua_aquaterm/aquaterm/work/AquaTerm-1.1.1/aquaterm
357:info:build     setenv XCODE_DEVELOPER_USR_PATH /Applications/Xcode.app/Contents/Developer/usr/bin/..
358:info:build     /Applications/Xcode.app/Contents/Developer/usr/bin/ibtool --strip /Volumes/UNIX/opt/local/var/macports/build/_Volumes_UNIX_opt_local_var_macports_sources_rsync.macports.org_release_tarballs_ports_aqua_aquaterm/aquaterm/work/AquaTerm-1.1.1/aquaterm/build/Default/AquaTerm.app/Contents/Resources/English.lproj/Preferences.nib --output-format human-readable-text /Volumes/UNIX/opt/local/var/macports/build/_Volumes_UNIX_opt_local_var_macports_sources_rsync.macports.org_release_tarballs_ports_aqua_aquaterm/aquaterm/work/AquaTerm-1.1.1/aquaterm/English.lproj/Preferences.nib
359:info:build /* com.apple.ibtool.errors */
360:info:build /Volumes/UNIX/opt/local/var/macports/build/_Volumes_UNIX_opt_local_var_macports_sources_rsync.macports.org_release_tarballs_ports_aqua_aquaterm/aquaterm/work/AquaTerm-1.1.1/aquaterm/English.lproj/Preferences.nib: error: ibtool could not strip "Preferences.nib" because it could not write to the path "/Volumes/UNIX/opt/local/var/macports/build/_Volumes_UNIX_opt_local_var_macports_sources_rsync.macports.org_release_tarballs_ports_aqua_aquaterm/aquaterm/work/AquaTerm-1.1.1/aquaterm/build/Default/AquaTerm.app/Contents/Resources/English.lproj/Preferences.nib".
361:info:build
362:info:build CpResource Help/help.html build/Default/AquaTerm.app/Contents/Resources/help.html
363:info:build     cd /Volumes/UNIX/opt/local/var/macports/build/_Volumes_UNIX_opt_local_var_macports_sources_rsync.macports.org_release_tarballs_ports_aqua_aquaterm/aquaterm/work/AquaTerm-1.1.1/aquaterm
364:info:build     builtin-copy -exclude .DS_Store -exclude CVS -exclude .svn -exclude .git -exclude .hg -resolve-src-symlinks /Volumes/UNIX/opt/local/var/macports/build/_Volumes_UNIX_opt_local_var_macports_sources_rsync.macports.org_release_tarballs_ports_aqua_aquaterm/aquaterm/work/AquaTerm-1.1.1/aquaterm/Help/help.html /Volumes/UNIX/opt/local/var/macports/build/_Volumes_UNIX_opt_local_var_macports_sources_rsync.macports.org_release_tarballs_ports_aqua_aquaterm/aquaterm/work/AquaTerm-1.1.1/aquaterm/build/Default/AquaTerm.app/Contents/Resources
365:info:build
366:info:build CpResource ReadMe.rtf build/Default/AquaTerm.app/Contents/Resources/ReadMe.rtf
367:info:build     cd /Volumes/UNIX/opt/local/var/macports/build/_Volumes_UNIX_opt_local_var_macports_sources_rsync.macports.org_release_tarballs_ports_aqua_aquaterm/aquaterm/work/AquaTerm-1.1.1/aquaterm
368:info:build     builtin-copy -exclude .DS_Store -exclude CVS -exclude .svn -exclude .git -exclude .hg -resolve-src-symlinks /Volumes/UNIX/opt/local/var/macports/build/_Volumes_UNIX_opt_local_var_macports_sources_rsync.macports.org_release_tarballs_ports_aqua_aquaterm/aquaterm/work/AquaTerm-1.1.1/aquaterm/ReadMe.rtf /Volumes/UNIX/opt/local/var/macports/build/_Volumes_UNIX_opt_local_var_macports_sources_rsync.macports.org_release_tarballs_ports_aqua_aquaterm/aquaterm/work/AquaTerm-1.1.1/aquaterm/build/Default/AquaTerm.app/Contents/Resources
369:info:build
370:info:build CopyTiffFile build/Default/AquaTerm.app/Contents/Resources/English.lproj/crossBlack.tiff English.lproj/crossBlack.tiff
371:info:build     cd /Volumes/UNIX/opt/local/var/macports/build/_Volumes_UNIX_opt_local_var_macports_sources_rsync.macports.org_release_tarballs_ports_aqua_aquaterm/aquaterm/work/AquaTerm-1.1.1/aquaterm
372:info:build     builtin-copyTiff --outdir /Volumes/UNIX/opt/local/var/macports/build/_Volumes_UNIX_opt_local_var_macports_sources_rsync.macports.org_release_tarballs_ports_aqua_aquaterm/aquaterm/work/AquaTerm-1.1.1/aquaterm/build/Default/AquaTerm.app/Contents/Resources/English.lproj -- English.lproj/crossBlack.tiff
373:info:build
374:info:build CopyTiffFile build/Default/AquaTerm.app/Contents/Resources/English.lproj/crossBlue.tiff English.lproj/crossBlue.tiff
375:info:build     cd /Volumes/UNIX/opt/local/var/macports/build/_Volumes_UNIX_opt_local_var_macports_sources_rsync.macports.org_release_tarballs_ports_aqua_aquaterm/aquaterm/work/AquaTerm-1.1.1/aquaterm
376:info:build     builtin-copyTiff --outdir /Volumes/UNIX/opt/local/var/macports/build/_Volumes_UNIX_opt_local_var_macports_sources_rsync.macports.org_release_tarballs_ports_aqua_aquaterm/aquaterm/work/AquaTerm-1.1.1/aquaterm/build/Default/AquaTerm.app/Contents/Resources/English.lproj -- English.lproj/crossBlue.tiff
377:info:build
378:info:build CopyTiffFile build/Default/AquaTerm.app/Contents/Resources/English.lproj/crossGreen.tiff English.lproj/crossGreen.tiff
379:info:build     cd /Volumes/UNIX/opt/local/var/macports/build/_Volumes_UNIX_opt_local_var_macports_sources_rsync.macports.org_release_tarballs_ports_aqua_aquaterm/aquaterm/work/AquaTerm-1.1.1/aquaterm
380:info:build     builtin-copyTiff --outdir /Volumes/UNIX/opt/local/var/macports/build/_Volumes_UNIX_opt_local_var_macports_sources_rsync.macports.org_release_tarballs_ports_aqua_aquaterm/aquaterm/work/AquaTerm-1.1.1/aquaterm/build/Default/AquaTerm.app/Contents/Resources/English.lproj -- English.lproj/crossGreen.tiff
381:info:build
382:info:build CopyTiffFile build/Default/AquaTerm.app/Contents/Resources/English.lproj/crossRed.tiff English.lproj/crossRed.tiff
383:info:build     cd /Volumes/UNIX/opt/local/var/macports/build/_Volumes_UNIX_opt_local_var_macports_sources_rsync.macports.org_release_tarballs_ports_aqua_aquaterm/aquaterm/work/AquaTerm-1.1.1/aquaterm
384:info:build     builtin-copyTiff --outdir /Volumes/UNIX/opt/local/var/macports/build/_Volumes_UNIX_opt_local_var_macports_sources_rsync.macports.org_release_tarballs_ports_aqua_aquaterm/aquaterm/work/AquaTerm-1.1.1/aquaterm/build/Default/AquaTerm.app/Contents/Resources/English.lproj -- English.lproj/crossRed.tiff
385:info:build
386:info:build CopyTiffFile build/Default/AquaTerm.app/Contents/Resources/English.lproj/crossWhite.tiff English.lproj/crossWhite.tiff
387:info:build     cd /Volumes/UNIX/opt/local/var/macports/build/_Volumes_UNIX_opt_local_var_macports_sources_rsync.macports.org_release_tarballs_ports_aqua_aquaterm/aquaterm/work/AquaTerm-1.1.1/aquaterm
388:info:build     builtin-copyTiff --outdir /Volumes/UNIX/opt/local/var/macports/build/_Volumes_UNIX_opt_local_var_macports_sources_rsync.macports.org_release_tarballs_ports_aqua_aquaterm/aquaterm/work/AquaTerm-1.1.1/aquaterm/build/Default/AquaTerm.app/Contents/Resources/English.lproj -- English.lproj/crossWhite.tiff
389:info:build
390:info:build CopyTiffFile build/Default/AquaTerm.app/Contents/Resources/English.lproj/crossYellow.tiff English.lproj/crossYellow.tiff
391:info:build     cd /Volumes/UNIX/opt/local/var/macports/build/_Volumes_UNIX_opt_local_var_macports_sources_rsync.macports.org_release_tarballs_ports_aqua_aquaterm/aquaterm/work/AquaTerm-1.1.1/aquaterm
392:info:build     builtin-copyTiff --outdir /Volumes/UNIX/opt/local/var/macports/build/_Volumes_UNIX_opt_local_var_macports_sources_rsync.macports.org_release_tarballs_ports_aqua_aquaterm/aquaterm/work/AquaTerm-1.1.1/aquaterm/build/Default/AquaTerm.app/Contents/Resources/English.lproj -- English.lproj/crossYellow.tiff
393:info:build
394:info:build ** BUILD FAILED **
395:info:build
396:info:build
397:info:build The following build commands failed:
398:info:build     StripNIB English.lproj/MainMenu1.nib
399:info:build     StripNIB English.lproj/ColorInspector.nib
400:info:build     StripNIB English.lproj/ExtendSavePanel.nib
401:info:build     StripNIB English.lproj/AQTWindow.nib
402:info:build     StripNIB English.lproj/Preferences.nib
403:info:build (5 failures)
404:info:build Command failed: cd "/Volumes/UNIX/opt/local/var/macports/build/_Volumes_UNIX_opt_local_var_macports_sources_rsync.macports.org_release_tarballs_ports_aqua_aquaterm/aquaterm/work/AquaTerm-1.1.1/aquaterm" && /usr/bin/xcodebuild  -target "AquaTerm" -configuration Default build OBJROOT=build/ SYMROOT=build/ MACOSX_DEPLOYMENT_TARGET=10.9 ARCHS=x86_64 SDKROOT="" GCC_VERSION=com.apple.compilers.llvm.clang.1_0 LOCAL_APPS_DIR=/Volumes/UNIX/MacPorts LOCAL_FRAMEWORKS_DIR=/Volumes/UNIX/opt/local/Library/Frameworks
405:info:build Exit code: 65
406:error:build org.macports.build for port aquaterm returned: command execution failed
407:debug:build Error code: NONE
408:debug:build Backtrace: command execution failed
409    while executing
410"$procedure $targetname"
411:info:build Warning: targets not executed for aquaterm: org.macports.activate org.macports.build org.macports.destroot org.macports.install
412:notice:build Please see the log file for port aquaterm for details:
413    /Volumes/UNIX/opt/local/var/macports/logs/_Volumes_UNIX_opt_local_var_macports_sources_rsync.macports.org_release_tarballs_ports_aqua_aquaterm/aquaterm/main.log