Ticket #42726: main.log

File main.log, 6.2 KB (added by kickingvegas (Charles Choi), 7 years ago)
Line 
1version:1
2:debug:main changing euid/egid - current euid: 0 - current egid: 0
3:debug:main egid changed to: 501
4:debug:main euid changed to: 505
5:debug:main Executing org.macports.main (gnupg2)
6:debug:main Privilege de-escalation not attempted as not running as root.
7:debug:main Skipping completed org.macports.archivefetch (gnupg2)
8:debug:main Privilege de-escalation not attempted as not running as root.
9:debug:main Skipping completed org.macports.fetch (gnupg2)
10:debug:main Privilege de-escalation not attempted as not running as root.
11:debug:main Skipping completed org.macports.checksum (gnupg2)
12:debug:main Privilege de-escalation not attempted as not running as root.
13:debug:main Skipping completed org.macports.extract (gnupg2)
14:debug:main Privilege de-escalation not attempted as not running as root.
15:debug:main Skipping completed org.macports.patch (gnupg2)
16:debug:main Privilege de-escalation not attempted as not running as root.
17:debug:main Skipping completed org.macports.configure (gnupg2)
18:debug:main Privilege de-escalation not attempted as not running as root.
19:debug:build build phase started at Wed Mar  5 00:10:01 PST 2014
20:notice:build --->  Building gnupg2
21:debug:build Executing org.macports.build (gnupg2)
22:debug:build Environment: CPATH='/opt/local/include' CC_PRINT_OPTIONS_FILE='/opt/local/var/macports/build/_opt_local_var_macports_sources_rsync.macports.org_release_ports_mail_gnupg2/gnupg2/work/.CC_PRINT_OPTIONS' LIBRARY_PATH='/opt/local/lib' CC_PRINT_OPTIONS='YES' MACOSX_DEPLOYMENT_TARGET='10.9'
23:debug:build Assembled command: 'cd "/opt/local/var/macports/build/_opt_local_var_macports_sources_rsync.macports.org_release_ports_mail_gnupg2/gnupg2/work/gnupg-2.0.22" && /usr/bin/make -j8 -w all'
24:debug:build Executing command line:  cd "/opt/local/var/macports/build/_opt_local_var_macports_sources_rsync.macports.org_release_ports_mail_gnupg2/gnupg2/work/gnupg-2.0.22" && /usr/bin/make -j8 -w all
25:info:build make: Entering directory `/opt/local/var/macports/build/_opt_local_var_macports_sources_rsync.macports.org_release_ports_mail_gnupg2/gnupg2/work/gnupg-2.0.22'
26:info:build /Applications/Xcode.app/Contents/Developer/usr/bin/make  all-recursive
27:info:build make[1]: Entering directory `/opt/local/var/macports/build/_opt_local_var_macports_sources_rsync.macports.org_release_ports_mail_gnupg2/gnupg2/work/gnupg-2.0.22'
28:info:build Making all in m4
29:info:build make[2]: Entering directory `/opt/local/var/macports/build/_opt_local_var_macports_sources_rsync.macports.org_release_ports_mail_gnupg2/gnupg2/work/gnupg-2.0.22/m4'
30:info:build make[2]: Nothing to be done for `all'.
31:info:build make[2]: Leaving directory `/opt/local/var/macports/build/_opt_local_var_macports_sources_rsync.macports.org_release_ports_mail_gnupg2/gnupg2/work/gnupg-2.0.22/m4'
32:info:build Making all in gl
33:info:build make[2]: Entering directory `/opt/local/var/macports/build/_opt_local_var_macports_sources_rsync.macports.org_release_ports_mail_gnupg2/gnupg2/work/gnupg-2.0.22/gl'
34:info:build /Applications/Xcode.app/Contents/Developer/usr/bin/make  all-am
35:info:build make[3]: Entering directory `/opt/local/var/macports/build/_opt_local_var_macports_sources_rsync.macports.org_release_ports_mail_gnupg2/gnupg2/work/gnupg-2.0.22/gl'
36:info:build /usr/bin/clang -DHAVE_CONFIG_H -I. -I..   -I/opt/local/include  -pipe -Os -arch x86_64 -Wall -Wno-pointer-sign -Wpointer-arith -MT allocsa.o -MD -MP -MF .deps/allocsa.Tpo -c -o allocsa.o allocsa.c
37:info:build In file included from allocsa.c:21:
38:info:build In file included from ./allocsa.h:23:
39:info:build In file included from /Applications/Xcode.app/Contents/Developer/Platforms/MacOSX.platform/Developer/SDKs/MacOSX10.9.sdk/usr/include/stdlib.h:65:
40:info:build In file included from /Applications/Xcode.app/Contents/Developer/Platforms/MacOSX.platform/Developer/SDKs/MacOSX10.9.sdk/usr/include/sys/wait.h:110:
41:info:build In file included from /Applications/Xcode.app/Contents/Developer/Platforms/MacOSX.platform/Developer/SDKs/MacOSX10.9.sdk/usr/include/sys/resource.h:72:
42:info:build ./stdint.h:46:11: fatal error: '/usr/include/stdint.h' file not found
43:info:build # include "/usr/include/stdint.h"
44:info:build           ^
45:info:build 1 error generated.
46:info:build make[3]: *** [allocsa.o] Error 1
47:info:build make[3]: Leaving directory `/opt/local/var/macports/build/_opt_local_var_macports_sources_rsync.macports.org_release_ports_mail_gnupg2/gnupg2/work/gnupg-2.0.22/gl'
48:info:build make[2]: *** [all] Error 2
49:info:build make[2]: Leaving directory `/opt/local/var/macports/build/_opt_local_var_macports_sources_rsync.macports.org_release_ports_mail_gnupg2/gnupg2/work/gnupg-2.0.22/gl'
50:info:build make[1]: *** [all-recursive] Error 1
51:info:build make[1]: Leaving directory `/opt/local/var/macports/build/_opt_local_var_macports_sources_rsync.macports.org_release_ports_mail_gnupg2/gnupg2/work/gnupg-2.0.22'
52:info:build make: *** [all] Error 2
53:info:build make: Leaving directory `/opt/local/var/macports/build/_opt_local_var_macports_sources_rsync.macports.org_release_ports_mail_gnupg2/gnupg2/work/gnupg-2.0.22'
54:info:build Command failed:  cd "/opt/local/var/macports/build/_opt_local_var_macports_sources_rsync.macports.org_release_ports_mail_gnupg2/gnupg2/work/gnupg-2.0.22" && /usr/bin/make -j8 -w all
55:info:build Exit code: 2
56:error:build org.macports.build for port gnupg2 returned: command execution failed
57:debug:build Error code: CHILDSTATUS 12179 2
58:debug:build Backtrace: command execution failed
59    while executing
60"system -nice 0 $fullcmdstring"
61    ("eval" body line 1)
62    invoked from within
63"eval system $notty $nice \$fullcmdstring"
64    invoked from within
65"command_exec build"
66    (procedure "portbuild::build_main" line 8)
67    invoked from within
68"$procedure $targetname"
69:info:build Warning: targets not executed for gnupg2: org.macports.activate org.macports.build org.macports.destroot org.macports.install
70:error:build Failed to install gnupg2
71:debug:build couldn't open "/System/Library/Frameworks/Tcl.framework/Versions/8.5/Resources/tclIndex": no such file or directory
72    while executing
73"open [file join $dir tclIndex]"
74:notice:build Please see the log file for port gnupg2 for details:
75    /opt/local/var/macports/logs/_opt_local_var_macports_sources_rsync.macports.org_release_ports_mail_gnupg2/gnupg2/main.log