Ticket #43108: main.log

File main.log, 48.8 KB (added by root42, 7 years ago)
Line 
1version:1
2:debug:main epoch: in tree: 0 installed: 0
3:debug:main iksemel 1.4_1 exists in the ports tree
4:debug:main iksemel 1.4_1  is the latest installed
5:debug:main iksemel 1.4_1  is active
6:debug:main Merging existing variants '' into variants
7:debug:main new fully merged portvariants:
8:debug:main Changing to port directory: /opt/local/var/macports/sources/rsync.macports.org/release/tarballs/ports/textproc/iksemel
9:debug:main OS darwin/13.1.0 (Mac OS X 10.9) arch i386
10:debug:main adding the default universal variant
11:debug:main Reading variant descriptions from /opt/local/var/macports/sources/rsync.macports.org/release/tarballs/ports/_resources/port1.0/variant_descriptions.conf
12:debug:main Running callback portconfigure::add_automatic_compiler_dependencies
13:debug:main Finished running callback portconfigure::add_automatic_compiler_dependencies
14:debug:main Running callback portbuild::add_automatic_buildsystem_dependencies
15:debug:main Finished running callback portbuild::add_automatic_buildsystem_dependencies
16:debug:main No need to upgrade! iksemel 1.4_1 >= iksemel 1.4_1
17:debug:main epoch: in tree: 0 installed: 0
18:debug:main gnutls 3.1.22_0 exists in the ports tree
19:debug:main gnutls 3.1.22_0  is the latest installed
20:debug:main gnutls 3.1.22_0  is active
21:debug:main Merging existing variants '' into variants
22:debug:main new fully merged portvariants:
23:debug:main Changing to port directory: /opt/local/var/macports/sources/rsync.macports.org/release/tarballs/ports/devel/gnutls
24:debug:main OS darwin/13.1.0 (Mac OS X 10.9) arch i386
25:debug:main Reading variant descriptions from /opt/local/var/macports/sources/rsync.macports.org/release/tarballs/ports/_resources/port1.0/variant_descriptions.conf
26:debug:main universal variant already exists, so not adding the default one
27:debug:main Running callback portconfigure::add_automatic_compiler_dependencies
28:debug:main Finished running callback portconfigure::add_automatic_compiler_dependencies
29:debug:main Running callback portbuild::add_automatic_buildsystem_dependencies
30:debug:main Finished running callback portbuild::add_automatic_buildsystem_dependencies
31:debug:main No need to upgrade! gnutls 3.1.22_0 >= gnutls 3.1.22_0
32:debug:main epoch: in tree: 0 installed: 0
33:debug:main gmp 5.1.2_0 exists in the ports tree
34:debug:main gmp 5.1.2_0  is the latest installed
35:debug:main gmp 5.1.2_0  is active
36:debug:main Merging existing variants '' into variants
37:debug:main new fully merged portvariants:
38:debug:main Changing to port directory: /opt/local/var/macports/sources/rsync.macports.org/release/tarballs/ports/devel/gmp
39:debug:main OS darwin/13.1.0 (Mac OS X 10.9) arch i386
40:debug:main Reading variant descriptions from /opt/local/var/macports/sources/rsync.macports.org/release/tarballs/ports/_resources/port1.0/variant_descriptions.conf
41:debug:main universal variant already exists, so not adding the default one
42:debug:main Running callback portconfigure::add_automatic_compiler_dependencies
43:debug:main Finished running callback portconfigure::add_automatic_compiler_dependencies
44:debug:main Running callback portbuild::add_automatic_buildsystem_dependencies
45:debug:main Finished running callback portbuild::add_automatic_buildsystem_dependencies
46:debug:main No need to upgrade! gmp 5.1.2_0 >= gmp 5.1.2_0
47:debug:main epoch: in tree: 0 installed: 0
48:debug:main libidn 1.26_0 exists in the ports tree
49:debug:main libidn 1.26_0  is the latest installed
50:debug:main libidn 1.26_0  is active
51:debug:main Merging existing variants '' into variants
52:debug:main new fully merged portvariants:
53:debug:main Changing to port directory: /opt/local/var/macports/sources/rsync.macports.org/release/tarballs/ports/mail/libidn
54:debug:main OS darwin/13.1.0 (Mac OS X 10.9) arch i386
55:debug:main adding the default universal variant
56:debug:main Reading variant descriptions from /opt/local/var/macports/sources/rsync.macports.org/release/tarballs/ports/_resources/port1.0/variant_descriptions.conf
57:debug:main Running callback portconfigure::add_automatic_compiler_dependencies
58:debug:main Finished running callback portconfigure::add_automatic_compiler_dependencies
59:debug:main Running callback portbuild::add_automatic_buildsystem_dependencies
60:debug:main Finished running callback portbuild::add_automatic_buildsystem_dependencies
61:debug:main No need to upgrade! libidn 1.26_0 >= libidn 1.26_0
62:debug:main epoch: in tree: 0 installed: 0
63:debug:main libiconv 1.14_0 exists in the ports tree
64:debug:main libiconv 1.14_0  is the latest installed
65:debug:main libiconv 1.14_0  is active
66:debug:main Merging existing variants '' into variants
67:debug:main new fully merged portvariants:
68:debug:main Changing to port directory: /opt/local/var/macports/sources/rsync.macports.org/release/tarballs/ports/textproc/libiconv
69:debug:main OS darwin/13.1.0 (Mac OS X 10.9) arch i386
70:debug:main Reading variant descriptions from /opt/local/var/macports/sources/rsync.macports.org/release/tarballs/ports/_resources/port1.0/variant_descriptions.conf
71:debug:main universal variant already exists, so not adding the default one
72:debug:main Running callback portconfigure::add_automatic_compiler_dependencies
73:debug:main Finished running callback portconfigure::add_automatic_compiler_dependencies
74:debug:main Running callback portbuild::add_automatic_buildsystem_dependencies
75:debug:main Finished running callback portbuild::add_automatic_buildsystem_dependencies
76:debug:main No need to upgrade! libiconv 1.14_0 >= libiconv 1.14_0
77:debug:main epoch: in tree: 0 installed: 0
78:debug:main gettext 0.18.3.2_0 exists in the ports tree
79:debug:main gettext 0.18.3.2_0  is the latest installed
80:debug:main gettext 0.18.3.2_0  is active
81:debug:main Merging existing variants '' into variants
82:debug:main new fully merged portvariants:
83:debug:main Changing to port directory: /opt/local/var/macports/sources/rsync.macports.org/release/tarballs/ports/devel/gettext
84:debug:main OS darwin/13.1.0 (Mac OS X 10.9) arch i386
85:debug:main Reading variant descriptions from /opt/local/var/macports/sources/rsync.macports.org/release/tarballs/ports/_resources/port1.0/variant_descriptions.conf
86:debug:main compiler clang 503.0.38 not blacklisted because it doesn't match {clang < 211.10.1}
87:debug:main universal variant already exists, so not adding the default one
88:debug:main Running callback portconfigure::add_automatic_compiler_dependencies
89:debug:main Finished running callback portconfigure::add_automatic_compiler_dependencies
90:debug:main Running callback portbuild::add_automatic_buildsystem_dependencies
91:debug:main Finished running callback portbuild::add_automatic_buildsystem_dependencies
92:debug:main No need to upgrade! gettext 0.18.3.2_0 >= gettext 0.18.3.2_0
93:debug:main epoch: in tree: 0 installed: 0
94:debug:main expat 2.1.0_0 exists in the ports tree
95:debug:main expat 2.1.0_0  is the latest installed
96:debug:main expat 2.1.0_0  is active
97:debug:main Merging existing variants '' into variants
98:debug:main new fully merged portvariants:
99:debug:main Changing to port directory: /opt/local/var/macports/sources/rsync.macports.org/release/tarballs/ports/textproc/expat
100:debug:main OS darwin/13.1.0 (Mac OS X 10.9) arch i386
101:debug:main adding the default universal variant
102:debug:main Reading variant descriptions from /opt/local/var/macports/sources/rsync.macports.org/release/tarballs/ports/_resources/port1.0/variant_descriptions.conf
103:debug:main Running callback portconfigure::add_automatic_compiler_dependencies
104:debug:main Finished running callback portconfigure::add_automatic_compiler_dependencies
105:debug:main Running callback portbuild::add_automatic_buildsystem_dependencies
106:debug:main Finished running callback portbuild::add_automatic_buildsystem_dependencies
107:debug:main No need to upgrade! expat 2.1.0_0 >= expat 2.1.0_0
108:debug:main epoch: in tree: 0 installed: 0
109:debug:main ncurses 5.9_2 exists in the ports tree
110:debug:main ncurses 5.9_2  is the latest installed
111:debug:main ncurses 5.9_2  is active
112:debug:main Merging existing variants '' into variants
113:debug:main new fully merged portvariants:
114:debug:main Changing to port directory: /opt/local/var/macports/sources/rsync.macports.org/release/tarballs/ports/devel/ncurses
115:debug:main OS darwin/13.1.0 (Mac OS X 10.9) arch i386
116:debug:main adding the default universal variant
117:debug:main Reading variant descriptions from /opt/local/var/macports/sources/rsync.macports.org/release/tarballs/ports/_resources/port1.0/variant_descriptions.conf
118:debug:main Running callback portconfigure::add_automatic_compiler_dependencies
119:debug:main Finished running callback portconfigure::add_automatic_compiler_dependencies
120:debug:main Running callback portbuild::add_automatic_buildsystem_dependencies
121:debug:main Finished running callback portbuild::add_automatic_buildsystem_dependencies
122:debug:main No need to upgrade! ncurses 5.9_2 >= ncurses 5.9_2
123:debug:main epoch: in tree: 0 installed: 0
124:debug:main libtasn1 2.11_0 exists in the ports tree
125:debug:main libtasn1 2.11_0  is the latest installed
126:debug:main libtasn1 2.11_0  is active
127:debug:main Merging existing variants '' into variants
128:debug:main new fully merged portvariants:
129:debug:main Changing to port directory: /opt/local/var/macports/sources/rsync.macports.org/release/tarballs/ports/devel/libtasn1
130:debug:main OS darwin/13.1.0 (Mac OS X 10.9) arch i386
131:debug:main adding the default universal variant
132:debug:main Reading variant descriptions from /opt/local/var/macports/sources/rsync.macports.org/release/tarballs/ports/_resources/port1.0/variant_descriptions.conf
133:debug:main Running callback portconfigure::add_automatic_compiler_dependencies
134:debug:main Finished running callback portconfigure::add_automatic_compiler_dependencies
135:debug:main Running callback portbuild::add_automatic_buildsystem_dependencies
136:debug:main Finished running callback portbuild::add_automatic_buildsystem_dependencies
137:debug:main No need to upgrade! libtasn1 2.11_0 >= libtasn1 2.11_0
138:debug:main epoch: in tree: 0 installed: 0
139:debug:main p11-kit 0.20.2_0 exists in the ports tree
140:debug:main p11-kit 0.20.2_0  is the latest installed
141:debug:main p11-kit 0.20.2_0  is active
142:debug:main Merging existing variants '' into variants
143:debug:main new fully merged portvariants:
144:debug:main Changing to port directory: /opt/local/var/macports/sources/rsync.macports.org/release/tarballs/ports/security/p11-kit
145:debug:main OS darwin/13.1.0 (Mac OS X 10.9) arch i386
146:debug:main adding the default universal variant
147:debug:main Reading variant descriptions from /opt/local/var/macports/sources/rsync.macports.org/release/tarballs/ports/_resources/port1.0/variant_descriptions.conf
148:debug:main Running callback portconfigure::add_automatic_compiler_dependencies
149:debug:main Finished running callback portconfigure::add_automatic_compiler_dependencies
150:debug:main Running callback portbuild::add_automatic_buildsystem_dependencies
151:debug:main Finished running callback portbuild::add_automatic_buildsystem_dependencies
152:debug:main No need to upgrade! p11-kit 0.20.2_0 >= p11-kit 0.20.2_0
153:debug:main epoch: in tree: 0 installed: 0
154:debug:main desktop-file-utils 0.22_0 exists in the ports tree
155:debug:main desktop-file-utils 0.22_0  is the latest installed
156:debug:main desktop-file-utils 0.22_0  is active
157:debug:main Merging existing variants '' into variants
158:debug:main new fully merged portvariants:
159:debug:main Changing to port directory: /opt/local/var/macports/sources/rsync.macports.org/release/tarballs/ports/gnome/desktop-file-utils
160:debug:main OS darwin/13.1.0 (Mac OS X 10.9) arch i386
161:debug:main adding the default universal variant
162:debug:main Reading variant descriptions from /opt/local/var/macports/sources/rsync.macports.org/release/tarballs/ports/_resources/port1.0/variant_descriptions.conf
163:debug:main Running callback portconfigure::add_automatic_compiler_dependencies
164:debug:main Finished running callback portconfigure::add_automatic_compiler_dependencies
165:debug:main Running callback portbuild::add_automatic_buildsystem_dependencies
166:debug:main Finished running callback portbuild::add_automatic_buildsystem_dependencies
167:debug:main No need to upgrade! desktop-file-utils 0.22_0 >= desktop-file-utils 0.22_0
168:debug:main epoch: in tree: 0 installed: 0
169:debug:main glib2 2.38.2_0 exists in the ports tree
170:debug:main glib2 2.38.2_0  is the latest installed
171:debug:main glib2 2.38.2_0  is active
172:debug:main Merging existing variants '' into variants
173:debug:main new fully merged portvariants:
174:debug:main Changing to port directory: /opt/local/var/macports/sources/rsync.macports.org/release/tarballs/ports/devel/glib2
175:debug:main OS darwin/13.1.0 (Mac OS X 10.9) arch i386
176:debug:main compiler clang 503.0.38 not blacklisted because it doesn't match {clang < 318}
177:debug:main adding the default universal variant
178:debug:main Reading variant descriptions from /opt/local/var/macports/sources/rsync.macports.org/release/tarballs/ports/_resources/port1.0/variant_descriptions.conf
179:debug:main Running callback portconfigure::add_automatic_compiler_dependencies
180:debug:main Finished running callback portconfigure::add_automatic_compiler_dependencies
181:debug:main Running callback portbuild::add_automatic_buildsystem_dependencies
182:debug:main Finished running callback portbuild::add_automatic_buildsystem_dependencies
183:debug:main No need to upgrade! glib2 2.38.2_0 >= glib2 2.38.2_0
184:debug:main epoch: in tree: 0 installed: 0
185:debug:main zlib 1.2.8_0 exists in the ports tree
186:debug:main zlib 1.2.8_0  is the latest installed
187:debug:main zlib 1.2.8_0  is active
188:debug:main Merging existing variants '' into variants
189:debug:main new fully merged portvariants:
190:debug:main Changing to port directory: /opt/local/var/macports/sources/rsync.macports.org/release/tarballs/ports/archivers/zlib
191:debug:main OS darwin/13.1.0 (Mac OS X 10.9) arch i386
192:debug:main adding the default universal variant
193:debug:main Reading variant descriptions from /opt/local/var/macports/sources/rsync.macports.org/release/tarballs/ports/_resources/port1.0/variant_descriptions.conf
194:debug:main Running callback portconfigure::add_automatic_compiler_dependencies
195:debug:main Finished running callback portconfigure::add_automatic_compiler_dependencies
196:debug:main Running callback portbuild::add_automatic_buildsystem_dependencies
197:debug:main Finished running callback portbuild::add_automatic_buildsystem_dependencies
198:debug:main No need to upgrade! zlib 1.2.8_0 >= zlib 1.2.8_0
199:debug:main epoch: in tree: 0 installed: 0
200:debug:main libffi 3.0.13_0 exists in the ports tree
201:debug:main libffi 3.0.13_0  is the latest installed
202:debug:main libffi 3.0.13_0  is active
203:debug:main Merging existing variants '' into variants
204:debug:main new fully merged portvariants:
205:debug:main Changing to port directory: /opt/local/var/macports/sources/rsync.macports.org/release/tarballs/ports/devel/libffi
206:debug:main OS darwin/13.1.0 (Mac OS X 10.9) arch i386
207:debug:main Reading variant descriptions from /opt/local/var/macports/sources/rsync.macports.org/release/tarballs/ports/_resources/port1.0/variant_descriptions.conf
208:debug:main universal variant already exists, so not adding the default one
209:debug:main Running callback portconfigure::add_automatic_compiler_dependencies
210:debug:main Finished running callback portconfigure::add_automatic_compiler_dependencies
211:debug:main Running callback portbuild::add_automatic_buildsystem_dependencies
212:debug:main Finished running callback portbuild::add_automatic_buildsystem_dependencies
213:debug:main No need to upgrade! libffi 3.0.13_0 >= libffi 3.0.13_0
214:debug:main epoch: in tree: 0 installed: 0
215:debug:main perl5 5.12.4_0 exists in the ports tree
216:debug:main perl5 5.12.4_0 +perl5_12 is the latest installed
217:debug:main perl5 5.12.4_0 +perl5_12 is active
218:debug:main Merging existing variants '+perl5_12' into variants
219:debug:main new fully merged portvariants: perl5_12 +
220:debug:main Changing to port directory: /opt/local/var/macports/sources/rsync.macports.org/release/tarballs/ports/lang/perl5
221:debug:main OS darwin/13.1.0 (Mac OS X 10.9) arch i386
222:debug:main universal_variant is false, so not adding the default universal variant
223:debug:main Executing variant perl5_12 provides perl5_12
224:debug:main Running callback portconfigure::add_automatic_compiler_dependencies
225:debug:main Finished running callback portconfigure::add_automatic_compiler_dependencies
226:debug:main Running callback portbuild::add_automatic_buildsystem_dependencies
227:debug:main Finished running callback portbuild::add_automatic_buildsystem_dependencies
228:debug:main No need to upgrade! perl5 5.12.4_0 >= perl5 5.12.4_0
229:debug:main epoch: in tree: 0 installed: 0
230:debug:main perl5.12 5.12.4_3 exists in the ports tree
231:debug:main perl5.12 5.12.4_3  is the latest installed
232:debug:main perl5.12 5.12.4_3  is active
233:debug:main Merging existing variants '' into variants
234:debug:main new fully merged portvariants:
235:debug:main Changing to port directory: /opt/local/var/macports/sources/rsync.macports.org/release/tarballs/ports/lang/perl5.12
236:debug:main OS darwin/13.1.0 (Mac OS X 10.9) arch i386
237:debug:main adding the default universal variant
238:debug:main Reading variant descriptions from /opt/local/var/macports/sources/rsync.macports.org/release/tarballs/ports/_resources/port1.0/variant_descriptions.conf
239:debug:main Running callback portconfigure::add_automatic_compiler_dependencies
240:debug:main Finished running callback portconfigure::add_automatic_compiler_dependencies
241:debug:main Running callback portbuild::add_automatic_buildsystem_dependencies
242:debug:main Finished running callback portbuild::add_automatic_buildsystem_dependencies
243:debug:main No need to upgrade! perl5.12 5.12.4_3 >= perl5.12 5.12.4_3
244:debug:main epoch: in tree: 0 installed: 0
245:debug:main gdbm 1.11_0 exists in the ports tree
246:debug:main gdbm 1.11_0  is the latest installed
247:debug:main gdbm 1.11_0  is active
248:debug:main Merging existing variants '' into variants
249:debug:main new fully merged portvariants:
250:debug:main Changing to port directory: /opt/local/var/macports/sources/rsync.macports.org/release/tarballs/ports/databases/gdbm
251:debug:main OS darwin/13.1.0 (Mac OS X 10.9) arch i386
252:debug:main adding the default universal variant
253:debug:main Reading variant descriptions from /opt/local/var/macports/sources/rsync.macports.org/release/tarballs/ports/_resources/port1.0/variant_descriptions.conf
254:debug:main Running callback portconfigure::add_automatic_compiler_dependencies
255:debug:main Finished running callback portconfigure::add_automatic_compiler_dependencies
256:debug:main Running callback portbuild::add_automatic_buildsystem_dependencies
257:debug:main Finished running callback portbuild::add_automatic_buildsystem_dependencies
258:debug:main No need to upgrade! gdbm 1.11_0 >= gdbm 1.11_0
259:debug:main epoch: in tree: 0 installed: 0
260:debug:main popt 1.16_0 exists in the ports tree
261:debug:main popt 1.16_0  is the latest installed
262:debug:main popt 1.16_0  is active
263:debug:main Merging existing variants '' into variants
264:debug:main new fully merged portvariants:
265:debug:main Changing to port directory: /opt/local/var/macports/sources/rsync.macports.org/release/tarballs/ports/devel/popt
266:debug:main OS darwin/13.1.0 (Mac OS X 10.9) arch i386
267:debug:main adding the default universal variant
268:debug:main Reading variant descriptions from /opt/local/var/macports/sources/rsync.macports.org/release/tarballs/ports/_resources/port1.0/variant_descriptions.conf
269:debug:main Running callback portconfigure::add_automatic_compiler_dependencies
270:debug:main Finished running callback portconfigure::add_automatic_compiler_dependencies
271:debug:main Running callback portbuild::add_automatic_buildsystem_dependencies
272:debug:main Finished running callback portbuild::add_automatic_buildsystem_dependencies
273:debug:main No need to upgrade! popt 1.16_0 >= popt 1.16_0
274:debug:main epoch: in tree: 0 installed: 0
275:debug:main libxslt 1.1.28_0 exists in the ports tree
276:debug:main libxslt 1.1.28_0  is the latest installed
277:debug:main libxslt 1.1.28_0  is active
278:debug:main Merging existing variants '' into variants
279:debug:main new fully merged portvariants:
280:debug:main Changing to port directory: /opt/local/var/macports/sources/rsync.macports.org/release/tarballs/ports/textproc/libxslt
281:debug:main OS darwin/13.1.0 (Mac OS X 10.9) arch i386
282:debug:main adding the default universal variant
283:debug:main Reading variant descriptions from /opt/local/var/macports/sources/rsync.macports.org/release/tarballs/ports/_resources/port1.0/variant_descriptions.conf
284:debug:main Running callback portconfigure::add_automatic_compiler_dependencies
285:debug:main Finished running callback portconfigure::add_automatic_compiler_dependencies
286:debug:main Running callback portbuild::add_automatic_buildsystem_dependencies
287:debug:main Finished running callback portbuild::add_automatic_buildsystem_dependencies
288:debug:main No need to upgrade! libxslt 1.1.28_0 >= libxslt 1.1.28_0
289:debug:main epoch: in tree: 0 installed: 0
290:debug:main libxml2 2.9.1_0 exists in the ports tree
291:debug:main libxml2 2.9.1_0  is the latest installed
292:debug:main libxml2 2.9.1_0  is active
293:debug:main Merging existing variants '' into variants
294:debug:main new fully merged portvariants:
295:debug:main Changing to port directory: /opt/local/var/macports/sources/rsync.macports.org/release/tarballs/ports/textproc/libxml2
296:debug:main OS darwin/13.1.0 (Mac OS X 10.9) arch i386
297:debug:main adding the default universal variant
298:debug:main Reading variant descriptions from /opt/local/var/macports/sources/rsync.macports.org/release/tarballs/ports/_resources/port1.0/variant_descriptions.conf
299:debug:main Running callback portconfigure::add_automatic_compiler_dependencies
300:debug:main Finished running callback portconfigure::add_automatic_compiler_dependencies
301:debug:main Running callback portbuild::add_automatic_buildsystem_dependencies
302:debug:main Finished running callback portbuild::add_automatic_buildsystem_dependencies
303:debug:main No need to upgrade! libxml2 2.9.1_0 >= libxml2 2.9.1_0
304:debug:main epoch: in tree: 0 installed: 0
305:debug:main xz 5.0.5_0 exists in the ports tree
306:debug:main xz 5.0.5_0  is the latest installed
307:debug:main xz 5.0.5_0  is active
308:debug:main Merging existing variants '' into variants
309:debug:main new fully merged portvariants:
310:debug:main Changing to port directory: /opt/local/var/macports/sources/rsync.macports.org/release/tarballs/ports/archivers/xz
311:debug:main OS darwin/13.1.0 (Mac OS X 10.9) arch i386
312:debug:main adding the default universal variant
313:debug:main Reading variant descriptions from /opt/local/var/macports/sources/rsync.macports.org/release/tarballs/ports/_resources/port1.0/variant_descriptions.conf
314:debug:main Running callback portconfigure::add_automatic_compiler_dependencies
315:debug:main Finished running callback portconfigure::add_automatic_compiler_dependencies
316:debug:main Running callback portbuild::add_automatic_buildsystem_dependencies
317:debug:main Finished running callback portbuild::add_automatic_buildsystem_dependencies
318:debug:main No need to upgrade! xz 5.0.5_0 >= xz 5.0.5_0
319:debug:main epoch: in tree: 0 installed: 0
320:debug:main curl-ca-bundle 7.35.0_0 exists in the ports tree
321:debug:main curl-ca-bundle 7.35.0_0  is the latest installed
322:debug:main curl-ca-bundle 7.35.0_0  is active
323:debug:main Merging existing variants '' into variants
324:debug:main new fully merged portvariants:
325:debug:main Changing to port directory: /opt/local/var/macports/sources/rsync.macports.org/release/tarballs/ports/net/curl
326:debug:main OS darwin/13.1.0 (Mac OS X 10.9) arch i386
327:debug:main universal_variant is false, so not adding the default universal variant
328:debug:main Running callback portconfigure::add_automatic_compiler_dependencies
329:debug:main Finished running callback portconfigure::add_automatic_compiler_dependencies
330:debug:main Running callback portbuild::add_automatic_buildsystem_dependencies
331:debug:main Finished running callback portbuild::add_automatic_buildsystem_dependencies
332:debug:main No need to upgrade! curl-ca-bundle 7.35.0_0 >= curl-ca-bundle 7.35.0_0
333:debug:main epoch: in tree: 0 installed: 0
334:debug:main nettle 2.6_1 exists in the ports tree
335:debug:main nettle 2.6_1  is the latest installed
336:debug:main nettle 2.6_1  is active
337:debug:main Merging existing variants '' into variants
338:debug:main new fully merged portvariants:
339:debug:main Changing to port directory: /opt/local/var/macports/sources/rsync.macports.org/release/tarballs/ports/devel/nettle
340:debug:main OS darwin/13.1.0 (Mac OS X 10.9) arch i386
341:debug:main Reading variant descriptions from /opt/local/var/macports/sources/rsync.macports.org/release/tarballs/ports/_resources/port1.0/variant_descriptions.conf
342:debug:main universal variant already exists, so not adding the default one
343:debug:main Running callback portconfigure::add_automatic_compiler_dependencies
344:debug:main Finished running callback portconfigure::add_automatic_compiler_dependencies
345:debug:main Running callback portbuild::add_automatic_buildsystem_dependencies
346:debug:main Finished running callback portbuild::add_automatic_buildsystem_dependencies
347:debug:main No need to upgrade! nettle 2.6_1 >= nettle 2.6_1
348:debug:main epoch: in tree: 0 installed: 0
349:debug:main libgcrypt 1.5.3_0 exists in the ports tree
350:debug:main libgcrypt 1.5.3_0  is the latest installed
351:debug:main libgcrypt 1.5.3_0  is active
352:debug:main Merging existing variants '' into variants
353:debug:main new fully merged portvariants:
354:debug:main Changing to port directory: /opt/local/var/macports/sources/rsync.macports.org/release/tarballs/ports/devel/libgcrypt
355:debug:main OS darwin/13.1.0 (Mac OS X 10.9) arch i386
356:debug:main Reading variant descriptions from /opt/local/var/macports/sources/rsync.macports.org/release/tarballs/ports/_resources/port1.0/variant_descriptions.conf
357:debug:main universal variant already exists, so not adding the default one
358:debug:main Running callback portconfigure::add_automatic_compiler_dependencies
359:debug:main Finished running callback portconfigure::add_automatic_compiler_dependencies
360:debug:main Running callback portbuild::add_automatic_buildsystem_dependencies
361:debug:main Finished running callback portbuild::add_automatic_buildsystem_dependencies
362:debug:main No need to upgrade! libgcrypt 1.5.3_0 >= libgcrypt 1.5.3_0
363:debug:main epoch: in tree: 0 installed: 0
364:debug:main libgpg-error 1.12_0 exists in the ports tree
365:debug:main libgpg-error 1.12_0  is the latest installed
366:debug:main libgpg-error 1.12_0  is active
367:debug:main Merging existing variants '' into variants
368:debug:main new fully merged portvariants:
369:debug:main Changing to port directory: /opt/local/var/macports/sources/rsync.macports.org/release/tarballs/ports/devel/libgpg-error
370:debug:main OS darwin/13.1.0 (Mac OS X 10.9) arch i386
371:debug:main adding the default universal variant
372:debug:main Reading variant descriptions from /opt/local/var/macports/sources/rsync.macports.org/release/tarballs/ports/_resources/port1.0/variant_descriptions.conf
373:debug:main Running callback portconfigure::add_automatic_compiler_dependencies
374:debug:main Finished running callback portconfigure::add_automatic_compiler_dependencies
375:debug:main Running callback portbuild::add_automatic_buildsystem_dependencies
376:debug:main Finished running callback portbuild::add_automatic_buildsystem_dependencies
377:debug:main No need to upgrade! libgpg-error 1.12_0 >= libgpg-error 1.12_0
378:msg:main --->  Computing dependencies for gloox:info:main .:debug:main gloox has no conflicts
379:debug:main Searching for dependency: iksemel
380:debug:main Found Dependency: receipt exists for iksemel
381:debug:main Searching for dependency: gettext
382:debug:main Found Dependency: receipt exists for gettext
383:debug:main Searching for dependency: gnutls
384:debug:main Found Dependency: receipt exists for gnutls
385:debug:main Searching for dependency: libgcrypt
386:debug:main Found Dependency: receipt exists for libgcrypt
387:debug:main Searching for dependency: libgpg-error
388:debug:main Found Dependency: receipt exists for libgpg-error
389:debug:main Searching for dependency: libiconv
390:debug:main Found Dependency: receipt exists for libiconv
391:debug:main Searching for dependency: libidn
392:debug:main Found Dependency: receipt exists for libidn
393:debug:main Searching for dependency: zlib
394:debug:main Found Dependency: receipt exists for zlib
395:msg:main
396:debug:main Executing org.macports.main (gloox)
397:debug:main changing euid/egid - current euid: 0 - current egid: 0
398:debug:main egid changed to: 501
399:debug:main euid changed to: 502
400:debug:main Skipping completed org.macports.archivefetch (gloox)
401:debug:main Privilege de-escalation not attempted as not running as root.
402:debug:main Skipping completed org.macports.fetch (gloox)
403:debug:main Privilege de-escalation not attempted as not running as root.
404:debug:main Skipping completed org.macports.checksum (gloox)
405:debug:main Privilege de-escalation not attempted as not running as root.
406:debug:main Skipping completed org.macports.extract (gloox)
407:debug:main Privilege de-escalation not attempted as not running as root.
408:debug:main Skipping completed org.macports.patch (gloox)
409:debug:main Privilege de-escalation not attempted as not running as root.
410:debug:main Skipping completed org.macports.configure (gloox)
411:debug:main Privilege de-escalation not attempted as not running as root.
412:debug:build build phase started at Fri Mar 28 20:33:24 CET 2014
413:notice:build --->  Building gloox
414:debug:build Executing org.macports.build (gloox)
415:debug:build Environment: CPATH='/opt/local/include' CC_PRINT_OPTIONS_FILE='/opt/local/var/macports/build/_opt_local_var_macports_sources_rsync.macports.org_release_tarballs_ports_net_gloox/gloox/work/.CC_PRINT_OPTIONS' LIBRARY_PATH='/opt/local/lib' CC_PRINT_OPTIONS='YES' MACOSX_DEPLOYMENT_TARGET='10.9'
416:debug:build Assembled command: 'cd "/opt/local/var/macports/build/_opt_local_var_macports_sources_rsync.macports.org_release_tarballs_ports_net_gloox/gloox/work/gloox-1.0" && /usr/bin/make -j8 -w all'
417:debug:build Executing command line:  cd "/opt/local/var/macports/build/_opt_local_var_macports_sources_rsync.macports.org_release_tarballs_ports_net_gloox/gloox/work/gloox-1.0" && /usr/bin/make -j8 -w all
418:info:build make: Entering directory `/opt/local/var/macports/build/_opt_local_var_macports_sources_rsync.macports.org_release_tarballs_ports_net_gloox/gloox/work/gloox-1.0'
419:info:build /Applications/Xcode.app/Contents/Developer/usr/bin/make  all-recursive
420:info:build make[1]: Entering directory `/opt/local/var/macports/build/_opt_local_var_macports_sources_rsync.macports.org_release_tarballs_ports_net_gloox/gloox/work/gloox-1.0'
421:info:build Making all in src
422:info:build make[2]: Entering directory `/opt/local/var/macports/build/_opt_local_var_macports_sources_rsync.macports.org_release_tarballs_ports_net_gloox/gloox/work/gloox-1.0/src'
423:info:build Making all in .
424:info:build make[3]: Entering directory `/opt/local/var/macports/build/_opt_local_var_macports_sources_rsync.macports.org_release_tarballs_ports_net_gloox/gloox/work/gloox-1.0/src'
425:info:build /bin/sh ../libtool --tag=CXX   --mode=compile /usr/bin/clang++ -DHAVE_CONFIG_H -I. -I..  -Wall -pedantic -pipe -W -Wfloat-equal -Wcast-align -Wsign-compare -Wpointer-arith -Wswitch -Wunknown-pragmas -Wconversion -Wundef -Wcast-qual -Wwrite-strings -Wformat-security -Wmissing-format-attribute -Wno-long-long -I/opt/local/include -I/opt/local/include -I/opt/local/include -I/opt/local/include/p11-kit-1 -I/opt/local/include  -I/opt/local/include -D_THREAD_SAFE   -pipe -Os -arch x86_64 -ansi -MT jid.lo -MD -MP -MF .deps/jid.Tpo -c -o jid.lo jid.cpp
426:info:build /bin/sh ../libtool --tag=CXX   --mode=compile /usr/bin/clang++ -DHAVE_CONFIG_H -I. -I..  -Wall -pedantic -pipe -W -Wfloat-equal -Wcast-align -Wsign-compare -Wpointer-arith -Wswitch -Wunknown-pragmas -Wconversion -Wundef -Wcast-qual -Wwrite-strings -Wformat-security -Wmissing-format-attribute -Wno-long-long -I/opt/local/include -I/opt/local/include -I/opt/local/include -I/opt/local/include/p11-kit-1 -I/opt/local/include  -I/opt/local/include -D_THREAD_SAFE   -pipe -Os -arch x86_64 -ansi -MT parser.lo -MD -MP -MF .deps/parser.Tpo -c -o parser.lo parser.cpp
427:info:build /bin/sh ../libtool --tag=CXX   --mode=compile /usr/bin/clang++ -DHAVE_CONFIG_H -I. -I..  -Wall -pedantic -pipe -W -Wfloat-equal -Wcast-align -Wsign-compare -Wpointer-arith -Wswitch -Wunknown-pragmas -Wconversion -Wundef -Wcast-qual -Wwrite-strings -Wformat-security -Wmissing-format-attribute -Wno-long-long -I/opt/local/include -I/opt/local/include -I/opt/local/include -I/opt/local/include/p11-kit-1 -I/opt/local/include  -I/opt/local/include -D_THREAD_SAFE   -pipe -Os -arch x86_64 -ansi -MT clientbase.lo -MD -MP -MF .deps/clientbase.Tpo -c -o clientbase.lo clientbase.cpp
428:info:build /bin/sh ../libtool --tag=CXX   --mode=compile /usr/bin/clang++ -DHAVE_CONFIG_H -I. -I..  -Wall -pedantic -pipe -W -Wfloat-equal -Wcast-align -Wsign-compare -Wpointer-arith -Wswitch -Wunknown-pragmas -Wconversion -Wundef -Wcast-qual -Wwrite-strings -Wformat-security -Wmissing-format-attribute -Wno-long-long -I/opt/local/include -I/opt/local/include -I/opt/local/include -I/opt/local/include/p11-kit-1 -I/opt/local/include  -I/opt/local/include -D_THREAD_SAFE   -pipe -Os -arch x86_64 -ansi -MT tag.lo -MD -MP -MF .deps/tag.Tpo -c -o tag.lo tag.cpp
429:info:build /bin/sh ../libtool --tag=CXX   --mode=compile /usr/bin/clang++ -DHAVE_CONFIG_H -I. -I..  -Wall -pedantic -pipe -W -Wfloat-equal -Wcast-align -Wsign-compare -Wpointer-arith -Wswitch -Wunknown-pragmas -Wconversion -Wundef -Wcast-qual -Wwrite-strings -Wformat-security -Wmissing-format-attribute -Wno-long-long -I/opt/local/include -I/opt/local/include -I/opt/local/include -I/opt/local/include/p11-kit-1 -I/opt/local/include  -I/opt/local/include -D_THREAD_SAFE   -pipe -Os -arch x86_64 -ansi -MT stanza.lo -MD -MP -MF .deps/stanza.Tpo -c -o stanza.lo stanza.cpp
430:info:build /bin/sh ../libtool --tag=CXX   --mode=compile /usr/bin/clang++ -DHAVE_CONFIG_H -I. -I..  -Wall -pedantic -pipe -W -Wfloat-equal -Wcast-align -Wsign-compare -Wpointer-arith -Wswitch -Wunknown-pragmas -Wconversion -Wundef -Wcast-qual -Wwrite-strings -Wformat-security -Wmissing-format-attribute -Wno-long-long -I/opt/local/include -I/opt/local/include -I/opt/local/include -I/opt/local/include/p11-kit-1 -I/opt/local/include  -I/opt/local/include -D_THREAD_SAFE   -pipe -Os -arch x86_64 -ansi -MT dns.lo -MD -MP -MF .deps/dns.Tpo -c -o dns.lo dns.cpp
431:info:build /bin/sh ../libtool --tag=CXX   --mode=compile /usr/bin/clang++ -DHAVE_CONFIG_H -I. -I..  -Wall -pedantic -pipe -W -Wfloat-equal -Wcast-align -Wsign-compare -Wpointer-arith -Wswitch -Wunknown-pragmas -Wconversion -Wundef -Wcast-qual -Wwrite-strings -Wformat-security -Wmissing-format-attribute -Wno-long-long -I/opt/local/include -I/opt/local/include -I/opt/local/include -I/opt/local/include/p11-kit-1 -I/opt/local/include  -I/opt/local/include -D_THREAD_SAFE   -pipe -Os -arch x86_64 -ansi -MT client.lo -MD -MP -MF .deps/client.Tpo -c -o client.lo client.cpp
432:info:build /bin/sh ../libtool --tag=CXX   --mode=compile /usr/bin/clang++ -DHAVE_CONFIG_H -I. -I..  -Wall -pedantic -pipe -W -Wfloat-equal -Wcast-align -Wsign-compare -Wpointer-arith -Wswitch -Wunknown-pragmas -Wconversion -Wundef -Wcast-qual -Wwrite-strings -Wformat-security -Wmissing-format-attribute -Wno-long-long -I/opt/local/include -I/opt/local/include -I/opt/local/include -I/opt/local/include/p11-kit-1 -I/opt/local/include  -I/opt/local/include -D_THREAD_SAFE   -pipe -Os -arch x86_64 -ansi -MT component.lo -MD -MP -MF .deps/component.Tpo -c -o component.lo component.cpp
433:info:build libtool: compile:  /usr/bin/clang++ -DHAVE_CONFIG_H -I. -I.. -Wall -pedantic -pipe -W -Wfloat-equal -Wcast-align -Wsign-compare -Wpointer-arith -Wswitch -Wunknown-pragmas -Wconversion -Wundef -Wcast-qual -Wwrite-strings -Wformat-security -Wmissing-format-attribute -Wno-long-long -I/opt/local/include -I/opt/local/include -I/opt/local/include -I/opt/local/include/p11-kit-1 -I/opt/local/include -I/opt/local/include -D_THREAD_SAFE -pipe -Os -arch x86_64 -ansi -MT jid.lo -MD -MP -MF .deps/jid.Tpo -c jid.cpp  -fno-common -DPIC -o .libs/jid.o
434:info:build libtool: compile:  /usr/bin/clang++ -DHAVE_CONFIG_H -I. -I.. -Wall -pedantic -pipe -W -Wfloat-equal -Wcast-align -Wsign-compare -Wpointer-arith -Wswitch -Wunknown-pragmas -Wconversion -Wundef -Wcast-qual -Wwrite-strings -Wformat-security -Wmissing-format-attribute -Wno-long-long -I/opt/local/include -I/opt/local/include -I/opt/local/include -I/opt/local/include/p11-kit-1 -I/opt/local/include -I/opt/local/include -D_THREAD_SAFE -pipe -Os -arch x86_64 -ansi -MT parser.lo -MD -MP -MF .deps/parser.Tpo -c parser.cpp  -fno-common -DPIC -o .libs/parser.o
435:info:build libtool: compile:  /usr/bin/clang++ -DHAVE_CONFIG_H -I. -I.. -Wall -pedantic -pipe -W -Wfloat-equal -Wcast-align -Wsign-compare -Wpointer-arith -Wswitch -Wunknown-pragmas -Wconversion -Wundef -Wcast-qual -Wwrite-strings -Wformat-security -Wmissing-format-attribute -Wno-long-long -I/opt/local/include -I/opt/local/include -I/opt/local/include -I/opt/local/include/p11-kit-1 -I/opt/local/include -I/opt/local/include -D_THREAD_SAFE -pipe -Os -arch x86_64 -ansi -MT tag.lo -MD -MP -MF .deps/tag.Tpo -c tag.cpp  -fno-common -DPIC -o .libs/tag.o
436:info:build libtool: compile:  /usr/bin/clang++ -DHAVE_CONFIG_H -I. -I.. -Wall -pedantic -pipe -W -Wfloat-equal -Wcast-align -Wsign-compare -Wpointer-arith -Wswitch -Wunknown-pragmas -Wconversion -Wundef -Wcast-qual -Wwrite-strings -Wformat-security -Wmissing-format-attribute -Wno-long-long -I/opt/local/include -I/opt/local/include -I/opt/local/include -I/opt/local/include/p11-kit-1 -I/opt/local/include -I/opt/local/include -D_THREAD_SAFE -pipe -Os -arch x86_64 -ansi -MT clientbase.lo -MD -MP -MF .deps/clientbase.Tpo -c clientbase.cpp  -fno-common -DPIC -o .libs/clientbase.o
437:info:build libtool: compile:  /usr/bin/clang++ -DHAVE_CONFIG_H -I. -I.. -Wall -pedantic -pipe -W -Wfloat-equal -Wcast-align -Wsign-compare -Wpointer-arith -Wswitch -Wunknown-pragmas -Wconversion -Wundef -Wcast-qual -Wwrite-strings -Wformat-security -Wmissing-format-attribute -Wno-long-long -I/opt/local/include -I/opt/local/include -I/opt/local/include -I/opt/local/include/p11-kit-1 -I/opt/local/include -I/opt/local/include -D_THREAD_SAFE -pipe -Os -arch x86_64 -ansi -MT stanza.lo -MD -MP -MF .deps/stanza.Tpo -c stanza.cpp  -fno-common -DPIC -o .libs/stanza.o
438:info:build libtool: compile:  /usr/bin/clang++ -DHAVE_CONFIG_H -I. -I.. -Wall -pedantic -pipe -W -Wfloat-equal -Wcast-align -Wsign-compare -Wpointer-arith -Wswitch -Wunknown-pragmas -Wconversion -Wundef -Wcast-qual -Wwrite-strings -Wformat-security -Wmissing-format-attribute -Wno-long-long -I/opt/local/include -I/opt/local/include -I/opt/local/include -I/opt/local/include/p11-kit-1 -I/opt/local/include -I/opt/local/include -D_THREAD_SAFE -pipe -Os -arch x86_64 -ansi -MT dns.lo -MD -MP -MF .deps/dns.Tpo -c dns.cpp  -fno-common -DPIC -o .libs/dns.o
439:info:build libtool: compile:  /usr/bin/clang++ -DHAVE_CONFIG_H -I. -I.. -Wall -pedantic -pipe -W -Wfloat-equal -Wcast-align -Wsign-compare -Wpointer-arith -Wswitch -Wunknown-pragmas -Wconversion -Wundef -Wcast-qual -Wwrite-strings -Wformat-security -Wmissing-format-attribute -Wno-long-long -I/opt/local/include -I/opt/local/include -I/opt/local/include -I/opt/local/include/p11-kit-1 -I/opt/local/include -I/opt/local/include -D_THREAD_SAFE -pipe -Os -arch x86_64 -ansi -MT component.lo -MD -MP -MF .deps/component.Tpo -c component.cpp  -fno-common -DPIC -o .libs/component.o
440:info:build libtool: compile:  /usr/bin/clang++ -DHAVE_CONFIG_H -I. -I.. -Wall -pedantic -pipe -W -Wfloat-equal -Wcast-align -Wsign-compare -Wpointer-arith -Wswitch -Wunknown-pragmas -Wconversion -Wundef -Wcast-qual -Wwrite-strings -Wformat-security -Wmissing-format-attribute -Wno-long-long -I/opt/local/include -I/opt/local/include -I/opt/local/include -I/opt/local/include/p11-kit-1 -I/opt/local/include -I/opt/local/include -D_THREAD_SAFE -pipe -Os -arch x86_64 -ansi -MT client.lo -MD -MP -MF .deps/client.Tpo -c client.cpp  -fno-common -DPIC -o .libs/client.o
441:info:build In file included from jid.cpp:16:
442:info:build ./util.h:241:26: error: use of undeclared identifier 'calloc'
443:info:build       char* num = (char*)calloc( len + 1 + add, sizeof( char ) );
444:info:build                          ^
445:info:build In file included from parser.cpp:14:
446:info:build ./util.h:241:26: error: use of undeclared identifier 'calloc'
447:info:build       char* num = (char*)calloc( len + 1 + add, sizeof( char ) );
448:info:build                          ^
449:info:build ./util.h:251:7: error: use of undeclared identifier 'free'
450:info:build       free( num );
451:info:build       ^
452:info:build ./util.h:251:7: error: use of undeclared identifier 'free'
453:info:build       free( num );
454:info:build       ^
455:info:build 2 errors generated.
456:info:build make[3]: *** [jid.lo] Error 1
457:info:build make[3]: *** Waiting for unfinished jobs....
458:info:build In file included from tag.cpp:15:
459:info:build ./util.h:241:26: error: use of undeclared identifier 'calloc'
460:info:build       char* num = (char*)calloc( len + 1 + add, sizeof( char ) );
461:info:build                          ^
462:info:build ./util.h:251:7: error: use of undeclared identifier 'free'
463:info:build       free( num );
464:info:build       ^
465:info:build parser.cpp:172:31: warning: implicit conversion changes signedness: 'value_type' (aka 'char') to 'const unsigned char' [-Wsign-conversion]
466:info:build       const unsigned char c = data[i];
467:info:build                           ~   ^~~~~~~
468:info:build parser.cpp:214:28: warning: implicit conversion changes signedness: 'const unsigned char' to 'value_type' (aka 'char') [-Wsign-conversion]
469:info:build                 m_cdata += c;
470:info:build                 ~~~~~~~    ^
471:info:build parser.cpp:254:24: warning: implicit conversion changes signedness: 'const unsigned char' to 'value_type' (aka 'char') [-Wsign-conversion]
472:info:build               m_tag += c;
473:info:build               ~~~~~    ^
474:info:build parser.cpp:269:30: warning: implicit conversion changes signedness: 'const unsigned char' to 'value_type' (aka 'char') [-Wsign-conversion]
475:info:build                   m_cdata += c;
476:info:build                   ~~~~~~~    ^
477:info:build parser.cpp:276:26: warning: implicit conversion changes signedness: 'const unsigned char' to 'value_type' (aka 'char') [-Wsign-conversion]
478:info:build               m_cdata += c;
479:info:build               ~~~~~~~    ^
480:info:build parser.cpp:318:24: warning: implicit conversion changes signedness: 'const unsigned char' to 'value_type' (aka 'char') [-Wsign-conversion]
481:info:build               m_tag += c;In file included from stanza.cpp:17:
482:info:build
483:info:build ./util.h              ~~~~~    ^:
484:info:build 241:26: error: use of undeclared identifier 'calloc'
485:info:build       char* num = (char*)calloc( len + 1 + add, sizeof( char ) );
486:info:build                          ^
487:info:build parser.cpp:345:26: warning: implicit conversion changes signedness: 'const unsigned char' to 'value_type' (aka 'char') [-Wsign-conversion]
488:info:build               m_cdata += c;
489:info:build               ~~~~~~~    ^
490:info:build parser.cpp:386:24: warning: implicit conversion changes signedness: 'const unsigned char' to 'value_type' (aka 'char') [-Wsign-conversion]
491:info:build               m_tag += c;
492:info:build               ~~~~~    ^
493:info:build parser.cpp:426:24: warning: implicit conversion changes signedness: 'const unsigned char' to 'value_type' (aka 'char') [-Wsign-conversion]
494:info:build               m_tag += c;
495:info:build               ~~~~~    ^
496:info:build parser.cpp:465:27: warning: implicit conversion changes signedness: 'const unsigned char' to 'value_type' (aka 'char') [-Wsign-conversion]
497:info:build               m_attrib += c;
498:info:build               ~~~~~~~~    ^
499:info:build ./util.h:251:7: error: use of undeclared identifier 'free'
500:info:build       free( num );
501:info:build       ^
502:info:build parser.cpp:511:27: warning: implicit conversion changes signedness: 'const unsigned char' to 'value_type' (aka 'char') [-Wsign-conversion]
503:info:build               m_attrib += c;
504:info:build               ~~~~~~~~    ^
505:info:build parser.cpp:559:28: warning: implicit conversion changes signedness: 'const unsigned char' to 'value_type' (aka 'char') [-Wsign-conversion]
506:info:build                 m_value += c;
507:info:build                 ~~~~~~~    ^
508:info:build In file included from dns.cpp:18:
509:info:build ./util.h:241:26: error: use of undeclared identifier 'calloc'
510:info:build       char* num = (char*)calloc( len + 1 + add, sizeof( char ) );
511:info:build                          ^
512:info:build parser.cpp:582:26: warning: implicit conversion changes signedness: 'const unsigned char' to 'value_type' (aka 'char') [-Wsign-conversion]
513:info:build               m_value += c;
514:info:build               ~~~~~~~    ^
515:info:build ./util.h:251:7: error: use of undeclared identifier 'free'
516:info:build       free( num );
517:info:build       ^
518:info:build dns.cpp:98:19: warning: cast from 'unsigned char *' to 'HEADER *' increases required alignment from 1 to 4 [-Wcast-align]
519:info:build     HEADER* hdr = (HEADER*)srvbuf.buf;
520:info:build                   ^~~~~~~~~~~~~~~~~~~
521:info:build 13 warnings and 2 errors generated.
522:info:build make[3]: *** [parser.lo] Error 1
523:info:build 2 errors generated.
524:info:build make[3]: *** [stanza.lo] Error 1
525:info:build 1 warning and 2 errors generated.
526:info:build make[3]: *** [dns.lo] Error 1
527:info:build In file included from component.cpp:15:
528:info:build ./component.h:57:12: warning: 'gloox::Component::disconnect' hides overloaded virtual function [-Woverloaded-virtual]
529:info:build       void disconnect() { ClientBase::disconnect( ConnUserDisconnected ); }
530:info:build            ^
531:info:build ./clientbase.h:753:20: note: hidden overloaded virtual function 'gloox::ClientBase::disconnect' declared here: different number of parameters (1 vs 0)
532:info:build       virtual void disconnect( ConnectionError reason );
533:info:build                    ^
534:info:build 2 errors generated.
535:info:build make[3]: *** [tag.lo] Error 1
536:info:build In file included from client.cpp:17:
537:info:build In file included from ./rostermanager.h:21:
538:info:build In file included from ./rosterlistener.h:17:
539:info:build In file included from ./rosteritem.h:18:
540:info:build In file included from ./resource.h:18:
541:info:build ./util.h:241:26: error: use of undeclared identifier 'calloc'
542:info:build       char* num = (char*)calloc( len + 1 + add, sizeof( char ) );
543:info:build                          ^
544:info:build In file included from clientbase.cpp:33:
545:info:build In file included from ./rosterlistener.h:17:
546:info:build In file included from ./rosteritem.h:18:
547:info:build In file included from ./resource.h:18:
548:info:build ./util.h:241:26: error: use of undeclared identifier 'calloc'
549:info:build       char* num = (char*)calloc( len + 1 + add, sizeof( char ) );
550:info:build                          ^
551:info:build ./util.h:251:7: error: use of undeclared identifier 'free'
552:info:build       free( num );
553:info:build       ^
554:info:build ./util.h:251:7: error: use of undeclared identifier 'free'
555:info:build       free( num );
556:info:build       ^
557:info:build 1 warning generated.
558:info:build libtool: compile:  /usr/bin/clang++ -DHAVE_CONFIG_H -I. -I.. -Wall -pedantic -pipe -W -Wfloat-equal -Wcast-align -Wsign-compare -Wpointer-arith -Wswitch -Wunknown-pragmas -Wconversion -Wundef -Wcast-qual -Wwrite-strings -Wformat-security -Wmissing-format-attribute -Wno-long-long -I/opt/local/include -I/opt/local/include -I/opt/local/include -I/opt/local/include/p11-kit-1 -I/opt/local/include -I/opt/local/include -D_THREAD_SAFE -pipe -Os -arch x86_64 -ansi -MT component.lo -MD -MP -MF .deps/component.Tpo -c component.cpp -o component.o >/dev/null 2>&1
559:info:build 2 errors generated.
560:info:build make[3]: *** [client.lo] Error 1
561:info:build 2 errors generated.
562:info:build make[3]: *** [clientbase.lo] Error 1
563:info:build mv -f .deps/component.Tpo .deps/component.Plo
564:info:build make[3]: Leaving directory `/opt/local/var/macports/build/_opt_local_var_macports_sources_rsync.macports.org_release_tarballs_ports_net_gloox/gloox/work/gloox-1.0/src'
565:info:build make[2]: *** [all-recursive] Error 1
566:info:build make[2]: Leaving directory `/opt/local/var/macports/build/_opt_local_var_macports_sources_rsync.macports.org_release_tarballs_ports_net_gloox/gloox/work/gloox-1.0/src'
567:info:build make[1]: *** [all-recursive] Error 1
568:info:build make[1]: Leaving directory `/opt/local/var/macports/build/_opt_local_var_macports_sources_rsync.macports.org_release_tarballs_ports_net_gloox/gloox/work/gloox-1.0'
569:info:build make: *** [all] Error 2
570:info:build make: Leaving directory `/opt/local/var/macports/build/_opt_local_var_macports_sources_rsync.macports.org_release_tarballs_ports_net_gloox/gloox/work/gloox-1.0'
571:info:build Command failed:  cd "/opt/local/var/macports/build/_opt_local_var_macports_sources_rsync.macports.org_release_tarballs_ports_net_gloox/gloox/work/gloox-1.0" && /usr/bin/make -j8 -w all
572:info:build Exit code: 2
573:error:build org.macports.build for port gloox returned: command execution failed
574:debug:build Error code: CHILDSTATUS 74334 2
575:debug:build Backtrace: command execution failed
576    while executing
577"system -nice 0 $fullcmdstring"
578    ("eval" body line 1)
579    invoked from within
580"eval system $notty $nice \$fullcmdstring"
581    invoked from within
582"command_exec build"
583    (procedure "portbuild::build_main" line 8)
584    invoked from within
585"$procedure $targetname"
586:info:build Warning: targets not executed for gloox: org.macports.activate org.macports.build org.macports.destroot org.macports.install
587:notice:build Please see the log file for port gloox for details:
588    /opt/local/var/macports/logs/_opt_local_var_macports_sources_rsync.macports.org_release_tarballs_ports_net_gloox/gloox/main.log