Ticket #44581: main.sobakasu.log

File main.sobakasu.log, 57.7 KB (added by sobakasu@…, 7 years ago)

errors after applying patch 'set(CMAKE_OSX_DEPLOYMENT_TARGET "")'

Line 
1version:1
2:debug:main epoch: in tree: 0 installed: 0
3:debug:main libidn 1.29_0 exists in the ports tree
4:debug:main libidn 1.29_0  is the latest installed
5:debug:main libidn 1.29_0  is active
6:debug:main Merging existing variants '' into variants
7:debug:main new fully merged portvariants:
8:debug:main Changing to port directory: /opt/local/var/macports/sources/rsync.macports.org/release/tarballs/ports/mail/libidn
9:debug:main OS darwin/14.0.0 (Mac OS X 10.10) arch i386
10:debug:main Sourcing PortGroup conflicts_build 1.0 from /opt/local/var/macports/sources/rsync.macports.org/release/tarballs/ports/_resources/port1.0/group/conflicts_build-1.0.tcl
11:debug:main adding the default universal variant
12:debug:main Reading variant descriptions from /opt/local/var/macports/sources/rsync.macports.org/release/tarballs/ports/_resources/port1.0/variant_descriptions.conf
13:debug:main Running callback portconfigure::add_automatic_compiler_dependencies
14:debug:main Finished running callback portconfigure::add_automatic_compiler_dependencies
15:debug:main Running callback portbuild::add_automatic_buildsystem_dependencies
16:debug:main Finished running callback portbuild::add_automatic_buildsystem_dependencies
17:debug:main No need to upgrade! libidn 1.29_0 >= libidn 1.29_0
18:debug:main epoch: in tree: 0 installed: 0
19:debug:main libiconv 1.14_0 exists in the ports tree
20:debug:main libiconv 1.14_0  is the latest installed
21:debug:main libiconv 1.14_0  is active
22:debug:main Merging existing variants '' into variants
23:debug:main new fully merged portvariants:
24:debug:main Changing to port directory: /opt/local/var/macports/sources/rsync.macports.org/release/tarballs/ports/textproc/libiconv
25:debug:main OS darwin/14.0.0 (Mac OS X 10.10) arch i386
26:debug:main Reading variant descriptions from /opt/local/var/macports/sources/rsync.macports.org/release/tarballs/ports/_resources/port1.0/variant_descriptions.conf
27:debug:main Sourcing PortGroup muniversal 1.0 from /opt/local/var/macports/sources/rsync.macports.org/release/tarballs/ports/_resources/port1.0/group/muniversal-1.0.tcl
28:debug:main universal variant already exists, so not adding the default one
29:debug:main Running callback portconfigure::add_automatic_compiler_dependencies
30:debug:main Finished running callback portconfigure::add_automatic_compiler_dependencies
31:debug:main Running callback portbuild::add_automatic_buildsystem_dependencies
32:debug:main Finished running callback portbuild::add_automatic_buildsystem_dependencies
33:debug:main No need to upgrade! libiconv 1.14_0 >= libiconv 1.14_0
34:debug:main epoch: in tree: 2 installed: 2
35:debug:main gettext 0.19.3_0 exists in the ports tree
36:debug:main gettext 0.19.3_0  is the latest installed
37:debug:main gettext 0.19.3_0  is active
38:debug:main Merging existing variants '' into variants
39:debug:main new fully merged portvariants:
40:debug:main Changing to port directory: /opt/local/var/macports/sources/rsync.macports.org/release/tarballs/ports/devel/gettext
41:debug:main OS darwin/14.0.0 (Mac OS X 10.10) arch i386
42:debug:main Sourcing PortGroup compiler_blacklist_versions 1.0 from /opt/local/var/macports/sources/rsync.macports.org/release/tarballs/ports/_resources/port1.0/group/compiler_blacklist_versions-1.0.tcl
43:debug:main Reading variant descriptions from /opt/local/var/macports/sources/rsync.macports.org/release/tarballs/ports/_resources/port1.0/variant_descriptions.conf
44:debug:main Sourcing PortGroup muniversal 1.0 from /opt/local/var/macports/sources/rsync.macports.org/release/tarballs/ports/_resources/port1.0/group/muniversal-1.0.tcl
45:debug:main compiler clang 600.0.51 not blacklisted because it doesn't match {clang < 211.10.1}
46:debug:main universal variant already exists, so not adding the default one
47:debug:main Running callback portconfigure::add_automatic_compiler_dependencies
48:debug:main Finished running callback portconfigure::add_automatic_compiler_dependencies
49:debug:main Running callback portbuild::add_automatic_buildsystem_dependencies
50:debug:main Finished running callback portbuild::add_automatic_buildsystem_dependencies
51:debug:main No need to upgrade! gettext 0.19.3_0 >= gettext 0.19.3_0
52:debug:main epoch: in tree: 0 installed: 0
53:debug:main expat 2.1.0_0 exists in the ports tree
54:debug:main expat 2.1.0_0  is the latest installed
55:debug:main expat 2.1.0_0  is active
56:debug:main Merging existing variants '' into variants
57:debug:main new fully merged portvariants:
58:debug:main Changing to port directory: /opt/local/var/macports/sources/rsync.macports.org/release/tarballs/ports/textproc/expat
59:debug:main OS darwin/14.0.0 (Mac OS X 10.10) arch i386
60:debug:main adding the default universal variant
61:debug:main Reading variant descriptions from /opt/local/var/macports/sources/rsync.macports.org/release/tarballs/ports/_resources/port1.0/variant_descriptions.conf
62:debug:main Running callback portconfigure::add_automatic_compiler_dependencies
63:debug:main Finished running callback portconfigure::add_automatic_compiler_dependencies
64:debug:main Running callback portbuild::add_automatic_buildsystem_dependencies
65:debug:main Finished running callback portbuild::add_automatic_buildsystem_dependencies
66:debug:main No need to upgrade! expat 2.1.0_0 >= expat 2.1.0_0
67:debug:main epoch: in tree: 0 installed: 0
68:debug:main ncurses 5.9_2 exists in the ports tree
69:debug:main ncurses 5.9_2  is the latest installed
70:debug:main ncurses 5.9_2  is active
71:debug:main Merging existing variants '' into variants
72:debug:main new fully merged portvariants:
73:debug:main Changing to port directory: /opt/local/var/macports/sources/rsync.macports.org/release/tarballs/ports/devel/ncurses
74:debug:main OS darwin/14.0.0 (Mac OS X 10.10) arch i386
75:debug:main adding the default universal variant
76:debug:main Reading variant descriptions from /opt/local/var/macports/sources/rsync.macports.org/release/tarballs/ports/_resources/port1.0/variant_descriptions.conf
77:debug:main Running callback portconfigure::add_automatic_compiler_dependencies
78:debug:main Finished running callback portconfigure::add_automatic_compiler_dependencies
79:debug:main Running callback portbuild::add_automatic_buildsystem_dependencies
80:debug:main Finished running callback portbuild::add_automatic_buildsystem_dependencies
81:debug:main No need to upgrade! ncurses 5.9_2 >= ncurses 5.9_2
82:debug:main epoch: in tree: 1 installed: 1
83:debug:main openssl 1.0.1j_0 exists in the ports tree
84:debug:main openssl 1.0.1j_0  is the latest installed
85:debug:main openssl 1.0.1j_0  is active
86:debug:main Merging existing variants '' into variants
87:debug:main new fully merged portvariants:
88:debug:main Changing to port directory: /opt/local/var/macports/sources/rsync.macports.org/release/tarballs/ports/devel/openssl
89:debug:main OS darwin/14.0.0 (Mac OS X 10.10) arch i386
90:debug:main Reading variant descriptions from /opt/local/var/macports/sources/rsync.macports.org/release/tarballs/ports/_resources/port1.0/variant_descriptions.conf
91:debug:main Sourcing PortGroup muniversal 1.0 from /opt/local/var/macports/sources/rsync.macports.org/release/tarballs/ports/_resources/port1.0/group/muniversal-1.0.tcl
92:debug:main universal variant already exists, so not adding the default one
93:debug:main Running callback portconfigure::add_automatic_compiler_dependencies
94:debug:main Finished running callback portconfigure::add_automatic_compiler_dependencies
95:debug:main Running callback portbuild::add_automatic_buildsystem_dependencies
96:debug:main Finished running callback portbuild::add_automatic_buildsystem_dependencies
97:debug:main No need to upgrade! openssl 1.0.1j_0 >= openssl 1.0.1j_0
98:debug:main epoch: in tree: 0 installed: 0
99:debug:main zlib 1.2.8_0 exists in the ports tree
100:debug:main zlib 1.2.8_0  is the latest installed
101:debug:main zlib 1.2.8_0  is active
102:debug:main Merging existing variants '' into variants
103:debug:main new fully merged portvariants:
104:debug:main Changing to port directory: /opt/local/var/macports/sources/rsync.macports.org/release/tarballs/ports/archivers/zlib
105:debug:main OS darwin/14.0.0 (Mac OS X 10.10) arch i386
106:debug:main Sourcing PortGroup xcodeversion 1.0 from /opt/local/var/macports/sources/rsync.macports.org/release/tarballs/ports/_resources/port1.0/group/xcodeversion-1.0.tcl
107:debug:main adding the default universal variant
108:debug:main Reading variant descriptions from /opt/local/var/macports/sources/rsync.macports.org/release/tarballs/ports/_resources/port1.0/variant_descriptions.conf
109:debug:main Running callback portconfigure::add_automatic_compiler_dependencies
110:debug:main Finished running callback portconfigure::add_automatic_compiler_dependencies
111:debug:main Running callback portbuild::add_automatic_buildsystem_dependencies
112:debug:main Finished running callback portbuild::add_automatic_buildsystem_dependencies
113:debug:main No need to upgrade! zlib 1.2.8_0 >= zlib 1.2.8_0
114:debug:main epoch: in tree: 0 installed: 0
115:debug:main curl 7.38.0_0 exists in the ports tree
116:debug:main curl 7.38.0_0 +ssl is the latest installed
117:debug:main curl 7.38.0_0 +ssl is active
118:debug:main Merging existing variants '+ssl' into variants
119:debug:main new fully merged portvariants: ssl +
120:debug:main Changing to port directory: /opt/local/var/macports/sources/rsync.macports.org/release/tarballs/ports/net/curl
121:debug:main OS darwin/14.0.0 (Mac OS X 10.10) arch i386
122:debug:main Reading variant descriptions from /opt/local/var/macports/sources/rsync.macports.org/release/tarballs/ports/_resources/port1.0/variant_descriptions.conf
123:debug:main Sourcing PortGroup muniversal 1.0 from /opt/local/var/macports/sources/rsync.macports.org/release/tarballs/ports/_resources/port1.0/group/muniversal-1.0.tcl
124:debug:main universal variant already exists, so not adding the default one
125:debug:main Executing variant ssl provides ssl
126:debug:main Running callback portconfigure::add_automatic_compiler_dependencies
127:debug:main Finished running callback portconfigure::add_automatic_compiler_dependencies
128:debug:main Running callback portbuild::add_automatic_buildsystem_dependencies
129:debug:main Finished running callback portbuild::add_automatic_buildsystem_dependencies
130:debug:main No need to upgrade! curl 7.38.0_0 >= curl 7.38.0_0
131:debug:main epoch: in tree: 0 installed: 0
132:debug:main curl-ca-bundle 7.38.0_0 exists in the ports tree
133:debug:main curl-ca-bundle 7.38.0_0  is the latest installed
134:debug:main curl-ca-bundle 7.38.0_0  is active
135:debug:main Merging existing variants '' into variants
136:debug:main new fully merged portvariants:
137:debug:main Changing to port directory: /opt/local/var/macports/sources/rsync.macports.org/release/tarballs/ports/net/curl
138:debug:main OS darwin/14.0.0 (Mac OS X 10.10) arch i386
139:debug:main universal_variant is false, so not adding the default universal variant
140:debug:main Running callback portconfigure::add_automatic_compiler_dependencies
141:debug:main Finished running callback portconfigure::add_automatic_compiler_dependencies
142:debug:main Running callback portbuild::add_automatic_buildsystem_dependencies
143:debug:main Finished running callback portbuild::add_automatic_buildsystem_dependencies
144:debug:main No need to upgrade! curl-ca-bundle 7.38.0_0 >= curl-ca-bundle 7.38.0_0
145:debug:main epoch: in tree: 0 installed: 0
146:debug:main bzip2 1.0.6_0 exists in the ports tree
147:debug:main bzip2 1.0.6_0  is the latest installed
148:debug:main bzip2 1.0.6_0  is active
149:debug:main Merging existing variants '' into variants
150:debug:main new fully merged portvariants:
151:debug:main Changing to port directory: /opt/local/var/macports/sources/rsync.macports.org/release/tarballs/ports/archivers/bzip2
152:debug:main OS darwin/14.0.0 (Mac OS X 10.10) arch i386
153:debug:main Reading variant descriptions from /opt/local/var/macports/sources/rsync.macports.org/release/tarballs/ports/_resources/port1.0/variant_descriptions.conf
154:debug:main universal variant already exists, so not adding the default one
155:debug:main Running callback portconfigure::add_automatic_compiler_dependencies
156:debug:main Finished running callback portconfigure::add_automatic_compiler_dependencies
157:debug:main Running callback portbuild::add_automatic_buildsystem_dependencies
158:debug:main Finished running callback portbuild::add_automatic_buildsystem_dependencies
159:debug:main No need to upgrade! bzip2 1.0.6_0 >= bzip2 1.0.6_0
160:debug:main epoch: in tree: 0 installed: 0
161:debug:main libarchive 3.1.2_0 exists in the ports tree
162:debug:main libarchive 3.1.2_0  is the latest installed
163:debug:main libarchive 3.1.2_0  is active
164:debug:main Merging existing variants '' into variants
165:debug:main new fully merged portvariants:
166:debug:main Changing to port directory: /opt/local/var/macports/sources/rsync.macports.org/release/tarballs/ports/archivers/libarchive
167:debug:main OS darwin/14.0.0 (Mac OS X 10.10) arch i386
168:debug:main adding the default universal variant
169:debug:main Reading variant descriptions from /opt/local/var/macports/sources/rsync.macports.org/release/tarballs/ports/_resources/port1.0/variant_descriptions.conf
170:debug:main Running callback portconfigure::add_automatic_compiler_dependencies
171:debug:main Finished running callback portconfigure::add_automatic_compiler_dependencies
172:debug:main Running callback portbuild::add_automatic_buildsystem_dependencies
173:debug:main Finished running callback portbuild::add_automatic_buildsystem_dependencies
174:debug:main No need to upgrade! libarchive 3.1.2_0 >= libarchive 3.1.2_0
175:debug:main epoch: in tree: 0 installed: 0
176:debug:main libxml2 2.9.1_0 exists in the ports tree
177:debug:main libxml2 2.9.1_0  is the latest installed
178:debug:main libxml2 2.9.1_0  is active
179:debug:main Merging existing variants '' into variants
180:debug:main new fully merged portvariants:
181:debug:main Changing to port directory: /opt/local/var/macports/sources/rsync.macports.org/release/tarballs/ports/textproc/libxml2
182:debug:main OS darwin/14.0.0 (Mac OS X 10.10) arch i386
183:debug:main adding the default universal variant
184:debug:main Reading variant descriptions from /opt/local/var/macports/sources/rsync.macports.org/release/tarballs/ports/_resources/port1.0/variant_descriptions.conf
185:debug:main Running callback portconfigure::add_automatic_compiler_dependencies
186:debug:main Finished running callback portconfigure::add_automatic_compiler_dependencies
187:debug:main Running callback portbuild::add_automatic_buildsystem_dependencies
188:debug:main Finished running callback portbuild::add_automatic_buildsystem_dependencies
189:debug:main No need to upgrade! libxml2 2.9.1_0 >= libxml2 2.9.1_0
190:debug:main epoch: in tree: 0 installed: 0
191:debug:main xz 5.0.7_0 exists in the ports tree
192:debug:main xz 5.0.7_0  is the latest installed
193:debug:main xz 5.0.7_0  is active
194:debug:main Merging existing variants '' into variants
195:debug:main new fully merged portvariants:
196:debug:main Changing to port directory: /opt/local/var/macports/sources/rsync.macports.org/release/tarballs/ports/archivers/xz
197:debug:main OS darwin/14.0.0 (Mac OS X 10.10) arch i386
198:debug:main adding the default universal variant
199:debug:main Reading variant descriptions from /opt/local/var/macports/sources/rsync.macports.org/release/tarballs/ports/_resources/port1.0/variant_descriptions.conf
200:debug:main Running callback portconfigure::add_automatic_compiler_dependencies
201:debug:main Finished running callback portconfigure::add_automatic_compiler_dependencies
202:debug:main Running callback portbuild::add_automatic_buildsystem_dependencies
203:debug:main Finished running callback portbuild::add_automatic_buildsystem_dependencies
204:debug:main No need to upgrade! xz 5.0.7_0 >= xz 5.0.7_0
205:debug:main epoch: in tree: 0 installed: 0
206:debug:main lzo2 2.06_0 exists in the ports tree
207:debug:main lzo2 2.06_0  is the latest installed
208:debug:main lzo2 2.06_0  is active
209:debug:main Merging existing variants '' into variants
210:debug:main new fully merged portvariants:
211:debug:main Changing to port directory: /opt/local/var/macports/sources/rsync.macports.org/release/tarballs/ports/archivers/lzo2
212:debug:main OS darwin/14.0.0 (Mac OS X 10.10) arch i386
213:debug:main Reading variant descriptions from /opt/local/var/macports/sources/rsync.macports.org/release/tarballs/ports/_resources/port1.0/variant_descriptions.conf
214:debug:main Sourcing PortGroup muniversal 1.0 from /opt/local/var/macports/sources/rsync.macports.org/release/tarballs/ports/_resources/port1.0/group/muniversal-1.0.tcl
215:debug:main universal variant already exists, so not adding the default one
216:debug:main Running callback portconfigure::add_automatic_compiler_dependencies
217:debug:main Finished running callback portconfigure::add_automatic_compiler_dependencies
218:debug:main Running callback portbuild::add_automatic_buildsystem_dependencies
219:debug:main Finished running callback portbuild::add_automatic_buildsystem_dependencies
220:debug:main No need to upgrade! lzo2 2.06_0 >= lzo2 2.06_0
221:msg:main --->  Computing dependencies for cmake:info:main .:debug:main Searching for dependency: libidn
222:debug:main Found Dependency: receipt exists for libidn
223:debug:main Searching for dependency: openssl
224:debug:main Found Dependency: receipt exists for openssl
225:debug:main Searching for dependency: curl
226:debug:main Found Dependency: receipt exists for curl
227:debug:main Searching for dependency: expat
228:debug:main Found Dependency: receipt exists for expat
229:debug:main Searching for dependency: zlib
230:debug:main Found Dependency: receipt exists for zlib
231:debug:main Searching for dependency: bzip2
232:debug:main Found Dependency: receipt exists for bzip2
233:debug:main Searching for dependency: libarchive
234:debug:main Found Dependency: receipt exists for libarchive
235:msg:main
236:debug:main Executing org.macports.main (cmake)
237:debug:main changing euid/egid - current euid: 0 - current egid: 0
238:debug:main egid changed to: 501
239:debug:main euid changed to: 503
240:debug:main Skipping completed org.macports.fetch (cmake)
241:debug:main Privilege de-escalation not attempted as not running as root.
242:debug:main Skipping completed org.macports.checksum (cmake)
243:debug:main Privilege de-escalation not attempted as not running as root.
244:debug:main Skipping completed org.macports.extract (cmake)
245:debug:main Privilege de-escalation not attempted as not running as root.
246:debug:main Skipping completed org.macports.patch (cmake)
247:debug:main Privilege de-escalation not attempted as not running as root.
248:debug:main Skipping completed org.macports.configure (cmake)
249:debug:main Privilege de-escalation not attempted as not running as root.
250:debug:build build phase started at Sun Oct 19 12:03:06 ACDT 2014
251:notice:build --->  Building cmake
252:debug:build Executing org.macports.build (cmake)
253:debug:build Environment:
254CC_PRINT_OPTIONS='YES'
255CC_PRINT_OPTIONS_FILE='/opt/local/var/macports/build/_opt_local_var_macports_sources_rsync.macports.org_release_tarballs_ports_devel_cmake/cmake/work/.CC_PRINT_OPTIONS'
256CPATH='/opt/local/include'
257LIBRARY_PATH='/opt/local/lib'
258MACOSX_DEPLOYMENT_TARGET='10.10'
259:debug:build Assembled command: 'cd "/opt/local/var/macports/build/_opt_local_var_macports_sources_rsync.macports.org_release_tarballs_ports_devel_cmake/cmake/work/cmake-3.0.2" && /usr/bin/make -j8 -w all'
260:debug:build Executing command line:  cd "/opt/local/var/macports/build/_opt_local_var_macports_sources_rsync.macports.org_release_tarballs_ports_devel_cmake/cmake/work/cmake-3.0.2" && /usr/bin/make -j8 -w all
261:info:build make: Entering directory `/opt/local/var/macports/build/_opt_local_var_macports_sources_rsync.macports.org_release_tarballs_ports_devel_cmake/cmake/work/cmake-3.0.2'
262:info:build make[1]: Entering directory `/opt/local/var/macports/build/_opt_local_var_macports_sources_rsync.macports.org_release_tarballs_ports_devel_cmake/cmake/work/cmake-3.0.2'
263:info:build make[2]: Entering directory `/opt/local/var/macports/build/_opt_local_var_macports_sources_rsync.macports.org_release_tarballs_ports_devel_cmake/cmake/work/cmake-3.0.2'
264:info:build make[2]: Entering directory `/opt/local/var/macports/build/_opt_local_var_macports_sources_rsync.macports.org_release_tarballs_ports_devel_cmake/cmake/work/cmake-3.0.2'
265:info:build make[2]: Entering directory `/opt/local/var/macports/build/_opt_local_var_macports_sources_rsync.macports.org_release_tarballs_ports_devel_cmake/cmake/work/cmake-3.0.2'
266:info:build make[2]: Entering directory `/opt/local/var/macports/build/_opt_local_var_macports_sources_rsync.macports.org_release_tarballs_ports_devel_cmake/cmake/work/cmake-3.0.2'
267:info:build make[2]: Entering directory `/opt/local/var/macports/build/_opt_local_var_macports_sources_rsync.macports.org_release_tarballs_ports_devel_cmake/cmake/work/cmake-3.0.2'
268:info:build make[2]: Entering directory `/opt/local/var/macports/build/_opt_local_var_macports_sources_rsync.macports.org_release_tarballs_ports_devel_cmake/cmake/work/cmake-3.0.2'
269:info:build make[2]: Entering directory `/opt/local/var/macports/build/_opt_local_var_macports_sources_rsync.macports.org_release_tarballs_ports_devel_cmake/cmake/work/cmake-3.0.2'
270:info:build make[2]: Entering directory `/opt/local/var/macports/build/_opt_local_var_macports_sources_rsync.macports.org_release_tarballs_ports_devel_cmake/cmake/work/cmake-3.0.2'
271:info:build Scanning dependencies of target foo
272:info:build Scanning dependencies of target pseudonl_purify
273:info:build Scanning dependencies of target pseudonl_BC
274:info:build make[2]: Leaving directory `/opt/local/var/macports/build/_opt_local_var_macports_sources_rsync.macports.org_release_tarballs_ports_devel_cmake/cmake/work/cmake-3.0.2'
275:info:build make[2]: Leaving directory `/opt/local/var/macports/build/_opt_local_var_macports_sources_rsync.macports.org_release_tarballs_ports_devel_cmake/cmake/work/cmake-3.0.2'
276:info:build make[2]: Leaving directory `/opt/local/var/macports/build/_opt_local_var_macports_sources_rsync.macports.org_release_tarballs_ports_devel_cmake/cmake/work/cmake-3.0.2'
277:info:build Scanning dependencies of target cmcompress
278:info:build make[2]: Leaving directory `/opt/local/var/macports/build/_opt_local_var_macports_sources_rsync.macports.org_release_tarballs_ports_devel_cmake/cmake/work/cmake-3.0.2'
279:info:build make[2]: Entering directory `/opt/local/var/macports/build/_opt_local_var_macports_sources_rsync.macports.org_release_tarballs_ports_devel_cmake/cmake/work/cmake-3.0.2'
280:info:build make[2]: Entering directory `/opt/local/var/macports/build/_opt_local_var_macports_sources_rsync.macports.org_release_tarballs_ports_devel_cmake/cmake/work/cmake-3.0.2'
281:info:build make[2]: Entering directory `/opt/local/var/macports/build/_opt_local_var_macports_sources_rsync.macports.org_release_tarballs_ports_devel_cmake/cmake/work/cmake-3.0.2'
282:info:build Scanning dependencies of target cmIML_test
283:info:build make[2]: Entering directory `/opt/local/var/macports/build/_opt_local_var_macports_sources_rsync.macports.org_release_tarballs_ports_devel_cmake/cmake/work/cmake-3.0.2'
284:info:build make[2]: Leaving directory `/opt/local/var/macports/build/_opt_local_var_macports_sources_rsync.macports.org_release_tarballs_ports_devel_cmake/cmake/work/cmake-3.0.2'
285:info:build [  2%] [  2%] [  2%] make[2]: Entering directory `/opt/local/var/macports/build/_opt_local_var_macports_sources_rsync.macports.org_release_tarballs_ports_devel_cmake/cmake/work/cmake-3.0.2'
286:info:build Scanning dependencies of target cmsys_c
287:info:build make[2]: Leaving directory `/opt/local/var/macports/build/_opt_local_var_macports_sources_rsync.macports.org_release_tarballs_ports_devel_cmake/cmake/work/cmake-3.0.2'
288:info:build [  2%] Building C object Tests/CTestTestMemcheck/NoLogDummyChecker/CMakeFiles/pseudonl_BC.dir/ret0.c.o
289:info:build Building C object Tests/CTestTestMemcheck/NoLogDummyChecker/CMakeFiles/pseudonl_purify.dir/ret0.c.o
290:info:build Building CXX object Tests/FindPackageModeMakefileTest/CMakeFiles/foo.dir/foo.cpp.o
291:info:build Building C object Utilities/cmcompress/CMakeFiles/cmcompress.dir/cmcompress.c.o
292:info:build [  3%] make[2]: Entering directory `/opt/local/var/macports/build/_opt_local_var_macports_sources_rsync.macports.org_release_tarballs_ports_devel_cmake/cmake/work/cmake-3.0.2'
293:info:build Building C object Utilities/KWIML/test/CMakeFiles/cmIML_test.dir/test.c.o
294:info:build [  4%] Building C object Source/kwsys/CMakeFiles/cmsys_c.dir/ProcessUNIX.c.o
295:info:build Linking C executable purify
296:info:build Linking CXX static library libfoo.a
297:info:build Linking C executable BC
298:info:build Scanning dependencies of target cmsys
299:info:build make[2]: Leaving directory `/opt/local/var/macports/build/_opt_local_var_macports_sources_rsync.macports.org_release_tarballs_ports_devel_cmake/cmake/work/cmake-3.0.2'
300:info:build [  4%] make[2]: Entering directory `/opt/local/var/macports/build/_opt_local_var_macports_sources_rsync.macports.org_release_tarballs_ports_devel_cmake/cmake/work/cmake-3.0.2'
301:info:build Building C object Utilities/KWIML/test/CMakeFiles/cmIML_test.dir/test_ABI_C.c.o
302:info:build [  4%] Scanning dependencies of target cmForm
303:info:build make[2]: Leaving directory `/opt/local/var/macports/build/_opt_local_var_macports_sources_rsync.macports.org_release_tarballs_ports_devel_cmake/cmake/work/cmake-3.0.2'
304:info:build Building C object Source/kwsys/CMakeFiles/cmsys.dir/ProcessUNIX.c.o
305:info:build make[2]: Entering directory `/opt/local/var/macports/build/_opt_local_var_macports_sources_rsync.macports.org_release_tarballs_ports_devel_cmake/cmake/work/cmake-3.0.2'
306:info:build make[2]: Leaving directory `/opt/local/var/macports/build/_opt_local_var_macports_sources_rsync.macports.org_release_tarballs_ports_devel_cmake/cmake/work/cmake-3.0.2'
307:info:build [  4%] make[2]: Leaving directory `/opt/local/var/macports/build/_opt_local_var_macports_sources_rsync.macports.org_release_tarballs_ports_devel_cmake/cmake/work/cmake-3.0.2'
308:info:build [  4%] Building C object Source/CursesDialog/form/CMakeFiles/cmForm.dir/fld_arg.c.o
309:info:build make[2]: Leaving directory `/opt/local/var/macports/build/_opt_local_var_macports_sources_rsync.macports.org_release_tarballs_ports_devel_cmake/cmake/work/cmake-3.0.2'
310:info:build [  4%] Built target pseudonl_BC
311:info:build [  4%] Built target pseudonl_purify
312:info:build [  4%] [  4%] Built target foo
313:info:build [  5%] Building C object Utilities/KWIML/test/CMakeFiles/cmIML_test.dir/test_INT_C.c.o
314:info:build Building C object Source/kwsys/CMakeFiles/cmsys_c.dir/Base64.c.o
315:info:build make[2]: Entering directory `/opt/local/var/macports/build/_opt_local_var_macports_sources_rsync.macports.org_release_tarballs_ports_devel_cmake/cmake/work/cmake-3.0.2'
316:info:build Linking C static library libcmcompress.a
317:info:build Building C object Source/kwsys/CMakeFiles/cmsys.dir/Base64.c.o
318:info:build Scanning dependencies of target pseudonl_valgrind
319:info:build make[2]: Leaving directory `/opt/local/var/macports/build/_opt_local_var_macports_sources_rsync.macports.org_release_tarballs_ports_devel_cmake/cmake/work/cmake-3.0.2'
320:info:build make[2]: Entering directory `/opt/local/var/macports/build/_opt_local_var_macports_sources_rsync.macports.org_release_tarballs_ports_devel_cmake/cmake/work/cmake-3.0.2'
321:info:build [  5%] Building C object Tests/CTestTestMemcheck/NoLogDummyChecker/CMakeFiles/pseudonl_valgrind.dir/ret0.c.o
322:info:build [  5%] make[2]: Leaving directory `/opt/local/var/macports/build/_opt_local_var_macports_sources_rsync.macports.org_release_tarballs_ports_devel_cmake/cmake/work/cmake-3.0.2'
323:info:build Building C object Source/CursesDialog/form/CMakeFiles/cmForm.dir/fld_attr.c.o
324:info:build [  6%] [  6%] [  6%] Building C object Utilities/KWIML/test/CMakeFiles/cmIML_test.dir/test_include_C.c.o
325:info:build Built target cmcompress
326:info:build Building C object Source/kwsys/CMakeFiles/cmsys_c.dir/EncodingC.c.o
327:info:build Linking C executable valgrind
328:info:build [  7%] Building C object Source/kwsys/CMakeFiles/cmsys_c.dir/MD5.c.o
329:info:build [  7%] make[2]: Leaving directory `/opt/local/var/macports/build/_opt_local_var_macports_sources_rsync.macports.org_release_tarballs_ports_devel_cmake/cmake/work/cmake-3.0.2'
330:info:build Building C object Source/kwsys/CMakeFiles/cmsys.dir/EncodingC.c.o
331:info:build [  7%] Built target pseudonl_valgrind
332:info:build [  8%] [  8%] [  8%] Building C object Source/kwsys/CMakeFiles/cmsys_c.dir/Terminal.c.o
333:info:build Building C object Source/CursesDialog/form/CMakeFiles/cmForm.dir/fld_current.c.o
334:info:build Building CXX object Utilities/KWIML/test/CMakeFiles/cmIML_test.dir/test_ABI_CXX.cxx.o
335:info:build [  8%] Building C object Source/CursesDialog/form/CMakeFiles/cmForm.dir/fld_def.c.o
336:info:build [  8%] Building C object Source/kwsys/CMakeFiles/cmsys_c.dir/System.c.o
337:info:build [  8%] Building CXX object Utilities/KWIML/test/CMakeFiles/cmIML_test.dir/test_INT_CXX.cxx.o
338:info:build [  8%] [  9%] Building C object Source/kwsys/CMakeFiles/cmsys.dir/MD5.c.o
339:info:build Building CXX object Utilities/KWIML/test/CMakeFiles/cmIML_test.dir/test_include_CXX.cxx.o
340:info:build [ 10%] Building C object Source/CursesDialog/form/CMakeFiles/cmForm.dir/fld_dup.c.o
341:info:build [ 11%] Building C object Source/kwsys/CMakeFiles/cmsys_c.dir/String.c.o
342:info:build [ 11%] [ 12%] Building C object Source/CursesDialog/form/CMakeFiles/cmForm.dir/fld_ftchoice.c.o
343:info:build Building C object Source/kwsys/CMakeFiles/cmsys.dir/Terminal.c.o
344:info:build [ 12%] Building C object Source/CursesDialog/form/CMakeFiles/cmForm.dir/fld_ftlink.c.o
345:info:build [ 12%] Linking C static library libcmsys_c.a
346:info:build Building C object Source/kwsys/CMakeFiles/cmsys.dir/System.c.o
347:info:build [ 12%] Building C object Source/kwsys/CMakeFiles/cmsys.dir/String.c.o
348:info:build [ 13%] Building C object Source/CursesDialog/form/CMakeFiles/cmForm.dir/fld_info.c.o
349:info:build make[2]: Leaving directory `/opt/local/var/macports/build/_opt_local_var_macports_sources_rsync.macports.org_release_tarballs_ports_devel_cmake/cmake/work/cmake-3.0.2'
350:info:build [ 14%] [ 14%] Building CXX object Source/kwsys/CMakeFiles/cmsys.dir/Directory.cxx.o
351:info:build [ 14%] Building C object Source/CursesDialog/form/CMakeFiles/cmForm.dir/fld_just.c.o
352:info:build [ 14%] Built target cmsys_c
353:info:build Building CXX object Source/kwsys/CMakeFiles/cmsys.dir/DynamicLoader.cxx.o
354:info:build make[2]: Entering directory `/opt/local/var/macports/build/_opt_local_var_macports_sources_rsync.macports.org_release_tarballs_ports_devel_cmake/cmake/work/cmake-3.0.2'
355:info:build [ 14%] Building C object Source/CursesDialog/form/CMakeFiles/cmForm.dir/fld_link.c.o
356:info:build Scanning dependencies of target cmsysTestProcess
357:info:build make[2]: Leaving directory `/opt/local/var/macports/build/_opt_local_var_macports_sources_rsync.macports.org_release_tarballs_ports_devel_cmake/cmake/work/cmake-3.0.2'
358:info:build make[2]: Entering directory `/opt/local/var/macports/build/_opt_local_var_macports_sources_rsync.macports.org_release_tarballs_ports_devel_cmake/cmake/work/cmake-3.0.2'
359:info:build [ 14%] Building C object Source/kwsys/CMakeFiles/cmsysTestProcess.dir/testProcess.c.o
360:info:build [ 15%] [ 15%] Building C object Source/CursesDialog/form/CMakeFiles/cmForm.dir/fld_max.c.o
361:info:build Building C object Source/CursesDialog/form/CMakeFiles/cmForm.dir/fld_move.c.o
362:info:build [ 15%] [ 15%] Building C object Source/CursesDialog/form/CMakeFiles/cmForm.dir/fld_newftyp.c.o
363:info:build Building CXX object Source/kwsys/CMakeFiles/cmsys.dir/EncodingCXX.cxx.o
364:info:build Linking CXX executable cmIML_test
365:info:build [ 16%] Building C object Source/CursesDialog/form/CMakeFiles/cmForm.dir/fld_opts.c.o
366:info:build make[2]: Leaving directory `/opt/local/var/macports/build/_opt_local_var_macports_sources_rsync.macports.org_release_tarballs_ports_devel_cmake/cmake/work/cmake-3.0.2'
367:info:build [ 16%] make[2]: Entering directory `/opt/local/var/macports/build/_opt_local_var_macports_sources_rsync.macports.org_release_tarballs_ports_devel_cmake/cmake/work/cmake-3.0.2'
368:info:build [ 17%] Built target cmIML_test
369:info:build Building CXX object Source/kwsys/CMakeFiles/cmsys.dir/Glob.cxx.o
370:info:build [ 17%] Building C object Source/CursesDialog/form/CMakeFiles/cmForm.dir/fld_pad.c.o
371:info:build make[2]: Entering directory `/opt/local/var/macports/build/_opt_local_var_macports_sources_rsync.macports.org_release_tarballs_ports_devel_cmake/cmake/work/cmake-3.0.2'
372:info:build Scanning dependencies of target cmsysTestSharedForward
373:info:build make[2]: Leaving directory `/opt/local/var/macports/build/_opt_local_var_macports_sources_rsync.macports.org_release_tarballs_ports_devel_cmake/cmake/work/cmake-3.0.2'
374:info:build make[2]: Entering directory `/opt/local/var/macports/build/_opt_local_var_macports_sources_rsync.macports.org_release_tarballs_ports_devel_cmake/cmake/work/cmake-3.0.2'
375:info:build [ 18%] Building C object Source/kwsys/CMakeFiles/cmsysTestSharedForward.dir/testSharedForward.c.o
376:info:build Scanning dependencies of target cmsysTestsC
377:info:build [ 18%] make[2]: Leaving directory `/opt/local/var/macports/build/_opt_local_var_macports_sources_rsync.macports.org_release_tarballs_ports_devel_cmake/cmake/work/cmake-3.0.2'
378:info:build Building C object Source/CursesDialog/form/CMakeFiles/cmForm.dir/fld_page.c.o
379:info:build make[2]: Entering directory `/opt/local/var/macports/build/_opt_local_var_macports_sources_rsync.macports.org_release_tarballs_ports_devel_cmake/cmake/work/cmake-3.0.2'
380:info:build [ 18%] Linking C executable cmsysTestProcess
381:info:build Building C object Source/kwsys/CMakeFiles/cmsysTestsC.dir/cmsysTestsC.c.o
382:info:build [ 18%] Building CXX object Source/kwsys/CMakeFiles/cmsys.dir/RegularExpression.cxx.o
383:info:build make[2]: Leaving directory `/opt/local/var/macports/build/_opt_local_var_macports_sources_rsync.macports.org_release_tarballs_ports_devel_cmake/cmake/work/cmake-3.0.2'
384:info:build [ 18%] Built target cmsysTestProcess
385:info:build [ 19%] [ 19%] Building C object Source/CursesDialog/form/CMakeFiles/cmForm.dir/fld_stat.c.o
386:info:build Building C object Source/kwsys/CMakeFiles/cmsysTestsC.dir/testEncode.c.o
387:info:build [ 19%] Building CXX object Source/kwsys/CMakeFiles/cmsys.dir/SystemTools.cxx.o
388:info:build Linking C executable cmsysTestSharedForward
389:info:build [ 20%] Building C object Source/kwsys/CMakeFiles/cmsysTestsC.dir/testTerminal.c.o
390:info:build [ 20%] make[2]: Leaving directory `/opt/local/var/macports/build/_opt_local_var_macports_sources_rsync.macports.org_release_tarballs_ports_devel_cmake/cmake/work/cmake-3.0.2'
391:info:build Building C object Source/CursesDialog/form/CMakeFiles/cmForm.dir/fld_type.c.o
392:info:build [ 20%] Built target cmsysTestSharedForward
393:info:build [ 21%] Building CXX object Source/kwsys/CMakeFiles/cmsys.dir/CommandLineArguments.cxx.o
394:info:build Linking C executable cmsysTestsC
395:info:build [ 21%] Building C object Source/CursesDialog/form/CMakeFiles/cmForm.dir/fld_user.c.o
396:info:build make[2]: Leaving directory `/opt/local/var/macports/build/_opt_local_var_macports_sources_rsync.macports.org_release_tarballs_ports_devel_cmake/cmake/work/cmake-3.0.2'
397:info:build [ 21%] Built target cmsysTestsC
398:info:build [ 21%] Building CXX object Source/kwsys/CMakeFiles/cmsys.dir/IOStream.cxx.o
399:info:build [ 22%] Building C object Source/CursesDialog/form/CMakeFiles/cmForm.dir/frm_cursor.c.o
400:info:build [ 22%] Building C object Source/CursesDialog/form/CMakeFiles/cmForm.dir/frm_data.c.o
401:info:build [ 22%] Building C object Source/CursesDialog/form/CMakeFiles/cmForm.dir/frm_def.c.o
402:info:build [ 22%] Building CXX object Source/kwsys/CMakeFiles/cmsys.dir/SystemInformation.cxx.o
403:info:build [ 23%] Building C object Source/CursesDialog/form/CMakeFiles/cmForm.dir/frm_driver.c.o
404:info:build [ 23%] Building C object Source/CursesDialog/form/CMakeFiles/cmForm.dir/frm_hook.c.o
405:info:build [ 23%] Building C object Source/CursesDialog/form/CMakeFiles/cmForm.dir/frm_opts.c.o
406:info:build [ 24%] Building C object Source/CursesDialog/form/CMakeFiles/cmForm.dir/frm_page.c.o
407:info:build [ 24%] Building C object Source/CursesDialog/form/CMakeFiles/cmForm.dir/frm_post.c.o
408:info:build [ 24%] Building C object Source/CursesDialog/form/CMakeFiles/cmForm.dir/frm_req_name.c.o
409:info:build [ 25%] [ 25%] Building C object Source/CursesDialog/form/CMakeFiles/cmForm.dir/frm_scale.c.o
410:info:build Building C object Source/CursesDialog/form/CMakeFiles/cmForm.dir/frm_sub.c.o
411:info:build [ 25%] [ 26%] Building C object Source/CursesDialog/form/CMakeFiles/cmForm.dir/frm_user.c.o
412:info:build Building C object Source/CursesDialog/form/CMakeFiles/cmForm.dir/frm_win.c.o
413:info:build [ 26%] Building C object Source/CursesDialog/form/CMakeFiles/cmForm.dir/fty_alnum.c.o
414:info:build [ 26%] Building C object Source/CursesDialog/form/CMakeFiles/cmForm.dir/fty_alpha.c.o
415:info:build [ 27%] Building C object Source/CursesDialog/form/CMakeFiles/cmForm.dir/fty_enum.c.o
416:info:build [ 27%] Building C object Source/CursesDialog/form/CMakeFiles/cmForm.dir/fty_int.c.o
417:info:build [ 28%] Building C object Source/CursesDialog/form/CMakeFiles/cmForm.dir/fty_ipv4.c.o
418:info:build [ 28%] [ 28%] Building C object Source/CursesDialog/form/CMakeFiles/cmForm.dir/fty_num.c.o
419:info:build Building C object Source/CursesDialog/form/CMakeFiles/cmForm.dir/fty_regex.c.o
420:info:build Linking C static library libcmForm.a
421:info:build make[2]: Leaving directory `/opt/local/var/macports/build/_opt_local_var_macports_sources_rsync.macports.org_release_tarballs_ports_devel_cmake/cmake/work/cmake-3.0.2'
422:info:build [ 28%] Built target cmForm
423:info:build Linking CXX static library libcmsys.a
424:info:build make[2]: Leaving directory `/opt/local/var/macports/build/_opt_local_var_macports_sources_rsync.macports.org_release_tarballs_ports_devel_cmake/cmake/work/cmake-3.0.2'
425:info:build [ 28%] Built target cmsys
426:info:build make[2]: Entering directory `/opt/local/var/macports/build/_opt_local_var_macports_sources_rsync.macports.org_release_tarballs_ports_devel_cmake/cmake/work/cmake-3.0.2'
427:info:build make[2]: Entering directory `/opt/local/var/macports/build/_opt_local_var_macports_sources_rsync.macports.org_release_tarballs_ports_devel_cmake/cmake/work/cmake-3.0.2'
428:info:build make[2]: Entering directory `/opt/local/var/macports/build/_opt_local_var_macports_sources_rsync.macports.org_release_tarballs_ports_devel_cmake/cmake/work/cmake-3.0.2'
429:info:build make[2]: Entering directory `/opt/local/var/macports/build/_opt_local_var_macports_sources_rsync.macports.org_release_tarballs_ports_devel_cmake/cmake/work/cmake-3.0.2'
430:info:build Scanning dependencies of target cmsysTestDynload
431:info:build make[2]: Leaving directory `/opt/local/var/macports/build/_opt_local_var_macports_sources_rsync.macports.org_release_tarballs_ports_devel_cmake/cmake/work/cmake-3.0.2'
432:info:build Scanning dependencies of target OSXScriptLauncher
433:info:build make[2]: Entering directory `/opt/local/var/macports/build/_opt_local_var_macports_sources_rsync.macports.org_release_tarballs_ports_devel_cmake/cmake/work/cmake-3.0.2'
434:info:build make[2]: Leaving directory `/opt/local/var/macports/build/_opt_local_var_macports_sources_rsync.macports.org_release_tarballs_ports_devel_cmake/cmake/work/cmake-3.0.2'
435:info:build make[2]: Entering directory `/opt/local/var/macports/build/_opt_local_var_macports_sources_rsync.macports.org_release_tarballs_ports_devel_cmake/cmake/work/cmake-3.0.2'
436:info:build [ 29%] Building C object Source/kwsys/CMakeFiles/cmsysTestDynload.dir/testDynload.c.o
437:info:build [ 29%] Building CXX object Source/CMakeFiles/OSXScriptLauncher.dir/CPack/OSXScriptLauncher.cxx.o
438:info:build Scanning dependencies of target cmsysTestsCxx
439:info:build make[2]: Leaving directory `/opt/local/var/macports/build/_opt_local_var_macports_sources_rsync.macports.org_release_tarballs_ports_devel_cmake/cmake/work/cmake-3.0.2'
440:info:build make[2]: Entering directory `/opt/local/var/macports/build/_opt_local_var_macports_sources_rsync.macports.org_release_tarballs_ports_devel_cmake/cmake/work/cmake-3.0.2'
441:info:build [ 29%] [ 29%] [ 30%] [ 30%] Building CXX object Source/kwsys/CMakeFiles/cmsysTestsCxx.dir/testAutoPtr.cxx.o
442:info:build Building CXX object Source/kwsys/CMakeFiles/cmsysTestsCxx.dir/cmsysTestsCxx.cxx.o
443:info:build Linking C shared module libcmsysTestDynload.so
444:info:build Building CXX object Source/kwsys/CMakeFiles/cmsysTestsCxx.dir/testHashSTL.cxx.o
445:info:build [ 30%] Building CXX object Source/kwsys/CMakeFiles/cmsysTestsCxx.dir/testIOS.cxx.o
446:info:build Building CXX object Source/kwsys/CMakeFiles/cmsysTestsCxx.dir/testSystemTools.cxx.o
447:info:build make[2]: Leaving directory `/opt/local/var/macports/build/_opt_local_var_macports_sources_rsync.macports.org_release_tarballs_ports_devel_cmake/cmake/work/cmake-3.0.2'
448:info:build [ 30%] Built target cmsysTestDynload
449:info:build [ 31%] Building CXX object Source/kwsys/CMakeFiles/cmsysTestsCxx.dir/testCommandLineArguments.cxx.o
450:info:build [ 31%] [ 31%] Building CXX object Source/kwsys/CMakeFiles/cmsysTestsCxx.dir/testCommandLineArguments1.cxx.o
451:info:build Building CXX object Source/kwsys/CMakeFiles/cmsysTestsCxx.dir/testEncoding.cxx.o
452:info:build Scanning dependencies of target CMakeLib
453:info:build make[2]: Leaving directory `/opt/local/var/macports/build/_opt_local_var_macports_sources_rsync.macports.org_release_tarballs_ports_devel_cmake/cmake/work/cmake-3.0.2'
454:info:build make[2]: Entering directory `/opt/local/var/macports/build/_opt_local_var_macports_sources_rsync.macports.org_release_tarballs_ports_devel_cmake/cmake/work/cmake-3.0.2'
455:info:build [ 31%] Building CXX object Source/CMakeFiles/CMakeLib.dir/cmStandardIncludes.cxx.o
456:info:build [ 31%] Building CXX object Source/CMakeFiles/CMakeLib.dir/cmArchiveWrite.cxx.o
457:info:build [ 32%] Building CXX object Source/CMakeFiles/CMakeLib.dir/cmBootstrapCommands1.cxx.o
458:info:build [ 32%] Building CXX object Source/CMakeFiles/CMakeLib.dir/cmBootstrapCommands2.cxx.o
459:info:build Linking CXX executable ../bin/OSXScriptLauncher
460:info:build [ 32%] Building CXX object Source/CMakeFiles/CMakeLib.dir/cmCacheManager.cxx.o
461:info:build make[2]: Leaving directory `/opt/local/var/macports/build/_opt_local_var_macports_sources_rsync.macports.org_release_tarballs_ports_devel_cmake/cmake/work/cmake-3.0.2'
462:info:build [ 32%] Built target OSXScriptLauncher
463:info:build [ 33%] Building CXX object Source/kwsys/CMakeFiles/cmsysTestsCxx.dir/testFStream.cxx.o
464:info:build [ 34%] Building CXX object Source/CMakeFiles/CMakeLib.dir/cmCommands.cxx.o
465:info:build [ 34%] Building CXX object Source/kwsys/CMakeFiles/cmsysTestsCxx.dir/testSystemInformation.cxx.o
466:info:build /opt/local/var/macports/build/_opt_local_var_macports_sources_rsync.macports.org_release_tarballs_ports_devel_cmake/cmake/work/cmake-3.0.2/Source/cmArchiveWrite.cxx:67:10: warning: 'archive_write_set_compression_none' is deprecated [-Wdeprecated-declarations]
467:info:build       if(archive_write_set_compression_none(this->Archive) != ARCHIVE_OK)
468:info:build          ^
469:info:build /opt/local/include/archive.h:628:15: note: 'archive_write_set_compression_none' has been explicitly marked deprecated here
470:info:build __LA_DECL int archive_write_set_compression_none(struct archive *)
471:info:build               ^
472:info:build /opt/local/var/macports/build/_opt_local_var_macports_sources_rsync.macports.org_release_tarballs_ports_devel_cmake/cmake/work/cmake-3.0.2/Source/cmArchiveWrite.cxx:75:10: warning: 'archive_write_set_compression_compress' is deprecated [-Wdeprecated-declarations]
473:info:build       if(archive_write_set_compression_compress(this->Archive) != ARCHIVE_OK)
474:info:build          ^
475:info:build /opt/local/include/archive.h:620:15: note: 'archive_write_set_compression_compress' has been explicitly marked deprecated here
476:info:build __LA_DECL int archive_write_set_compression_compress(struct archive *)
477:info:build               ^
478:info:build /opt/local/var/macports/build/_opt_local_var_macports_sources_rsync.macports.org_release_tarballs_ports_devel_cmake/cmake/work/cmake-3.0.2/Source/cmArchiveWrite.cxx:83:10: warning: 'archive_write_set_compression_gzip' is deprecated [-Wdeprecated-declarations]
479:info:build       if(archive_write_set_compression_gzip(this->Archive) != ARCHIVE_OK)
480:info:build          ^
481:info:build /opt/local/include/archive.h:622:15: note: 'archive_write_set_compression_gzip' has been explicitly marked deprecated here
482:info:build __LA_DECL int archive_write_set_compression_gzip(struct archive *)
483:info:build               ^
484:info:build /opt/local/var/macports/build/_opt_local_var_macports_sources_rsync.macports.org_release_tarballs_ports_devel_cmake/cmake/work/cmake-3.0.2/Source/cmArchiveWrite.cxx:91:10: warning: 'archive_write_set_compression_bzip2' is deprecated [-Wdeprecated-declarations]
485:info:build       if(archive_write_set_compression_bzip2(this->Archive) != ARCHIVE_OK)
486:info:build          ^
487:info:build /opt/local/include/archive.h:618:15: note: 'archive_write_set_compression_bzip2' has been explicitly marked deprecated here
488:info:build __LA_DECL int archive_write_set_compression_bzip2(struct archive *)
489:info:build               ^
490:info:build /opt/local/var/macports/build/_opt_local_var_macports_sources_rsync.macports.org_release_tarballs_ports_devel_cmake/cmake/work/cmake-3.0.2/Source/cmArchiveWrite.cxx:99:10: warning: 'archive_write_set_compression_lzma' is deprecated [-Wdeprecated-declarations]
491:info:build       if(archive_write_set_compression_lzma(this->Archive) != ARCHIVE_OK)
492:info:build          ^
493:info:build /opt/local/include/archive.h:626:15: note: 'archive_write_set_compression_lzma' has been explicitly marked deprecated here
494:info:build __LA_DECL int archive_write_set_compression_lzma(struct archive *)
495:info:build               ^
496:info:build /opt/local/var/macports/build/_opt_local_var_macports_sources_rsync.macports.org_release_tarballs_ports_devel_cmake/cmake/work/cmake-3.0.2/Source/cmArchiveWrite.cxx:107:10: warning: 'archive_write_set_compression_xz' is deprecated [-Wdeprecated-declarations]
497:info:build       if(archive_write_set_compression_xz(this->Archive) != ARCHIVE_OK)
498:info:build          ^
499:info:build /opt/local/include/archive.h:632:15: note: 'archive_write_set_compression_xz' has been explicitly marked deprecated here
500:info:build __LA_DECL int archive_write_set_compression_xz(struct archive *)
501:info:build               ^
502:info:build /opt/local/var/macports/build/_opt_local_var_macports_sources_rsync.macports.org_release_tarballs_ports_devel_cmake/cmake/work/cmake-3.0.2/Source/cmArchiveWrite.cxx:165:3: warning: 'archive_read_finish' is deprecated [-Wdeprecated-declarations]
503:info:build   archive_read_finish(this->Disk);
504:info:build   ^
505:info:build /opt/local/include/archive.h:585:17: note: 'archive_read_finish' has been explicitly marked deprecated here
506:info:build __LA_DECL int            archive_read_finish(struct archive *) __LA_DEPRECATED;
507:info:build                          ^
508:info:build /opt/local/var/macports/build/_opt_local_var_macports_sources_rsync.macports.org_release_tarballs_ports_devel_cmake/cmake/work/cmake-3.0.2/Source/cmArchiveWrite.cxx:166:3: warning: 'archive_write_finish' is deprecated [-Wdeprecated-declarations]
509:info:build   archive_write_finish(this->Archive);
510:info:build   ^
511:info:build /opt/local/include/archive.h:721:17: note: 'archive_write_finish' has been explicitly marked deprecated here
512:info:build __LA_DECL int            archive_write_finish(struct archive *) __LA_DEPRECATED;
513:info:build                          ^
514:info:build [ 34%] Building CXX object Source/kwsys/CMakeFiles/cmsysTestsCxx.dir/testDynamicLoader.cxx.o
515:info:build 8 warnings generated.
516:info:build [ 34%] Building CXX object Source/CMakeFiles/CMakeLib.dir/cmCommandArgumentLexer.cxx.o
517:info:build [ 34%] Building CXX object Source/CMakeFiles/CMakeLib.dir/cmCommandArgumentParser.cxx.o
518:info:build [ 35%] Building CXX object Source/CMakeFiles/CMakeLib.dir/cmCommandArgumentParserHelper.cxx.o
519:info:build Linking CXX executable cmsysTestsCxx
520:info:build make[2]: Leaving directory `/opt/local/var/macports/build/_opt_local_var_macports_sources_rsync.macports.org_release_tarballs_ports_devel_cmake/cmake/work/cmake-3.0.2'
521:info:build [ 35%] Built target cmsysTestsCxx
522:info:build [ 35%] Building CXX object Source/CMakeFiles/CMakeLib.dir/cmComputeComponentGraph.cxx.o
523:info:build [ 35%] Building CXX object Source/CMakeFiles/CMakeLib.dir/cmComputeLinkDepends.cxx.o
524:info:build [ 36%] Building CXX object Source/CMakeFiles/CMakeLib.dir/cmComputeLinkInformation.cxx.o
525:info:build [ 36%] Building CXX object Source/CMakeFiles/CMakeLib.dir/cmComputeTargetDepends.cxx.o
526:info:build [ 36%] Building CXX object Source/CMakeFiles/CMakeLib.dir/cmCryptoHash.cxx.o
527:info:build [ 37%] Building CXX object Source/CMakeFiles/CMakeLib.dir/cmCustomCommand.cxx.o
528:info:build [ 37%] Building CXX object Source/CMakeFiles/CMakeLib.dir/cmCustomCommandGenerator.cxx.o
529:info:build [ 37%] Building CXX object Source/CMakeFiles/CMakeLib.dir/cmDefinitions.cxx.o
530:info:build [ 38%] Building CXX object Source/CMakeFiles/CMakeLib.dir/cmDepends.cxx.o
531:info:build [ 38%] Building CXX object Source/CMakeFiles/CMakeLib.dir/cmDependsC.cxx.o
532:info:build [ 38%] Building CXX object Source/CMakeFiles/CMakeLib.dir/cmDependsFortran.cxx.o
533:info:build [ 39%] Building CXX object Source/CMakeFiles/CMakeLib.dir/cmDependsFortranLexer.cxx.o
534:info:build [ 39%] Building CXX object Source/CMakeFiles/CMakeLib.dir/cmDependsFortranParser.cxx.o
535:info:build [ 39%] Building CXX object Source/CMakeFiles/CMakeLib.dir/cmDependsJava.cxx.o
536:info:build [ 40%] [ 40%] Building CXX object Source/CMakeFiles/CMakeLib.dir/cmDependsJavaLexer.cxx.o
537:info:build Building CXX object Source/CMakeFiles/CMakeLib.dir/cmDependsJavaParser.cxx.o
538:info:build [ 40%] Building CXX object Source/CMakeFiles/CMakeLib.dir/cmDependsJavaParserHelper.cxx.o
539:info:build [ 41%] Building CXX object Source/CMakeFiles/CMakeLib.dir/cmDocumentation.cxx.o
540:info:build [ 41%] Building CXX object Source/CMakeFiles/CMakeLib.dir/cmDocumentationFormatter.cxx.o
541:info:build [ 41%] Building CXX object Source/CMakeFiles/CMakeLib.dir/cmDocumentationSection.cxx.o
542:info:build [ 42%] Building CXX object Source/CMakeFiles/CMakeLib.dir/cmDynamicLoader.cxx.o
543:info:build [ 42%] Building CXX object Source/CMakeFiles/CMakeLib.dir/cmELF.cxx.o
544:info:build [ 42%] Building CXX object Source/CMakeFiles/CMakeLib.dir/cmExprLexer.cxx.o
545:info:build [ 43%] Building CXX object Source/CMakeFiles/CMakeLib.dir/cmExprParser.cxx.o
546:info:build [ 43%] Building CXX object Source/CMakeFiles/CMakeLib.dir/cmExprParserHelper.cxx.o
547:info:build [ 44%] Building CXX object Source/CMakeFiles/CMakeLib.dir/cmExportBuildFileGenerator.cxx.o
548:info:build /opt/local/var/macports/build/_opt_local_var_macports_sources_rsync.macports.org_release_tarballs_ports_devel_cmake/cmake/work/cmake-3.0.2/Source/cmELF.cxx:120:42: error: use of undeclared identifier 'DT_SONAME'
549:info:build     return this->GetDynamicSectionString(DT_SONAME);
550:info:build                                          ^
551:info:build /opt/local/var/macports/build/_opt_local_var_macports_sources_rsync.macports.org_release_tarballs_ports_devel_cmake/cmake/work/cmake-3.0.2/Source/cmELF.cxx:126:42: error: use of undeclared identifier 'DT_RPATH'
552:info:build     return this->GetDynamicSectionString(DT_RPATH);
553:info:build                                          ^
554:info:build /opt/local/var/macports/build/_opt_local_var_macports_sources_rsync.macports.org_release_tarballs_ports_devel_cmake/cmake/work/cmake-3.0.2/Source/cmELF.cxx:179:11: error: unknown type name 'Elf32_Dyn'; did you mean 'Elf32_Sym'?
555:info:build   typedef Elf32_Dyn  ELF_Dyn;
556:info:build           ^~~~~~~~~
557:info:build           Elf32_Sym
558:info:build /usr/include/elf.h:483:3: note: 'Elf32_Sym' declared here
559:info:build } Elf32_Sym;
560:info:build   ^
561:info:build /opt/local/var/macports/build/_opt_local_var_macports_sources_rsync.macports.org_release_tarballs_ports_devel_cmake/cmake/work/cmake-3.0.2/Source/cmELF.cxx:189:11: error: unknown type name 'Elf64_Dyn'; did you mean 'Elf64_Sym'?
562:info:build   typedef Elf64_Dyn  ELF_Dyn;
563:info:build           ^~~~~~~~~
564:info:build           Elf64_Sym
565:info:build /usr/include/elf.h:493:3: note: 'Elf64_Sym' declared here
566:info:build } Elf64_Sym;
567:info:build   ^
568:info:build /opt/local/var/macports/build/_opt_local_var_macports_sources_rsync.macports.org_release_tarballs_ports_devel_cmake/cmake/work/cmake-3.0.2/Source/cmELF.cxx:300:12: error: use of undeclared identifier 'DT_NULL'
569:info:build       case DT_NULL:     /* dyn.d_un ignored */         break;
570:info:build            ^
571:info:build /opt/local/var/macports/build/_opt_local_var_macports_sources_rsync.macports.org_release_tarballs_ports_devel_cmake/cmake/work/cmake-3.0.2/Source/cmELF.cxx:301:12: error: use of undeclared identifier 'DT_NEEDED'
572:info:build       case DT_NEEDED:   cmELFByteSwap(dyn.d_un.d_val); break;
573:info:build            ^
574:info:build /opt/local/var/macports/build/_opt_local_var_macports_sources_rsync.macports.org_release_tarballs_ports_devel_cmake/cmake/work/cmake-3.0.2/Source/cmELF.cxx:302:12: error: use of undeclared identifier 'DT_PLTRELSZ'
575:info:build       case DT_PLTRELSZ: cmELFByteSwap(dyn.d_un.d_val); break;
576:info:build            ^
577:info:build /opt/local/var/macports/build/_opt_local_var_macports_sources_rsync.macports.org_release_tarballs_ports_devel_cmake/cmake/work/cmake-3.0.2/Source/cmELF.cxx:303:12: error: use of undeclared identifier 'DT_PLTGOT'
578:info:build       case DT_PLTGOT:   cmELFByteSwap(dyn.d_un.d_ptr); break;
579:info:build            ^
580:info:build /opt/local/var/macports/build/_opt_local_var_macports_sources_rsync.macports.org_release_tarballs_ports_devel_cmake/cmake/work/cmake-3.0.2/Source/cmELF.cxx:304:12: error: use of undeclared identifier 'DT_HASH'
581:info:build       case DT_HASH:     cmELFByteSwap(dyn.d_un.d_ptr); break;
582:info:build            ^
583:info:build /opt/local/var/macports/build/_opt_local_var_macports_sources_rsync.macports.org_release_tarballs_ports_devel_cmake/cmake/work/cmake-3.0.2/Source/cmELF.cxx:305:12: error: use of undeclared identifier 'DT_STRTAB'
584:info:build       case DT_STRTAB:   cmELFByteSwap(dyn.d_un.d_ptr); break;
585:info:build            ^
586:info:build /opt/local/var/macports/build/_opt_local_var_macports_sources_rsync.macports.org_release_tarballs_ports_devel_cmake/cmake/work/cmake-3.0.2/Source/cmELF.cxx:306:12: error: use of undeclared identifier 'DT_SYMTAB'
587:info:build       case DT_SYMTAB:   cmELFByteSwap(dyn.d_un.d_ptr); break;
588:info:build            ^
589:info:build /opt/local/var/macports/build/_opt_local_var_macports_sources_rsync.macports.org_release_tarballs_ports_devel_cmake/cmake/work/cmake-3.0.2/Source/cmELF.cxx:307:12: error: use of undeclared identifier 'DT_RELA'
590:info:build       case DT_RELA:     cmELFByteSwap(dyn.d_un.d_ptr); break;
591:info:build            ^
592:info:build /opt/local/var/macports/build/_opt_local_var_macports_sources_rsync.macports.org_release_tarballs_ports_devel_cmake/cmake/work/cmake-3.0.2/Source/cmELF.cxx:308:12: error: use of undeclared identifier 'DT_RELASZ'
593:info:build       case DT_RELASZ:   cmELFByteSwap(dyn.d_un.d_val); break;
594:info:build            ^
595:info:build /opt/local/var/macports/build/_opt_local_var_macports_sources_rsync.macports.org_release_tarballs_ports_devel_cmake/cmake/work/cmake-3.0.2/Source/cmELF.cxx:309:12: error: use of undeclared identifier 'DT_RELAENT'
596:info:build       case DT_RELAENT:  cmELFByteSwap(dyn.d_un.d_val); break;
597:info:build            ^
598:info:build /opt/local/var/macports/build/_opt_local_var_macports_sources_rsync.macports.org_release_tarballs_ports_devel_cmake/cmake/work/cmake-3.0.2/Source/cmELF.cxx:310:12: error: use of undeclared identifier 'DT_STRSZ'
599:info:build       case DT_STRSZ:    cmELFByteSwap(dyn.d_un.d_val); break;
600:info:build            ^
601:info:build /opt/local/var/macports/build/_opt_local_var_macports_sources_rsync.macports.org_release_tarballs_ports_devel_cmake/cmake/work/cmake-3.0.2/Source/cmELF.cxx:311:12: error: use of undeclared identifier 'DT_SYMENT'
602:info:build       case DT_SYMENT:   cmELFByteSwap(dyn.d_un.d_val); break;
603:info:build            ^
604:info:build /opt/local/var/macports/build/_opt_local_var_macports_sources_rsync.macports.org_release_tarballs_ports_devel_cmake/cmake/work/cmake-3.0.2/Source/cmELF.cxx:312:12: error: use of undeclared identifier 'DT_INIT'
605:info:build       case DT_INIT:     cmELFByteSwap(dyn.d_un.d_ptr); break;
606:info:build            ^
607:info:build /opt/local/var/macports/build/_opt_local_var_macports_sources_rsync.macports.org_release_tarballs_ports_devel_cmake/cmake/work/cmake-3.0.2/Source/cmELF.cxx:313:12: error: use of undeclared identifier 'DT_FINI'
608:info:build       case DT_FINI:     cmELFByteSwap(dyn.d_un.d_ptr); break;
609:info:build            ^
610:info:build /opt/local/var/macports/build/_opt_local_var_macports_sources_rsync.macports.org_release_tarballs_ports_devel_cmake/cmake/work/cmake-3.0.2/Source/cmELF.cxx:314:12: error: use of undeclared identifier 'DT_SONAME'
611:info:build       case DT_SONAME:   cmELFByteSwap(dyn.d_un.d_val); break;
612:info:build            ^
613:info:build [ 44%] fatal error: too many errors emitted, stopping now [-ferror-limit=]
614:info:build Building CXX object Source/CMakeFiles/CMakeLib.dir/cmExportFileGenerator.cxx.o
615:info:build [ 44%] 20 errors generated.
616:info:build Building CXX object Source/CMakeFiles/CMakeLib.dir/cmExportInstallFileGenerator.cxx.o
617:info:build make[2]: *** [Source/CMakeFiles/CMakeLib.dir/cmELF.cxx.o] Error 1
618:info:build make[2]: *** Waiting for unfinished jobs....
619:info:build make[2]: Leaving directory `/opt/local/var/macports/build/_opt_local_var_macports_sources_rsync.macports.org_release_tarballs_ports_devel_cmake/cmake/work/cmake-3.0.2'
620:info:build make[1]: *** [Source/CMakeFiles/CMakeLib.dir/all] Error 2
621:info:build make[1]: Leaving directory `/opt/local/var/macports/build/_opt_local_var_macports_sources_rsync.macports.org_release_tarballs_ports_devel_cmake/cmake/work/cmake-3.0.2'
622:info:build make: *** [all] Error 2
623:info:build make: Leaving directory `/opt/local/var/macports/build/_opt_local_var_macports_sources_rsync.macports.org_release_tarballs_ports_devel_cmake/cmake/work/cmake-3.0.2'
624:info:build Command failed:  cd "/opt/local/var/macports/build/_opt_local_var_macports_sources_rsync.macports.org_release_tarballs_ports_devel_cmake/cmake/work/cmake-3.0.2" && /usr/bin/make -j8 -w all
625:info:build Exit code: 2
626:error:build org.macports.build for port cmake returned: command execution failed
627:debug:build Error code: CHILDSTATUS 79579 2
628:debug:build Backtrace: command execution failed
629    while executing
630"system -nice 0 $fullcmdstring"
631    ("eval" body line 1)
632    invoked from within
633"eval system $notty $nice \$fullcmdstring"
634    invoked from within
635"command_exec build"
636    (procedure "portbuild::build_main" line 8)
637    invoked from within
638"portbuild::build_main org.macports.build"
639    ("eval" body line 1)
640    invoked from within
641"eval $procedure $targetname"
642:info:build Warning: targets not executed for cmake: org.macports.build
643:notice:build Please see the log file for port cmake for details:
644    /opt/local/var/macports/logs/_opt_local_var_macports_sources_rsync.macports.org_release_tarballs_ports_devel_cmake/cmake/main.log