| 1 | version:1 |
|---|
| 2 | :debug:main epoch: in tree: 0 installed: 0 |
|---|
| 3 | :debug:main jpeg 9a_1 exists in the ports tree |
|---|
| 4 | :debug:main jpeg 9a_1 is the latest installed |
|---|
| 5 | :debug:main jpeg 9a_1 is active |
|---|
| 6 | :debug:main Merging existing variants '' into variants |
|---|
| 7 | :debug:main new fully merged portvariants: |
|---|
| 8 | :debug:main Changing to port directory: /opt/local/var/macports/sources/rsync.macports.org/release/tarballs/ports/graphics/jpeg |
|---|
| 9 | :debug:main OS darwin/14.0.0 (Mac OS X 10.10) arch i386 |
|---|
| 10 | :debug:main adding the default universal variant |
|---|
| 11 | :debug:main Reading variant descriptions from /opt/local/var/macports/sources/rsync.macports.org/release/tarballs/ports/_resources/port1.0/variant_descriptions.conf |
|---|
| 12 | :debug:main Running callback portconfigure::add_automatic_compiler_dependencies |
|---|
| 13 | :debug:main Finished running callback portconfigure::add_automatic_compiler_dependencies |
|---|
| 14 | :debug:main Running callback portbuild::add_automatic_buildsystem_dependencies |
|---|
| 15 | :debug:main Finished running callback portbuild::add_automatic_buildsystem_dependencies |
|---|
| 16 | :debug:main No need to upgrade! jpeg 9a_1 >= jpeg 9a_1 |
|---|
| 17 | :debug:main epoch: in tree: 0 installed: 0 |
|---|
| 18 | :debug:main libpng 1.6.13_0 exists in the ports tree |
|---|
| 19 | :debug:main libpng 1.6.13_0 is the latest installed |
|---|
| 20 | :debug:main libpng 1.6.13_0 is active |
|---|
| 21 | :debug:main Merging existing variants '' into variants |
|---|
| 22 | :debug:main new fully merged portvariants: |
|---|
| 23 | :debug:main Changing to port directory: /opt/local/var/macports/sources/rsync.macports.org/release/tarballs/ports/graphics/libpng |
|---|
| 24 | :debug:main OS darwin/14.0.0 (Mac OS X 10.10) arch i386 |
|---|
| 25 | :debug:main adding the default universal variant |
|---|
| 26 | :debug:main Reading variant descriptions from /opt/local/var/macports/sources/rsync.macports.org/release/tarballs/ports/_resources/port1.0/variant_descriptions.conf |
|---|
| 27 | :debug:main Running callback portconfigure::add_automatic_compiler_dependencies |
|---|
| 28 | :debug:main Finished running callback portconfigure::add_automatic_compiler_dependencies |
|---|
| 29 | :debug:main Running callback portbuild::add_automatic_buildsystem_dependencies |
|---|
| 30 | :debug:main Finished running callback portbuild::add_automatic_buildsystem_dependencies |
|---|
| 31 | :debug:main No need to upgrade! libpng 1.6.13_0 >= libpng 1.6.13_0 |
|---|
| 32 | :debug:main epoch: in tree: 0 installed: 0 |
|---|
| 33 | :debug:main zlib 1.2.8_0 exists in the ports tree |
|---|
| 34 | :debug:main zlib 1.2.8_0 is the latest installed |
|---|
| 35 | :debug:main zlib 1.2.8_0 is active |
|---|
| 36 | :debug:main Merging existing variants '' into variants |
|---|
| 37 | :debug:main new fully merged portvariants: |
|---|
| 38 | :debug:main Changing to port directory: /opt/local/var/macports/sources/rsync.macports.org/release/tarballs/ports/archivers/zlib |
|---|
| 39 | :debug:main OS darwin/14.0.0 (Mac OS X 10.10) arch i386 |
|---|
| 40 | :debug:main Sourcing PortGroup xcodeversion 1.0 from /opt/local/var/macports/sources/rsync.macports.org/release/tarballs/ports/_resources/port1.0/group/xcodeversion-1.0.tcl |
|---|
| 41 | :debug:main adding the default universal variant |
|---|
| 42 | :debug:main Reading variant descriptions from /opt/local/var/macports/sources/rsync.macports.org/release/tarballs/ports/_resources/port1.0/variant_descriptions.conf |
|---|
| 43 | :debug:main Running callback portconfigure::add_automatic_compiler_dependencies |
|---|
| 44 | :debug:main Finished running callback portconfigure::add_automatic_compiler_dependencies |
|---|
| 45 | :debug:main Running callback portbuild::add_automatic_buildsystem_dependencies |
|---|
| 46 | :debug:main Finished running callback portbuild::add_automatic_buildsystem_dependencies |
|---|
| 47 | :debug:main No need to upgrade! zlib 1.2.8_0 >= zlib 1.2.8_0 |
|---|
| 48 | :msg:main ---> Computing dependencies for fltk:info:main .:debug:main Checking for conflicts against fltk |
|---|
| 49 | :debug:main Searching for dependency: fltk-devel |
|---|
| 50 | :debug:main Didn't find receipt, going to depspec regex for: fltk-devel |
|---|
| 51 | :debug:main Searching for dependency: jpeg |
|---|
| 52 | :debug:main Found Dependency: receipt exists for jpeg |
|---|
| 53 | :debug:main Searching for dependency: libpng |
|---|
| 54 | :debug:main Found Dependency: receipt exists for libpng |
|---|
| 55 | :debug:main Searching for dependency: zlib |
|---|
| 56 | :debug:main Found Dependency: receipt exists for zlib |
|---|
| 57 | :msg:main |
|---|
| 58 | :debug:main Executing org.macports.main (fltk) |
|---|
| 59 | :debug:main changing euid/egid - current euid: 0 - current egid: 0 |
|---|
| 60 | :debug:main egid changed to: 501 |
|---|
| 61 | :debug:main euid changed to: 502 |
|---|
| 62 | :debug:archivefetch archivefetch phase started at Sun Oct 19 20:59:34 EDT 2014 |
|---|
| 63 | :msg:archivefetch ---> Fetching archive for fltk |
|---|
| 64 | :debug:archivefetch Executing org.macports.archivefetch (fltk) |
|---|
| 65 | :debug:archivefetch euid/egid changed to: 0/0 |
|---|
| 66 | :debug:archivefetch chowned /opt/local/var/macports/incoming to macports |
|---|
| 67 | :debug:archivefetch euid/egid changed to: 502/501 |
|---|
| 68 | :info:archivefetch ---> fltk-1.3.2_2.darwin_14.x86_64.tbz2 doesn't seem to exist in /opt/local/var/macports/incoming/verified |
|---|
| 69 | :msg:archivefetch ---> Attempting to fetch fltk-1.3.2_2.darwin_14.x86_64.tbz2 from http://packages.macports.org/fltk |
|---|
| 70 | :debug:archivefetch Fetching archive failed:: The requested URL returned error: 404 Not Found |
|---|
| 71 | :msg:archivefetch ---> Attempting to fetch fltk-1.3.2_2.darwin_14.x86_64.tbz2 from http://lil.fr.packages.macports.org/fltk |
|---|
| 72 | :debug:archivefetch Fetching archive failed:: The requested URL returned error: 404 Not Found |
|---|
| 73 | :msg:archivefetch ---> Attempting to fetch fltk-1.3.2_2.darwin_14.x86_64.tbz2 from http://mse.uk.packages.macports.org/sites/packages.macports.org/fltk |
|---|
| 74 | :debug:archivefetch Fetching archive failed:: The requested URL returned error: 404 Not Found |
|---|
| 75 | :debug:archivefetch Privilege de-escalation not attempted as not running as root. |
|---|
| 76 | :debug:fetch fetch phase started at Sun Oct 19 20:59:36 EDT 2014 |
|---|
| 77 | :notice:fetch ---> Fetching distfiles for fltk |
|---|
| 78 | :debug:fetch Executing org.macports.fetch (fltk) |
|---|
| 79 | :debug:fetch Privilege de-escalation not attempted as not running as root. |
|---|
| 80 | :debug:checksum checksum phase started at Sun Oct 19 20:59:37 EDT 2014 |
|---|
| 81 | :notice:checksum ---> Verifying checksums for fltk |
|---|
| 82 | :debug:checksum Executing org.macports.checksum (fltk) |
|---|
| 83 | :info:checksum ---> Checksumming fltk-1.3.2-source.tar.gz |
|---|
| 84 | :debug:checksum Calculated (rmd160) is 5d697cb582cb80a1eca50c35696731eea5591768 |
|---|
| 85 | :debug:checksum Correct (rmd160) checksum for fltk-1.3.2-source.tar.gz |
|---|
| 86 | :debug:checksum Calculated (sha256) is 176044df94f31bd53a5806cf5054ca78b180bf9ae27ce47649608833695ee4a4 |
|---|
| 87 | :debug:checksum Correct (sha256) checksum for fltk-1.3.2-source.tar.gz |
|---|
| 88 | :debug:checksum Privilege de-escalation not attempted as not running as root. |
|---|
| 89 | :debug:extract extract phase started at Sun Oct 19 20:59:37 EDT 2014 |
|---|
| 90 | :notice:extract ---> Extracting fltk |
|---|
| 91 | :debug:extract Executing org.macports.extract (fltk) |
|---|
| 92 | :info:extract ---> Extracting fltk-1.3.2-source.tar.gz |
|---|
| 93 | :debug:extract setting option extract.args to '/opt/local/var/macports/distfiles/fltk/fltk-1.3.2-source.tar.gz' |
|---|
| 94 | :debug:extract Environment: |
|---|
| 95 | CC_PRINT_OPTIONS='YES' |
|---|
| 96 | CC_PRINT_OPTIONS_FILE='/opt/local/var/macports/build/_opt_local_var_macports_sources_rsync.macports.org_release_tarballs_ports_aqua_fltk/fltk/work/.CC_PRINT_OPTIONS' |
|---|
| 97 | CPATH='/opt/local/include' |
|---|
| 98 | LIBRARY_PATH='/opt/local/lib' |
|---|
| 99 | MACOSX_DEPLOYMENT_TARGET='10.10' |
|---|
| 100 | :debug:extract Assembled command: 'cd "/opt/local/var/macports/build/_opt_local_var_macports_sources_rsync.macports.org_release_tarballs_ports_aqua_fltk/fltk/work" && /usr/bin/gzip -dc '/opt/local/var/macports/distfiles/fltk/fltk-1.3.2-source.tar.gz' | /usr/bin/tar -xf -' |
|---|
| 101 | :debug:extract Executing command line: cd "/opt/local/var/macports/build/_opt_local_var_macports_sources_rsync.macports.org_release_tarballs_ports_aqua_fltk/fltk/work" && /usr/bin/gzip -dc '/opt/local/var/macports/distfiles/fltk/fltk-1.3.2-source.tar.gz' | /usr/bin/tar -xf - |
|---|
| 102 | :debug:extract euid/egid changed to: 0/0 |
|---|
| 103 | :debug:extract chowned /opt/local/var/macports/build/_opt_local_var_macports_sources_rsync.macports.org_release_tarballs_ports_aqua_fltk/fltk/work to macports |
|---|
| 104 | :debug:extract euid/egid changed to: 502/501 |
|---|
| 105 | :debug:extract Privilege de-escalation not attempted as not running as root. |
|---|
| 106 | :debug:patch patch phase started at Sun Oct 19 20:59:39 EDT 2014 |
|---|
| 107 | :debug:patch Executing org.macports.patch (fltk) |
|---|
| 108 | :notice:patch ---> Applying patches to fltk |
|---|
| 109 | :info:patch ---> Applying patch-fluid-Makefile.diff |
|---|
| 110 | :debug:patch Environment: |
|---|
| 111 | CC_PRINT_OPTIONS='YES' |
|---|
| 112 | CC_PRINT_OPTIONS_FILE='/opt/local/var/macports/build/_opt_local_var_macports_sources_rsync.macports.org_release_tarballs_ports_aqua_fltk/fltk/work/.CC_PRINT_OPTIONS' |
|---|
| 113 | CPATH='/opt/local/include' |
|---|
| 114 | LIBRARY_PATH='/opt/local/lib' |
|---|
| 115 | MACOSX_DEPLOYMENT_TARGET='10.10' |
|---|
| 116 | :debug:patch Assembled command: 'cd "/opt/local/var/macports/build/_opt_local_var_macports_sources_rsync.macports.org_release_tarballs_ports_aqua_fltk/fltk/work/fltk-1.3.2" && /usr/bin/patch -p0' |
|---|
| 117 | :debug:patch Executing command line: cd "/opt/local/var/macports/build/_opt_local_var_macports_sources_rsync.macports.org_release_tarballs_ports_aqua_fltk/fltk/work/fltk-1.3.2" && /usr/bin/patch -p0 < '/opt/local/var/macports/sources/rsync.macports.org/release/tarballs/ports/aqua/fltk/files/patch-fluid-Makefile.diff' |
|---|
| 118 | :info:patch patching file fluid/Makefile |
|---|
| 119 | :info:patch ---> Applying patch-src-Makefile.diff |
|---|
| 120 | :debug:patch Environment: |
|---|
| 121 | CC_PRINT_OPTIONS='YES' |
|---|
| 122 | CC_PRINT_OPTIONS_FILE='/opt/local/var/macports/build/_opt_local_var_macports_sources_rsync.macports.org_release_tarballs_ports_aqua_fltk/fltk/work/.CC_PRINT_OPTIONS' |
|---|
| 123 | CPATH='/opt/local/include' |
|---|
| 124 | LIBRARY_PATH='/opt/local/lib' |
|---|
| 125 | MACOSX_DEPLOYMENT_TARGET='10.10' |
|---|
| 126 | :debug:patch Assembled command: 'cd "/opt/local/var/macports/build/_opt_local_var_macports_sources_rsync.macports.org_release_tarballs_ports_aqua_fltk/fltk/work/fltk-1.3.2" && /usr/bin/patch -p0' |
|---|
| 127 | :debug:patch Executing command line: cd "/opt/local/var/macports/build/_opt_local_var_macports_sources_rsync.macports.org_release_tarballs_ports_aqua_fltk/fltk/work/fltk-1.3.2" && /usr/bin/patch -p0 < '/opt/local/var/macports/sources/rsync.macports.org/release/tarballs/ports/aqua/fltk/files/patch-src-Makefile.diff' |
|---|
| 128 | :info:patch patching file src/Makefile |
|---|
| 129 | :info:patch Hunk #1 succeeded at 355 with fuzz 2. |
|---|
| 130 | :debug:patch Executing proc-post-org.macports.patch-patch-0 |
|---|
| 131 | :info:patch ---> Patching Makefile: s|/Applications|/Applications/MacPorts/fltk|g |
|---|
| 132 | :debug:patch Executing reinplace: /usr/bin/sed s|/Applications|/Applications/MacPorts/fltk|g < /opt/local/var/macports/build/_opt_local_var_macports_sources_rsync.macports.org_release_tarballs_ports_aqua_fltk/fltk/work/fltk-1.3.2/fluid/Makefile >@ file10 2>@stderr |
|---|
| 133 | :debug:patch euid/egid changed to: 0/0 |
|---|
| 134 | :debug:patch chowned /opt/local/var/macports/build/_opt_local_var_macports_sources_rsync.macports.org_release_tarballs_ports_aqua_fltk/fltk/work/fltk-1.3.2/fluid/Makefile to macports |
|---|
| 135 | :debug:patch euid/egid changed to: 502/501 |
|---|
| 136 | :debug:patch euid/egid changed to: 0/0 |
|---|
| 137 | :debug:patch setting attributes on /opt/local/var/macports/build/_opt_local_var_macports_sources_rsync.macports.org_release_tarballs_ports_aqua_fltk/fltk/work/fltk-1.3.2/fluid/Makefile |
|---|
| 138 | :debug:patch euid/egid changed to: 502/501 |
|---|
| 139 | :info:patch ---> Patching Makefile: s|/Applications|/Applications/MacPorts/fltk|g |
|---|
| 140 | :debug:patch Executing reinplace: /usr/bin/sed s|/Applications|/Applications/MacPorts/fltk|g < /opt/local/var/macports/build/_opt_local_var_macports_sources_rsync.macports.org_release_tarballs_ports_aqua_fltk/fltk/work/fltk-1.3.2/test/Makefile >@ file10 2>@stderr |
|---|
| 141 | :debug:patch euid/egid changed to: 0/0 |
|---|
| 142 | :debug:patch chowned /opt/local/var/macports/build/_opt_local_var_macports_sources_rsync.macports.org_release_tarballs_ports_aqua_fltk/fltk/work/fltk-1.3.2/test/Makefile to macports |
|---|
| 143 | :debug:patch euid/egid changed to: 502/501 |
|---|
| 144 | :debug:patch euid/egid changed to: 0/0 |
|---|
| 145 | :debug:patch setting attributes on /opt/local/var/macports/build/_opt_local_var_macports_sources_rsync.macports.org_release_tarballs_ports_aqua_fltk/fltk/work/fltk-1.3.2/test/Makefile |
|---|
| 146 | :debug:patch euid/egid changed to: 502/501 |
|---|
| 147 | :info:patch ---> Patching makeinclude.in: /^\.SILENT:$/d |
|---|
| 148 | :debug:patch Executing reinplace: /usr/bin/sed {/^\.SILENT:$/d} < /opt/local/var/macports/build/_opt_local_var_macports_sources_rsync.macports.org_release_tarballs_ports_aqua_fltk/fltk/work/fltk-1.3.2/makeinclude.in >@ file10 2>@stderr |
|---|
| 149 | :debug:patch euid/egid changed to: 0/0 |
|---|
| 150 | :debug:patch chowned /opt/local/var/macports/build/_opt_local_var_macports_sources_rsync.macports.org_release_tarballs_ports_aqua_fltk/fltk/work/fltk-1.3.2/makeinclude.in to macports |
|---|
| 151 | :debug:patch euid/egid changed to: 502/501 |
|---|
| 152 | :debug:patch euid/egid changed to: 0/0 |
|---|
| 153 | :debug:patch setting attributes on /opt/local/var/macports/build/_opt_local_var_macports_sources_rsync.macports.org_release_tarballs_ports_aqua_fltk/fltk/work/fltk-1.3.2/makeinclude.in |
|---|
| 154 | :debug:patch euid/egid changed to: 502/501 |
|---|
| 155 | :debug:patch Privilege de-escalation not attempted as not running as root. |
|---|
| 156 | :debug:configure configure phase started at Sun Oct 19 20:59:39 EDT 2014 |
|---|
| 157 | :notice:configure ---> Configuring fltk |
|---|
| 158 | :debug:configure Using compiler 'Xcode Clang' |
|---|
| 159 | :debug:configure Executing org.macports.configure (fltk) |
|---|
| 160 | :debug:configure Environment: |
|---|
| 161 | CC='/usr/bin/clang' |
|---|
| 162 | CC_PRINT_OPTIONS='YES' |
|---|
| 163 | CC_PRINT_OPTIONS_FILE='/opt/local/var/macports/build/_opt_local_var_macports_sources_rsync.macports.org_release_tarballs_ports_aqua_fltk/fltk/work/.CC_PRINT_OPTIONS' |
|---|
| 164 | CFLAGS='-pipe -Os -arch x86_64' |
|---|
| 165 | CPATH='/opt/local/include' |
|---|
| 166 | CPPFLAGS='-I/opt/local/include' |
|---|
| 167 | CXX='/usr/bin/clang++' |
|---|
| 168 | CXXFLAGS='-pipe -Os -arch x86_64 -stdlib=libc++' |
|---|
| 169 | F77FLAGS='-m64' |
|---|
| 170 | F90FLAGS='-pipe -Os -m64' |
|---|
| 171 | FCFLAGS='-pipe -Os -m64' |
|---|
| 172 | FFLAGS='-pipe -Os' |
|---|
| 173 | INSTALL='/usr/bin/install -c' |
|---|
| 174 | LDFLAGS='-L/opt/local/lib -Wl,-headerpad_max_install_names -arch x86_64' |
|---|
| 175 | LIBRARY_PATH='/opt/local/lib' |
|---|
| 176 | MACOSX_DEPLOYMENT_TARGET='10.10' |
|---|
| 177 | OBJC='/usr/bin/clang' |
|---|
| 178 | OBJCFLAGS='-pipe -Os -arch x86_64' |
|---|
| 179 | OBJCXX='/usr/bin/clang++' |
|---|
| 180 | OBJCXXFLAGS='-pipe -Os -arch x86_64 -stdlib=libc++' |
|---|
| 181 | :debug:configure Assembled command: 'cd "/opt/local/var/macports/build/_opt_local_var_macports_sources_rsync.macports.org_release_tarballs_ports_aqua_fltk/fltk/work/fltk-1.3.2" && ./configure --prefix=/opt/local --enable-shared --disable-localjpeg --disable-localzlib --disable-localpng --with-archflags="-arch x86_64"' |
|---|
| 182 | :debug:configure Executing command line: cd "/opt/local/var/macports/build/_opt_local_var_macports_sources_rsync.macports.org_release_tarballs_ports_aqua_fltk/fltk/work/fltk-1.3.2" && ./configure --prefix=/opt/local --enable-shared --disable-localjpeg --disable-localzlib --disable-localpng --with-archflags="-arch x86_64" |
|---|
| 183 | :info:configure checking for gcc... /usr/bin/clang |
|---|
| 184 | :info:configure checking whether the C compiler works... yes |
|---|
| 185 | :info:configure checking for C compiler default output file name... a.out |
|---|
| 186 | :info:configure checking for suffix of executables... |
|---|
| 187 | :info:configure checking whether we are cross compiling... no |
|---|
| 188 | :info:configure checking for suffix of object files... o |
|---|
| 189 | :info:configure checking whether we are using the GNU C compiler... yes |
|---|
| 190 | :info:configure checking whether /usr/bin/clang accepts -g... yes |
|---|
| 191 | :info:configure checking for /usr/bin/clang option to accept ISO C89... none needed |
|---|
| 192 | :info:configure checking whether we are using the GNU C++ compiler... yes |
|---|
| 193 | :info:configure checking whether /usr/bin/clang++ accepts -g... yes |
|---|
| 194 | :info:configure checking for a BSD-compatible install... /usr/bin/install -c |
|---|
| 195 | :info:configure checking for nroff... /opt/local/bin/nroff |
|---|
| 196 | :info:configure checking for htmldoc... /opt/local/bin/htmldoc |
|---|
| 197 | :info:configure checking for doxygen... no |
|---|
| 198 | :info:configure checking for ranlib... ranlib |
|---|
| 199 | :info:configure checking for ar... /opt/local/bin/ar |
|---|
| 200 | :info:configure checking for windres... no |
|---|
| 201 | :info:configure checking size of short... 2 |
|---|
| 202 | :info:configure checking size of int... 4 |
|---|
| 203 | :info:configure checking size of long... 8 |
|---|
| 204 | :info:configure checking whether the compiler recognizes bool as a built-in type... yes |
|---|
| 205 | :info:configure checking for dirent.h that defines DIR... yes |
|---|
| 206 | :info:configure checking for library containing opendir... none required |
|---|
| 207 | :info:configure checking sys/select.h usability... yes |
|---|
| 208 | :info:configure checking sys/select.h presence... no |
|---|
| 209 | :info:configure configure: WARNING: sys/select.h: accepted by the compiler, rejected by the preprocessor! |
|---|
| 210 | :info:configure configure: WARNING: sys/select.h: proceeding with the compiler's result |
|---|
| 211 | :info:configure checking for sys/select.h... yes |
|---|
| 212 | :info:configure checking sys/stdtypes.h usability... no |
|---|
| 213 | :info:configure checking sys/stdtypes.h presence... no |
|---|
| 214 | :info:configure checking for sys/stdtypes.h... no |
|---|
| 215 | :info:configure checking whether we have the POSIX compatible scandir() prototype... yes |
|---|
| 216 | :info:configure checking for vsnprintf... yes |
|---|
| 217 | :info:configure checking for snprintf... yes |
|---|
| 218 | :info:configure checking strings.h usability... yes |
|---|
| 219 | :info:configure checking strings.h presence... no |
|---|
| 220 | :info:configure configure: WARNING: strings.h: accepted by the compiler, rejected by the preprocessor! |
|---|
| 221 | :info:configure configure: WARNING: strings.h: proceeding with the compiler's result |
|---|
| 222 | :info:configure checking for strings.h... yes |
|---|
| 223 | :info:configure checking for strcasecmp... yes |
|---|
| 224 | :info:configure checking for strlcat... yes |
|---|
| 225 | :info:configure checking for strlcpy... yes |
|---|
| 226 | :info:configure checking locale.h usability... yes |
|---|
| 227 | :info:configure checking locale.h presence... no |
|---|
| 228 | :info:configure configure: WARNING: locale.h: accepted by the compiler, rejected by the preprocessor! |
|---|
| 229 | :info:configure configure: WARNING: locale.h: proceeding with the compiler's result |
|---|
| 230 | :info:configure checking for locale.h... yes |
|---|
| 231 | :info:configure checking for localeconv... yes |
|---|
| 232 | :info:configure checking for library containing pow... none required |
|---|
| 233 | :info:configure checking for special C compiler options needed for large files... no |
|---|
| 234 | :info:configure checking for _FILE_OFFSET_BITS value needed for large files... no |
|---|
| 235 | :info:configure checking for long long int... yes |
|---|
| 236 | :info:configure checking for strtoll... yes |
|---|
| 237 | :info:configure checking for library containing dlsym... none required |
|---|
| 238 | :info:configure checking dlfcn.h usability... yes |
|---|
| 239 | :info:configure checking dlfcn.h presence... no |
|---|
| 240 | :info:configure configure: WARNING: dlfcn.h: accepted by the compiler, rejected by the preprocessor! |
|---|
| 241 | :info:configure configure: WARNING: dlfcn.h: proceeding with the compiler's result |
|---|
| 242 | :info:configure checking for dlfcn.h... yes |
|---|
| 243 | :info:configure checking for jpeg_CreateCompress in -ljpeg... yes |
|---|
| 244 | :info:configure checking jpeglib.h usability... yes |
|---|
| 245 | :info:configure checking jpeglib.h presence... no |
|---|
| 246 | :info:configure configure: WARNING: jpeglib.h: accepted by the compiler, rejected by the preprocessor! |
|---|
| 247 | :info:configure configure: WARNING: jpeglib.h: proceeding with the compiler's result |
|---|
| 248 | :info:configure checking for jpeglib.h... yes |
|---|
| 249 | :info:configure checking for gzgets in -lz... yes |
|---|
| 250 | :info:configure checking zlib.h usability... yes |
|---|
| 251 | :info:configure checking zlib.h presence... no |
|---|
| 252 | :info:configure configure: WARNING: zlib.h: accepted by the compiler, rejected by the preprocessor! |
|---|
| 253 | :info:configure configure: WARNING: zlib.h: proceeding with the compiler's result |
|---|
| 254 | :info:configure checking for zlib.h... yes |
|---|
| 255 | :info:configure checking for png_read_info in -lpng... yes |
|---|
| 256 | :info:configure checking png.h usability... yes |
|---|
| 257 | :info:configure checking png.h presence... no |
|---|
| 258 | :info:configure configure: WARNING: png.h: accepted by the compiler, rejected by the preprocessor! |
|---|
| 259 | :info:configure configure: WARNING: png.h: proceeding with the compiler's result |
|---|
| 260 | :info:configure checking for png.h... yes |
|---|
| 261 | :info:configure checking libpng/png.h usability... no |
|---|
| 262 | :info:configure checking libpng/png.h presence... no |
|---|
| 263 | :info:configure checking for libpng/png.h... no |
|---|
| 264 | :info:configure checking for png_get_valid in -lpng... yes |
|---|
| 265 | :info:configure checking for png_set_tRNS_to_alpha in -lpng... yes |
|---|
| 266 | :info:configure checking pthread.h usability... yes |
|---|
| 267 | :info:configure checking pthread.h presence... no |
|---|
| 268 | :info:configure configure: WARNING: pthread.h: accepted by the compiler, rejected by the preprocessor! |
|---|
| 269 | :info:configure configure: WARNING: pthread.h: proceeding with the compiler's result |
|---|
| 270 | :info:configure checking for pthread.h... yes |
|---|
| 271 | :info:configure checking for pthread_create using -lpthreads... no |
|---|
| 272 | :info:configure checking for pthread_create using -lpthread... yes |
|---|
| 273 | :info:configure checking if GCC supports -fno-exceptions... yes |
|---|
| 274 | :info:configure checking if GCC supports -fno-strict-aliasing... yes |
|---|
| 275 | :info:configure |
|---|
| 276 | :info:configure Configuration Summary |
|---|
| 277 | :info:configure ------------------------------------------------------------------------- |
|---|
| 278 | :info:configure Directories: prefix=/opt/local |
|---|
| 279 | :info:configure bindir=${exec_prefix}/bin |
|---|
| 280 | :info:configure datadir=${datarootdir} |
|---|
| 281 | :info:configure datarootdir=${prefix}/share |
|---|
| 282 | :info:configure exec_prefix=${prefix} |
|---|
| 283 | :info:configure includedir=${prefix}/include |
|---|
| 284 | :info:configure libdir=${exec_prefix}/lib |
|---|
| 285 | :info:configure mandir=${datarootdir}/man |
|---|
| 286 | :info:configure Graphics: Quartz |
|---|
| 287 | :info:configure Image Libraries: JPEG=System |
|---|
| 288 | :info:configure PNG=System |
|---|
| 289 | :info:configure ZLIB=System |
|---|
| 290 | :info:configure Large Files: YES |
|---|
| 291 | :info:configure OpenGL: YES |
|---|
| 292 | :info:configure Threads: YES |
|---|
| 293 | :info:configure configure: creating ./config.status |
|---|
| 294 | :info:configure config.status: creating makeinclude |
|---|
| 295 | :info:configure config.status: creating fltk.list |
|---|
| 296 | :info:configure config.status: creating fltk-config |
|---|
| 297 | :info:configure config.status: creating fltk.spec |
|---|
| 298 | :info:configure config.status: creating FL/Makefile |
|---|
| 299 | :info:configure config.status: creating config.h |
|---|
| 300 | :debug:configure Executing proc-post-org.macports.configure-configure-0 |
|---|
| 301 | :info:configure ---> Patching fltk-config: s|-arch [a-z0-9_]+||g |
|---|
| 302 | :debug:configure Executing reinplace: /usr/bin/sed -E {s|-arch [a-z0-9_]+||g} < /opt/local/var/macports/build/_opt_local_var_macports_sources_rsync.macports.org_release_tarballs_ports_aqua_fltk/fltk/work/fltk-1.3.2/fltk-config >@ file10 2>@stderr |
|---|
| 303 | :debug:configure euid/egid changed to: 0/0 |
|---|
| 304 | :debug:configure chowned /opt/local/var/macports/build/_opt_local_var_macports_sources_rsync.macports.org_release_tarballs_ports_aqua_fltk/fltk/work/fltk-1.3.2/fltk-config to macports |
|---|
| 305 | :debug:configure euid/egid changed to: 502/501 |
|---|
| 306 | :debug:configure euid/egid changed to: 0/0 |
|---|
| 307 | :debug:configure setting attributes on /opt/local/var/macports/build/_opt_local_var_macports_sources_rsync.macports.org_release_tarballs_ports_aqua_fltk/fltk/work/fltk-1.3.2/fltk-config |
|---|
| 308 | :debug:configure euid/egid changed to: 502/501 |
|---|
| 309 | :debug:configure Privilege de-escalation not attempted as not running as root. |
|---|
| 310 | :debug:build build phase started at Sun Oct 19 20:59:42 EDT 2014 |
|---|
| 311 | :notice:build ---> Building fltk |
|---|
| 312 | :debug:build Executing org.macports.build (fltk) |
|---|
| 313 | :debug:build Environment: |
|---|
| 314 | CC_PRINT_OPTIONS='YES' |
|---|
| 315 | CC_PRINT_OPTIONS_FILE='/opt/local/var/macports/build/_opt_local_var_macports_sources_rsync.macports.org_release_tarballs_ports_aqua_fltk/fltk/work/.CC_PRINT_OPTIONS' |
|---|
| 316 | CPATH='/opt/local/include' |
|---|
| 317 | LIBRARY_PATH='/opt/local/lib' |
|---|
| 318 | MACOSX_DEPLOYMENT_TARGET='10.10' |
|---|
| 319 | :debug:build Assembled command: 'cd "/opt/local/var/macports/build/_opt_local_var_macports_sources_rsync.macports.org_release_tarballs_ports_aqua_fltk/fltk/work/fltk-1.3.2" && /usr/bin/make -j8 -w all' |
|---|
| 320 | :debug:build Executing command line: cd "/opt/local/var/macports/build/_opt_local_var_macports_sources_rsync.macports.org_release_tarballs_ports_aqua_fltk/fltk/work/fltk-1.3.2" && /usr/bin/make -j8 -w all |
|---|
| 321 | :info:build make: Entering directory `/opt/local/var/macports/build/_opt_local_var_macports_sources_rsync.macports.org_release_tarballs_ports_aqua_fltk/fltk/work/fltk-1.3.2' |
|---|
| 322 | :info:build for dir in src fluid test documentation; do\ |
|---|
| 323 | :info:build echo "=== making $dir ===";\ |
|---|
| 324 | :info:build (cd $dir; /Applications/Xcode.app/Contents/Developer/usr/bin/make -w --jobserver-fds=6,7 -j) || exit 1;\ |
|---|
| 325 | :info:build done |
|---|
| 326 | :info:build === making src === |
|---|
| 327 | :info:build make[1]: Entering directory `/opt/local/var/macports/build/_opt_local_var_macports_sources_rsync.macports.org_release_tarballs_ports_aqua_fltk/fltk/work/fltk-1.3.2/src' |
|---|
| 328 | :info:build echo Compiling Fl_cocoa.mm... |
|---|
| 329 | :info:build echo Compiling Fl_Quartz_Printer.mm... |
|---|
| 330 | :info:build echo Compiling Fl_Native_File_Chooser_MAC.mm... |
|---|
| 331 | :info:build Compiling Fl_cocoa.mm... |
|---|
| 332 | :info:build Compiling Fl_Quartz_Printer.mm... |
|---|
| 333 | :info:build Compiling Fl_Native_File_Chooser_MAC.mm... |
|---|
| 334 | :info:build /usr/bin/clang++ -I.. -arch x86_64 -Os -Wno-deprecated-declarations -Wall -Wunused -Wno-format-y2k -fPIC -fno-exceptions -fno-strict-aliasing -D_LARGEFILE_SOURCE -D_LARGEFILE64_SOURCE -D_THREAD_SAFE -D_REENTRANT -I/opt/local/include -pipe -Os -arch x86_64 -stdlib=libc++ -DFL_LIBRARY -x objective-c++ -c Fl_Native_File_Chooser_MAC.mm -o Fl_Native_File_Chooser_MAC.o |
|---|
| 335 | :info:build /usr/bin/clang++ -I.. -arch x86_64 -Os -Wno-deprecated-declarations -Wall -Wunused -Wno-format-y2k -fPIC -fno-exceptions -fno-strict-aliasing -D_LARGEFILE_SOURCE -D_LARGEFILE64_SOURCE -D_THREAD_SAFE -D_REENTRANT -I/opt/local/include -pipe -Os -arch x86_64 -stdlib=libc++ -DFL_LIBRARY -x objective-c++ -c Fl_Quartz_Printer.mm -o Fl_Quartz_Printer.o |
|---|
| 336 | :info:build /usr/bin/clang++ -I.. -arch x86_64 -Os -Wno-deprecated-declarations -Wall -Wunused -Wno-format-y2k -fPIC -fno-exceptions -fno-strict-aliasing -D_LARGEFILE_SOURCE -D_LARGEFILE64_SOURCE -D_THREAD_SAFE -D_REENTRANT -I/opt/local/include -pipe -Os -arch x86_64 -stdlib=libc++ -DFL_LIBRARY -x objective-c++ -c Fl_cocoa.mm -o Fl_cocoa.o |
|---|
| 337 | :info:build echo Compiling Fl.cxx... |
|---|
| 338 | :info:build Compiling Fl.cxx... |
|---|
| 339 | :info:build echo Compiling Fl_Adjuster.cxx... |
|---|
| 340 | :info:build Compiling Fl_Adjuster.cxx... |
|---|
| 341 | :info:build /usr/bin/clang++ -I.. -arch x86_64 -Os -Wno-deprecated-declarations -Wall -Wunused -Wno-format-y2k -fPIC -fno-exceptions -fno-strict-aliasing -D_LARGEFILE_SOURCE -D_LARGEFILE64_SOURCE -D_THREAD_SAFE -D_REENTRANT -I/opt/local/include -pipe -Os -arch x86_64 -stdlib=libc++ -DFL_LIBRARY -c Fl_Adjuster.cxx -o Fl_Adjuster.o |
|---|
| 342 | :info:build /usr/bin/clang++ -I.. -arch x86_64 -Os -Wno-deprecated-declarations -Wall -Wunused -Wno-format-y2k -fPIC -fno-exceptions -fno-strict-aliasing -D_LARGEFILE_SOURCE -D_LARGEFILE64_SOURCE -D_THREAD_SAFE -D_REENTRANT -I/opt/local/include -pipe -Os -arch x86_64 -stdlib=libc++ -DFL_LIBRARY -c Fl.cxx -o Fl.o |
|---|
| 343 | :info:build echo Compiling Fl_Bitmap.cxx... |
|---|
| 344 | :info:build Compiling Fl_Bitmap.cxx... |
|---|
| 345 | :info:build /usr/bin/clang++ -I.. -arch x86_64 -Os -Wno-deprecated-declarations -Wall -Wunused -Wno-format-y2k -fPIC -fno-exceptions -fno-strict-aliasing -D_LARGEFILE_SOURCE -D_LARGEFILE64_SOURCE -D_THREAD_SAFE -D_REENTRANT -I/opt/local/include -pipe -Os -arch x86_64 -stdlib=libc++ -DFL_LIBRARY -c Fl_Bitmap.cxx -o Fl_Bitmap.o |
|---|
| 346 | :info:build echo Compiling Fl_Browser.cxx... |
|---|
| 347 | :info:build echo Compiling Fl_Browser_.cxx... |
|---|
| 348 | :info:build Compiling Fl_Browser.cxx... |
|---|
| 349 | :info:build /usr/bin/clang++ -I.. -arch x86_64 -Os -Wno-deprecated-declarations -Wall -Wunused -Wno-format-y2k -fPIC -fno-exceptions -fno-strict-aliasing -D_LARGEFILE_SOURCE -D_LARGEFILE64_SOURCE -D_THREAD_SAFE -D_REENTRANT -I/opt/local/include -pipe -Os -arch x86_64 -stdlib=libc++ -DFL_LIBRARY -c Fl_Browser.cxx -o Fl_Browser.o |
|---|
| 350 | :info:build Compiling Fl_Browser_.cxx... |
|---|
| 351 | :info:build /usr/bin/clang++ -I.. -arch x86_64 -Os -Wno-deprecated-declarations -Wall -Wunused -Wno-format-y2k -fPIC -fno-exceptions -fno-strict-aliasing -D_LARGEFILE_SOURCE -D_LARGEFILE64_SOURCE -D_THREAD_SAFE -D_REENTRANT -I/opt/local/include -pipe -Os -arch x86_64 -stdlib=libc++ -DFL_LIBRARY -c Fl_Browser_.cxx -o Fl_Browser_.o |
|---|
| 352 | :info:build echo Compiling Fl_Browser_load.cxx... |
|---|
| 353 | :info:build Compiling Fl_Browser_load.cxx... |
|---|
| 354 | :info:build /usr/bin/clang++ -I.. -arch x86_64 -Os -Wno-deprecated-declarations -Wall -Wunused -Wno-format-y2k -fPIC -fno-exceptions -fno-strict-aliasing -D_LARGEFILE_SOURCE -D_LARGEFILE64_SOURCE -D_THREAD_SAFE -D_REENTRANT -I/opt/local/include -pipe -Os -arch x86_64 -stdlib=libc++ -DFL_LIBRARY -c Fl_Browser_load.cxx -o Fl_Browser_load.o |
|---|
| 355 | :info:build echo Compiling Fl_Box.cxx... |
|---|
| 356 | :info:build Compiling Fl_Box.cxx... |
|---|
| 357 | :info:build /usr/bin/clang++ -I.. -arch x86_64 -Os -Wno-deprecated-declarations -Wall -Wunused -Wno-format-y2k -fPIC -fno-exceptions -fno-strict-aliasing -D_LARGEFILE_SOURCE -D_LARGEFILE64_SOURCE -D_THREAD_SAFE -D_REENTRANT -I/opt/local/include -pipe -Os -arch x86_64 -stdlib=libc++ -DFL_LIBRARY -c Fl_Box.cxx -o Fl_Box.o |
|---|
| 358 | :info:build echo Compiling Fl_Button.cxx... |
|---|
| 359 | :info:build Compiling Fl_Button.cxx... |
|---|
| 360 | :info:build /usr/bin/clang++ -I.. -arch x86_64 -Os -Wno-deprecated-declarations -Wall -Wunused -Wno-format-y2k -fPIC -fno-exceptions -fno-strict-aliasing -D_LARGEFILE_SOURCE -D_LARGEFILE64_SOURCE -D_THREAD_SAFE -D_REENTRANT -I/opt/local/include -pipe -Os -arch x86_64 -stdlib=libc++ -DFL_LIBRARY -c Fl_Button.cxx -o Fl_Button.o |
|---|
| 361 | :info:build echo Compiling Fl_Chart.cxx... |
|---|
| 362 | :info:build Compiling Fl_Chart.cxx... |
|---|
| 363 | :info:build /usr/bin/clang++ -I.. -arch x86_64 -Os -Wno-deprecated-declarations -Wall -Wunused -Wno-format-y2k -fPIC -fno-exceptions -fno-strict-aliasing -D_LARGEFILE_SOURCE -D_LARGEFILE64_SOURCE -D_THREAD_SAFE -D_REENTRANT -I/opt/local/include -pipe -Os -arch x86_64 -stdlib=libc++ -DFL_LIBRARY -c Fl_Chart.cxx -o Fl_Chart.o |
|---|
| 364 | :info:build echo Compiling Fl_Check_Browser.cxx... |
|---|
| 365 | :info:build Compiling Fl_Check_Browser.cxx... |
|---|
| 366 | :info:build echo Compiling Fl_Check_Button.cxx... |
|---|
| 367 | :info:build Compiling Fl_Check_Button.cxx... |
|---|
| 368 | :info:build /usr/bin/clang++ -I.. -arch x86_64 -Os -Wno-deprecated-declarations -Wall -Wunused -Wno-format-y2k -fPIC -fno-exceptions -fno-strict-aliasing -D_LARGEFILE_SOURCE -D_LARGEFILE64_SOURCE -D_THREAD_SAFE -D_REENTRANT -I/opt/local/include -pipe -Os -arch x86_64 -stdlib=libc++ -DFL_LIBRARY -c Fl_Check_Browser.cxx -o Fl_Check_Browser.o |
|---|
| 369 | :info:build /usr/bin/clang++ -I.. -arch x86_64 -Os -Wno-deprecated-declarations -Wall -Wunused -Wno-format-y2k -fPIC -fno-exceptions -fno-strict-aliasing -D_LARGEFILE_SOURCE -D_LARGEFILE64_SOURCE -D_THREAD_SAFE -D_REENTRANT -I/opt/local/include -pipe -Os -arch x86_64 -stdlib=libc++ -DFL_LIBRARY -c Fl_Check_Button.cxx -o Fl_Check_Button.o |
|---|
| 370 | :info:build echo Compiling Fl_Choice.cxx... |
|---|
| 371 | :info:build Compiling Fl_Choice.cxx... |
|---|
| 372 | :info:build /usr/bin/clang++ -I.. -arch x86_64 -Os -Wno-deprecated-declarations -Wall -Wunused -Wno-format-y2k -fPIC -fno-exceptions -fno-strict-aliasing -D_LARGEFILE_SOURCE -D_LARGEFILE64_SOURCE -D_THREAD_SAFE -D_REENTRANT -I/opt/local/include -pipe -Os -arch x86_64 -stdlib=libc++ -DFL_LIBRARY -c Fl_Choice.cxx -o Fl_Choice.o |
|---|
| 373 | :info:build echo Compiling Fl_Clock.cxx... |
|---|
| 374 | :info:build Compiling Fl_Clock.cxx... |
|---|
| 375 | :info:build /usr/bin/clang++ -I.. -arch x86_64 -Os -Wno-deprecated-declarations -Wall -Wunused -Wno-format-y2k -fPIC -fno-exceptions -fno-strict-aliasing -D_LARGEFILE_SOURCE -D_LARGEFILE64_SOURCE -D_THREAD_SAFE -D_REENTRANT -I/opt/local/include -pipe -Os -arch x86_64 -stdlib=libc++ -DFL_LIBRARY -c Fl_Clock.cxx -o Fl_Clock.o |
|---|
| 376 | :info:build echo Compiling Fl_Color_Chooser.cxx... |
|---|
| 377 | :info:build Compiling Fl_Color_Chooser.cxx... |
|---|
| 378 | :info:build /usr/bin/clang++ -I.. -arch x86_64 -Os -Wno-deprecated-declarations -Wall -Wunused -Wno-format-y2k -fPIC -fno-exceptions -fno-strict-aliasing -D_LARGEFILE_SOURCE -D_LARGEFILE64_SOURCE -D_THREAD_SAFE -D_REENTRANT -I/opt/local/include -pipe -Os -arch x86_64 -stdlib=libc++ -DFL_LIBRARY -c Fl_Color_Chooser.cxx -o Fl_Color_Chooser.o |
|---|
| 379 | :info:build Fl_cocoa.mm:1325:24: error: cannot initialize a parameter of type 'id<NSFileManagerDelegate>' with an rvalue of type 'FLDelegate *' |
|---|
| 380 | :info:build [NSApp setDelegate:[[FLDelegate alloc] init]]; |
|---|
| 381 | :info:build ^~~~~~~~~~~~~~~~~~~~~~~~~ |
|---|
| 382 | :info:build /usr/include/objc/NSObject.h:60:1: note: instance method 'init' is assumed to return an instance of its receiver type ('FLDelegate *') |
|---|
| 383 | :info:build - (instancetype)init; |
|---|
| 384 | :info:build ^ |
|---|
| 385 | :info:build /System/Library/Frameworks/Foundation.framework/Headers/NSFileManager.h:109:47: note: passing argument to parameter 'delegate' here |
|---|
| 386 | :info:build @property (assign) id <NSFileManagerDelegate> delegate NS_AVAILABLE(10_5, 2_0); |
|---|
| 387 | :info:build ^ |
|---|
| 388 | :info:build echo Compiling Fl_Counter.cxx... |
|---|
| 389 | :info:build Compiling Fl_Counter.cxx... |
|---|
| 390 | :info:build /usr/bin/clang++ -I.. -arch x86_64 -Os -Wno-deprecated-declarations -Wall -Wunused -Wno-format-y2k -fPIC -fno-exceptions -fno-strict-aliasing -D_LARGEFILE_SOURCE -D_LARGEFILE64_SOURCE -D_THREAD_SAFE -D_REENTRANT -I/opt/local/include -pipe -Os -arch x86_64 -stdlib=libc++ -DFL_LIBRARY -c Fl_Counter.cxx -o Fl_Counter.o |
|---|
| 391 | :info:build Fl_cocoa.mm:2234:21: error: cannot initialize a parameter of type 'id<NSWindowDelegate>' with an rvalue of type 'id<NSFileManagerDelegate>' |
|---|
| 392 | :info:build [cw setDelegate:[NSApp delegate]]; |
|---|
| 393 | :info:build ^~~~~~~~~~~~~~~~ |
|---|
| 394 | :info:build /System/Library/Frameworks/AppKit.framework/Headers/NSWindow.h:307:41: note: passing argument to parameter 'delegate' here |
|---|
| 395 | :info:build @property (assign) id<NSWindowDelegate> delegate; |
|---|
| 396 | :info:build ^ |
|---|
| 397 | :info:build 2 errors generated. |
|---|
| 398 | :info:build make[1]: *** [Fl_cocoa.o] Error 1 |
|---|
| 399 | :info:build make[1]: *** Waiting for unfinished jobs.... |
|---|
| 400 | :info:build make[1]: Leaving directory `/opt/local/var/macports/build/_opt_local_var_macports_sources_rsync.macports.org_release_tarballs_ports_aqua_fltk/fltk/work/fltk-1.3.2/src' |
|---|
| 401 | :info:build make: *** [all] Error 1 |
|---|
| 402 | :info:build make: Leaving directory `/opt/local/var/macports/build/_opt_local_var_macports_sources_rsync.macports.org_release_tarballs_ports_aqua_fltk/fltk/work/fltk-1.3.2' |
|---|
| 403 | :info:build Command failed: cd "/opt/local/var/macports/build/_opt_local_var_macports_sources_rsync.macports.org_release_tarballs_ports_aqua_fltk/fltk/work/fltk-1.3.2" && /usr/bin/make -j8 -w all |
|---|
| 404 | :info:build Exit code: 2 |
|---|
| 405 | :error:build org.macports.build for port fltk returned: command execution failed |
|---|
| 406 | :debug:build Error code: CHILDSTATUS 63217 2 |
|---|
| 407 | :debug:build Backtrace: command execution failed |
|---|
| 408 | while executing |
|---|
| 409 | "system -nice 0 $fullcmdstring" |
|---|
| 410 | ("eval" body line 1) |
|---|
| 411 | invoked from within |
|---|
| 412 | "eval system $notty $nice \$fullcmdstring" |
|---|
| 413 | invoked from within |
|---|
| 414 | "command_exec build" |
|---|
| 415 | (procedure "portbuild::build_main" line 8) |
|---|
| 416 | invoked from within |
|---|
| 417 | "portbuild::build_main org.macports.build" |
|---|
| 418 | ("eval" body line 1) |
|---|
| 419 | invoked from within |
|---|
| 420 | "eval $procedure $targetname" |
|---|
| 421 | :info:build Warning: targets not executed for fltk: org.macports.activate org.macports.build org.macports.destroot org.macports.install |
|---|
| 422 | :notice:build Please see the log file for port fltk for details: |
|---|
| 423 | /opt/local/var/macports/logs/_opt_local_var_macports_sources_rsync.macports.org_release_tarballs_ports_aqua_fltk/fltk/main.log |
|---|