Ticket #45954: config.log

File config.log, 15.8 KB (added by Schamschula (Marius Schamschula), 10 years ago)
Line 
1This file contains any messages produced by compilers while
2running configure, to aid debugging if configure makes a mistake.
3
4It was created by GNU C Runtime Library configure 1.0, which was
5generated by GNU Autoconf 2.64.  Invocation command line was
6
7  $ /opt/local/var/macports/build/_opt_local_var_macports_sources_rsync.macports.org_release_tarballs_ports_lang_gcc49/libgcc/work/gcc-4.9.2/libgcc/configure --cache-file=./config.cache --prefix=/opt/local --includedir=/opt/local/include/gcc49 --infodir=/opt/local/share/info --mandir=/opt/local/share/man --datarootdir=/opt/local/share/gcc-4.9 --with-local-prefix=/opt/local --with-system-zlib --disable-nls --with-gxx-include-dir=/opt/local/include/gcc49/c++/ --with-gmp=/opt/local --with-mpfr=/opt/local --with-mpc=/opt/local --with-cloog=/opt/local --enable-cloog-backend=isl --disable-cloog-version-check --enable-stage1-checking --disable-multilib --enable-lto --enable-libstdcxx-time --with-as=/opt/local/bin/as --with-ld=/opt/local/bin/ld --with-ar=/opt/local/bin/ar --with-bugurl=https://trac.macports.org/newticket --libdir=/opt/local/lib/libgcc --with-pkgversion=MacPorts gcc49 4.9.2_0 --enable-languages=c,c++,fortran,lto,objc,obj-c++ --program-transform-name=s&$&-mp-4.9& --disable-option-checking --with-target-subdir=ppc-apple-darwin9 --build=ppc-apple-darwin9 --host=ppc-apple-darwin9 --target=ppc-apple-darwin9 --srcdir=/opt/local/var/macports/build/_opt_local_var_macports_sources_rsync.macports.org_release_tarballs_ports_lang_gcc49/libgcc/work/gcc-4.9.2/libgcc --disable-intermodule --enable-checking=yes --disable-coverage --enable-languages=c,c++,lto --disable-build-format-warnings
8
9## --------- ##
10## Platform. ##
11## --------- ##
12
13hostname = Aoede.local
14uname -m = Power Macintosh
15uname -r = 9.8.0
16uname -s = Darwin
17uname -v = Darwin Kernel Version 9.8.0: Wed Jul 15 16:57:01 PDT 2009; root:xnu-1228.15.4~1/RELEASE_PPC
18
19/usr/bin/uname -p = powerpc
20/bin/uname -X     = unknown
21
22/bin/arch              = unknown
23/usr/bin/arch -k       = unknown
24/usr/convex/getsysinfo = unknown
25/usr/bin/hostinfo      = Mach kernel version:
26         Darwin Kernel Version 9.8.0: Wed Jul 15 16:57:01 PDT 2009; root:xnu-1228.15.4~1/RELEASE_PPC
27Kernel configured for a single processor only.
281 processor is physically available.
291 processor is logically available.
30Processor type: ppc970 (PowerPC 970)
31Processor active: 0
32Primary memory available: 512.00 megabytes
33Default processor set: 68 tasks, 237 threads, 1 processors
34Load average: 0.87, Mach factor: 0.50
35/bin/machine           = unknown
36/usr/bin/oslevel       = unknown
37/bin/universe          = unknown
38
39PATH: /opt/local/bin
40PATH: /opt/local/sbin
41PATH: /bin
42PATH: /sbin
43PATH: /usr/bin
44PATH: /usr/sbin
45
46
47## ----------- ##
48## Core tests. ##
49## ----------- ##
50
51configure:1980: creating cache ./config.cache
52configure:2163: checking build system type
53configure:2177: result: powerpc-apple-darwin9
54configure:2197: checking host system type
55configure:2210: result: powerpc-apple-darwin9
56configure:2307: checking for --enable-version-specific-runtime-libs
57configure:2320: result: no
58configure:2368: checking for a BSD-compatible install
59configure:2436: result: /usr/bin/install -c
60configure:2452: checking for gawk
61configure:2479: result: gawk
62configure:2579: checking for ppc-apple-darwin9-ar
63configure:2606: result: /opt/local/bin/ar
64configure:2671: checking for ppc-apple-darwin9-lipo
65configure:2698: result: lipo
66configure:2763: checking for ppc-apple-darwin9-nm
67configure:2790: result: /opt/local/var/macports/build/_opt_local_var_macports_sources_rsync.macports.org_release_tarballs_ports_lang_gcc49/libgcc/work/build/./gcc/nm
68configure:2855: checking for ppc-apple-darwin9-ranlib
69configure:2882: result: /opt/local/bin/ranlib
70configure:2947: checking for ppc-apple-darwin9-strip
71configure:2974: result: /opt/local/bin/strip
72configure:3036: checking whether ln -s works
73configure:3040: result: yes
74configure:3057: checking for ppc-apple-darwin9-gcc
75configure:3084: result: /opt/local/var/macports/build/_opt_local_var_macports_sources_rsync.macports.org_release_tarballs_ports_lang_gcc49/libgcc/work/build/./gcc/xgcc -B/opt/local/var/macports/build/_opt_local_var_macports_sources_rsync.macports.org_release_tarballs_ports_lang_gcc49/libgcc/work/build/./gcc/ -B/opt/local/ppc-apple-darwin9/bin/ -B/opt/local/ppc-apple-darwin9/lib/ -isystem /opt/local/ppc-apple-darwin9/include -isystem /opt/local/ppc-apple-darwin9/sys-include   
76configure:3353: checking for C compiler version
77configure:3362: /opt/local/var/macports/build/_opt_local_var_macports_sources_rsync.macports.org_release_tarballs_ports_lang_gcc49/libgcc/work/build/./gcc/xgcc -B/opt/local/var/macports/build/_opt_local_var_macports_sources_rsync.macports.org_release_tarballs_ports_lang_gcc49/libgcc/work/build/./gcc/ -B/opt/local/ppc-apple-darwin9/bin/ -B/opt/local/ppc-apple-darwin9/lib/ -isystem /opt/local/ppc-apple-darwin9/include -isystem /opt/local/ppc-apple-darwin9/sys-include    --version >&5
78xgcc (MacPorts gcc49 4.9.2_0) 4.9.2
79Copyright (C) 2014 Free Software Foundation, Inc.
80This is free software; see the source for copying conditions.  There is NO
81warranty; not even for MERCHANTABILITY or FITNESS FOR A PARTICULAR PURPOSE.
82
83configure:3373: $? = 0
84configure:3362: /opt/local/var/macports/build/_opt_local_var_macports_sources_rsync.macports.org_release_tarballs_ports_lang_gcc49/libgcc/work/build/./gcc/xgcc -B/opt/local/var/macports/build/_opt_local_var_macports_sources_rsync.macports.org_release_tarballs_ports_lang_gcc49/libgcc/work/build/./gcc/ -B/opt/local/ppc-apple-darwin9/bin/ -B/opt/local/ppc-apple-darwin9/lib/ -isystem /opt/local/ppc-apple-darwin9/include -isystem /opt/local/ppc-apple-darwin9/sys-include    -v >&5
85Reading specs from /opt/local/var/macports/build/_opt_local_var_macports_sources_rsync.macports.org_release_tarballs_ports_lang_gcc49/libgcc/work/build/./gcc/specs
86COLLECT_GCC=/opt/local/var/macports/build/_opt_local_var_macports_sources_rsync.macports.org_release_tarballs_ports_lang_gcc49/libgcc/work/build/./gcc/xgcc
87COLLECT_LTO_WRAPPER=/opt/local/var/macports/build/_opt_local_var_macports_sources_rsync.macports.org_release_tarballs_ports_lang_gcc49/libgcc/work/build/./gcc/lto-wrapper
88Target: ppc-apple-darwin9
89Configured with: /opt/local/var/macports/build/_opt_local_var_macports_sources_rsync.macports.org_release_tarballs_ports_lang_gcc49/libgcc/work/gcc-4.9.2/configure --prefix=/opt/local --build=ppc-apple-darwin9 --includedir=/opt/local/include/gcc49 --infodir=/opt/local/share/info --mandir=/opt/local/share/man --datarootdir=/opt/local/share/gcc-4.9 --with-local-prefix=/opt/local --with-system-zlib --disable-nls --program-suffix=-mp-4.9 --with-gxx-include-dir=/opt/local/include/gcc49/c++/ --with-gmp=/opt/local --with-mpfr=/opt/local --with-mpc=/opt/local --with-cloog=/opt/local --enable-cloog-backend=isl --disable-cloog-version-check --enable-stage1-checking --disable-multilib --enable-lto --enable-libstdcxx-time --with-as=/opt/local/bin/as --with-ld=/opt/local/bin/ld --with-ar=/opt/local/bin/ar --with-bugurl=https://trac.macports.org/newticket --libdir=/opt/local/lib/libgcc --enable-languages=c,c++,objc,obj-c++,lto,fortran --with-pkgversion='MacPorts gcc49 4.9.2_0'
90Thread model: posix
91gcc version 4.9.2 (MacPorts gcc49 4.9.2_0)
92configure:3373: $? = 0
93configure:3362: /opt/local/var/macports/build/_opt_local_var_macports_sources_rsync.macports.org_release_tarballs_ports_lang_gcc49/libgcc/work/build/./gcc/xgcc -B/opt/local/var/macports/build/_opt_local_var_macports_sources_rsync.macports.org_release_tarballs_ports_lang_gcc49/libgcc/work/build/./gcc/ -B/opt/local/ppc-apple-darwin9/bin/ -B/opt/local/ppc-apple-darwin9/lib/ -isystem /opt/local/ppc-apple-darwin9/include -isystem /opt/local/ppc-apple-darwin9/sys-include    -V >&5
94xgcc: error: unrecognized command line option '-V'
95xgcc: fatal error: no input files
96compilation terminated.
97configure:3373: $? = 1
98configure:3362: /opt/local/var/macports/build/_opt_local_var_macports_sources_rsync.macports.org_release_tarballs_ports_lang_gcc49/libgcc/work/build/./gcc/xgcc -B/opt/local/var/macports/build/_opt_local_var_macports_sources_rsync.macports.org_release_tarballs_ports_lang_gcc49/libgcc/work/build/./gcc/ -B/opt/local/ppc-apple-darwin9/bin/ -B/opt/local/ppc-apple-darwin9/lib/ -isystem /opt/local/ppc-apple-darwin9/include -isystem /opt/local/ppc-apple-darwin9/sys-include    -qversion >&5
99xgcc: error: unrecognized command line option '-qversion'
100xgcc: fatal error: no input files
101compilation terminated.
102configure:3373: $? = 1
103configure:3389: /opt/local/var/macports/build/_opt_local_var_macports_sources_rsync.macports.org_release_tarballs_ports_lang_gcc49/libgcc/work/build/./gcc/xgcc -B/opt/local/var/macports/build/_opt_local_var_macports_sources_rsync.macports.org_release_tarballs_ports_lang_gcc49/libgcc/work/build/./gcc/ -B/opt/local/ppc-apple-darwin9/bin/ -B/opt/local/ppc-apple-darwin9/lib/ -isystem /opt/local/ppc-apple-darwin9/include -isystem /opt/local/ppc-apple-darwin9/sys-include    -o conftest -g -O2 -pipe -Os   conftest.c  >&5
104cc1: internal compiler error: in init_reg_sets, at reginfo.c:178
105libbacktrace could not find executable to open
106Please submit a full bug report,
107with preprocessed source if appropriate.
108See <https://trac.macports.org/newticket> for instructions.
109configure:3392: $? = 1
110configure:3580: checking for suffix of object files
111configure:3602: /opt/local/var/macports/build/_opt_local_var_macports_sources_rsync.macports.org_release_tarballs_ports_lang_gcc49/libgcc/work/build/./gcc/xgcc -B/opt/local/var/macports/build/_opt_local_var_macports_sources_rsync.macports.org_release_tarballs_ports_lang_gcc49/libgcc/work/build/./gcc/ -B/opt/local/ppc-apple-darwin9/bin/ -B/opt/local/ppc-apple-darwin9/lib/ -isystem /opt/local/ppc-apple-darwin9/include -isystem /opt/local/ppc-apple-darwin9/sys-include    -c -g -O2 -pipe -Os  conftest.c >&5
112cc1: internal compiler error: in init_reg_sets, at reginfo.c:178
113libbacktrace could not find executable to open
114Please submit a full bug report,
115with preprocessed source if appropriate.
116See <https://trac.macports.org/newticket> for instructions.
117configure:3606: $? = 1
118configure: failed program was:
119| /* confdefs.h */
120| #define PACKAGE_NAME "GNU C Runtime Library"
121| #define PACKAGE_TARNAME "libgcc"
122| #define PACKAGE_VERSION "1.0"
123| #define PACKAGE_STRING "GNU C Runtime Library 1.0"
124| #define PACKAGE_BUGREPORT ""
125| #define PACKAGE_URL "http://www.gnu.org/software/libgcc/"
126| /* end confdefs.h.  */
127|
128| int
129| main ()
130| {
131|
132|   ;
133|   return 0;
134| }
135configure:3620: error: in `/opt/local/var/macports/build/_opt_local_var_macports_sources_rsync.macports.org_release_tarballs_ports_lang_gcc49/libgcc/work/build/ppc-apple-darwin9/libgcc':
136configure:3623: error: cannot compute suffix of object files: cannot compile
137See `config.log' for more details.
138
139## ---------------- ##
140## Cache variables. ##
141## ---------------- ##
142
143ac_cv_build=powerpc-apple-darwin9
144ac_cv_env_CC_set=set
145ac_cv_env_CC_value='/opt/local/var/macports/build/_opt_local_var_macports_sources_rsync.macports.org_release_tarballs_ports_lang_gcc49/libgcc/work/build/./gcc/xgcc -B/opt/local/var/macports/build/_opt_local_var_macports_sources_rsync.macports.org_release_tarballs_ports_lang_gcc49/libgcc/work/build/./gcc/ -B/opt/local/ppc-apple-darwin9/bin/ -B/opt/local/ppc-apple-darwin9/lib/ -isystem /opt/local/ppc-apple-darwin9/include -isystem /opt/local/ppc-apple-darwin9/sys-include   '
146ac_cv_env_CFLAGS_set=set
147ac_cv_env_CFLAGS_value='-g -O2 -pipe -Os'
148ac_cv_env_CPPFLAGS_set=set
149ac_cv_env_CPPFLAGS_value=
150ac_cv_env_CPP_set=set
151ac_cv_env_CPP_value='/usr/bin/gcc-4.2 -E'
152ac_cv_env_LDFLAGS_set=set
153ac_cv_env_LDFLAGS_value=
154ac_cv_env_LIBS_set=
155ac_cv_env_LIBS_value=
156ac_cv_env_build_alias_set=set
157ac_cv_env_build_alias_value=ppc-apple-darwin9
158ac_cv_env_host_alias_set=set
159ac_cv_env_host_alias_value=ppc-apple-darwin9
160ac_cv_env_target_alias_set=set
161ac_cv_env_target_alias_value=ppc-apple-darwin9
162ac_cv_host=powerpc-apple-darwin9
163ac_cv_prog_AR=/opt/local/bin/ar
164ac_cv_prog_AWK=gawk
165ac_cv_prog_CC='/opt/local/var/macports/build/_opt_local_var_macports_sources_rsync.macports.org_release_tarballs_ports_lang_gcc49/libgcc/work/build/./gcc/xgcc -B/opt/local/var/macports/build/_opt_local_var_macports_sources_rsync.macports.org_release_tarballs_ports_lang_gcc49/libgcc/work/build/./gcc/ -B/opt/local/ppc-apple-darwin9/bin/ -B/opt/local/ppc-apple-darwin9/lib/ -isystem /opt/local/ppc-apple-darwin9/include -isystem /opt/local/ppc-apple-darwin9/sys-include   '
166ac_cv_prog_LIPO=lipo
167ac_cv_prog_NM=/opt/local/var/macports/build/_opt_local_var_macports_sources_rsync.macports.org_release_tarballs_ports_lang_gcc49/libgcc/work/build/./gcc/nm
168ac_cv_prog_RANLIB=/opt/local/bin/ranlib
169ac_cv_prog_STRIP=/opt/local/bin/strip
170
171## ----------------- ##
172## Output variables. ##
173## ----------------- ##
174
175AR='/opt/local/bin/ar'
176AWK='gawk'
177CC='/opt/local/var/macports/build/_opt_local_var_macports_sources_rsync.macports.org_release_tarballs_ports_lang_gcc49/libgcc/work/build/./gcc/xgcc -B/opt/local/var/macports/build/_opt_local_var_macports_sources_rsync.macports.org_release_tarballs_ports_lang_gcc49/libgcc/work/build/./gcc/ -B/opt/local/ppc-apple-darwin9/bin/ -B/opt/local/ppc-apple-darwin9/lib/ -isystem /opt/local/ppc-apple-darwin9/include -isystem /opt/local/ppc-apple-darwin9/sys-include   '
178CFLAGS='-g -O2 -pipe -Os'
179CPP='/usr/bin/gcc-4.2 -E'
180CPPFLAGS=''
181DEFS=''
182ECHO_C='\c'
183ECHO_N=''
184ECHO_T=''
185EXEEXT=''
186INSTALL_DATA='/usr/bin/install -c -m 644'
187INSTALL_PROGRAM='/usr/bin/install -c'
188INSTALL_SCRIPT='/usr/bin/install -c'
189LDFLAGS=''
190LIBOBJS=''
191LIBS=''
192LIPO='lipo'
193LN_S='ln -s'
194LTLIBOBJS=''
195MAINT='#'
196NM='/opt/local/var/macports/build/_opt_local_var_macports_sources_rsync.macports.org_release_tarballs_ports_lang_gcc49/libgcc/work/build/./gcc/nm'
197OBJEXT=''
198PACKAGE_BUGREPORT=''
199PACKAGE_NAME='GNU C Runtime Library'
200PACKAGE_STRING='GNU C Runtime Library 1.0'
201PACKAGE_TARNAME='libgcc'
202PACKAGE_URL='http://www.gnu.org/software/libgcc/'
203PACKAGE_VERSION='1.0'
204PATH_SEPARATOR=':'
205PICFLAG='-fno-common'
206RANLIB='/opt/local/bin/ranlib'
207SHELL='/bin/sh'
208STRIP='/opt/local/bin/strip'
209ac_ct_CC=''
210asm_hidden_op=''
211bindir='${exec_prefix}/bin'
212build='powerpc-apple-darwin9'
213build_alias='ppc-apple-darwin9'
214build_cpu='powerpc'
215build_libsubdir='build-ppc-apple-darwin9'
216build_os='darwin9'
217build_subdir='build-ppc-apple-darwin9'
218build_vendor='apple'
219cpu_type=''
220datadir='${datarootdir}'
221datarootdir='/opt/local/share/gcc-4.9'
222decimal_float=''
223docdir='${datarootdir}/doc/${PACKAGE_TARNAME}'
224double_type_size=''
225dvidir='${docdir}'
226enable_decimal_float=''
227enable_shared='yes'
228enable_vtable_verify='no'
229exec_prefix='NONE'
230extra_parts=''
231fixed_point=''
232host='powerpc-apple-darwin9'
233host_alias='ppc-apple-darwin9'
234host_cpu='powerpc'
235host_noncanonical='ppc-apple-darwin9'
236host_os='darwin9'
237host_subdir='.'
238host_vendor='apple'
239htmldir='${docdir}'
240includedir='/opt/local/include/gcc49'
241infodir='/opt/local/share/info'
242libdir='/opt/local/lib/libgcc'
243libexecdir='${exec_prefix}/libexec'
244libgcc_topdir='/opt/local/var/macports/build/_opt_local_var_macports_sources_rsync.macports.org_release_tarballs_ports_lang_gcc49/libgcc/work/gcc-4.9.2/libgcc/..'
245localedir='${datarootdir}/locale'
246localstatedir='${prefix}/var'
247long_double_type_size=''
248mandir='/opt/local/share/man'
249oldincludedir='/usr/include'
250pdfdir='${docdir}'
251prefix='/opt/local'
252program_transform_name='s&$&-mp-4.9&'
253psdir='${docdir}'
254sbindir='${exec_prefix}/sbin'
255set_have_cc_tls=''
256set_use_emutls=''
257sfp_machine_header=''
258sharedstatedir='${prefix}/com'
259slibdir='$(libdir)'
260sysconfdir='${prefix}/etc'
261target_alias='ppc-apple-darwin9'
262target_noncanonical='ppc-apple-darwin9'
263target_subdir='ppc-apple-darwin9'
264thread_header=''
265tm_defines=''
266tm_file=''
267tmake_file=''
268toolexecdir='$(libdir)/gcc-lib/$(target_noncanonical)'
269toolexeclibdir='$(libdir)'
270vis_hide=''
271
272## ----------- ##
273## confdefs.h. ##
274## ----------- ##
275
276/* confdefs.h */
277#define PACKAGE_NAME "GNU C Runtime Library"
278#define PACKAGE_TARNAME "libgcc"
279#define PACKAGE_VERSION "1.0"
280#define PACKAGE_STRING "GNU C Runtime Library 1.0"
281#define PACKAGE_BUGREPORT ""
282#define PACKAGE_URL "http://www.gnu.org/software/libgcc/"
283
284configure: exit 1